{"text_format":"3","workbook":"xlsx","n_sheets":12,"sheets":["Main","Future Intra","Cash Intra","MidCap Intra","Bulk Deals","Call Tracker (Equity & F&O)","Sheet1","Sheet3","Sheet4","Sheet5","Call Tracker (Currency)","Sheet2"],"not_rendered":{"images":4,"defined_names":4},"read":"whole","date_system":"1900"}

{"sheet":"Main","index":0,"n_rows":17,"n_cols":4,"rows_kept":17}
[null,"                                                                                                 "]
{"$rows_empty":8}
[null,"2018-03-07"]
[]
[null,"Sheet No.","Template Name","Summary"]
[null,1,"Future Intra","For Intraday trading in F&O segment"]
[null,2,"Cash Intra","For Intraday trading in cash market segment"]
[null,3,"Mid-cap Intra","For Intraday trading in Mid-cap stocks"]
[null,4,"Bulk Deals","Reveals Bulk Deals carried on NSE & BSE"]
[null,5,"Call Tracker"]

{"sheet":"Future Intra","index":1,"n_rows":252,"n_cols":15,"rows_kept":252,"merged":[[8,0,9,0],[8,1,9,1],[8,2,9,2],[8,5,8,7],[8,8,8,10]]}
[]
[]
[]
[]
[{"$nulls":12},"Back to Main Page"]
["FOR INTRA DAY TRADING",{"$nulls":10},{"$f":"Main!B10","v":"2018-03-07"}]
[]
[]
["Sr.no","Sector","Scrip","CLOSE RATE","Pivot Point","Supports",null,null,"Resistances"]
[null,"Sector",null,"Point","Point","S1","S2","S3","R1","R2","R3","HIGH","LOW","OI","% Change in OI"]
[1,"Index","BANKNIFTY",24504.15,24667.05,{"v":24249.1,"d":"24249.10"},23994.05,{"v":23576.1,"d":"23576.10"},{"v":24922.1,"d":"24922.10"},{"v":25340.050000000003,"d":"25340.05"},{"v":25595.1,"d":"25595.10"},25085,24412,1962080,{"v":0.0760321151230641,"d":"7.60%"}]
[2,"Index","NIFTY",10248.55,10302.85,{"v":10168.7,"d":"10168.70"},10088.85,{"v":9954.7,"d":"9954.70"},{"v":10382.7,"d":"10382.70"},{"v":10516.849999999999,"d":"10516.85"},{"v":10596.7,"d":"10596.70"},10437,10223,26153550,{"v":0.054485086000435445,"d":"5.45%"}]
[3,"Index","NIFTYCPSE",{"v":2729.2,"d":"2729.20"},{"v":909.7333333333332,"d":"909.73"},{"v":1819.4666666666665,"d":"1819.47"},{"v":909.7333333333332,"d":"909.73"},{"v":1819.4666666666665,"d":"1819.47"},{"v":1819.4666666666665,"d":"1819.47"},{"v":909.7333333333332,"d":"909.73"},{"v":1819.4666666666665,"d":"1819.47"},0,0,0,{"v":0,"d":"0.00%"}]
[4,"Index","NIFTYINFRA",{"v":3662.6,"d":"3662.60"},{"v":1220.8666666666666,"d":"1220.87"},{"v":2441.733333333333,"d":"2441.73"},{"v":1220.8666666666666,"d":"1220.87"},{"v":2441.733333333333,"d":"2441.73"},{"v":2441.733333333333,"d":"2441.73"},{"v":1220.8666666666666,"d":"1220.87"},{"v":2441.733333333333,"d":"2441.73"},0,0,0,{"v":0,"d":"0.00%"}]
[5,"Index","NIFTYIT",{"v":12714,"d":"12714.00"},{"v":12777.666666666666,"d":"12777.67"},{"v":12598.333333333332,"d":"12598.33"},{"v":12482.666666666666,"d":"12482.67"},{"v":12303.333333333332,"d":"12303.33"},{"v":12893.333333333332,"d":"12893.33"},{"v":13072.666666666664,"d":"13072.67"},{"v":13188.333333333332,"d":"13188.33"},12957,12662,41000,{"v":0.008610086100861008,"d":"0.86%"}]
[6,"Index","NIFTYMID50",{"v":5588,"d":"5588.00"},{"v":1862.6666666666667,"d":"1862.67"},{"v":3725.3333333333335,"d":"3725.33"},{"v":1862.6666666666667,"d":"1862.67"},{"v":3725.3333333333335,"d":"3725.33"},{"v":3725.3333333333335,"d":"3725.33"},{"v":1862.6666666666667,"d":"1862.67"},{"v":3725.3333333333335,"d":"3725.33"},0,0,513600,{"v":0,"d":"0.00%"}]
[7,"Index","NIFTYPSE",{"v":4378.2,"d":"4378.20"},{"v":1459.3999999999999,"d":"1459.40"},{"v":2918.7999999999997,"d":"2918.80"},{"v":1459.3999999999999,"d":"1459.40"},{"v":2918.7999999999997,"d":"2918.80"},{"v":2918.7999999999997,"d":"2918.80"},{"v":1459.3999999999999,"d":"1459.40"},{"v":2918.7999999999997,"d":"2918.80"},0,0,0,{"v":0,"d":"0.00%"}]
[8,"Cement","ACC",{"v":1589.7,"d":"1589.70"},{"v":1597.5999999999997,"d":"1597.60"},{"v":1577.1999999999994,"d":"1577.20"},{"v":1564.6999999999996,"d":"1564.70"},{"v":1544.2999999999993,"d":"1544.30"},{"v":1610.0999999999995,"d":"1610.10"},{"v":1630.4999999999995,"d":"1630.50"},{"v":1642.9999999999995,"d":"1643.00"},1618,1585.1,1346000,{"v":0.008390770152831885,"d":"0.84%"}]
[9,"Others","ADANIENT",{"v":186.9,"d":"186.90"},{"v":188.73333333333335,"d":"188.73"},{"v":173.4666666666667,"d":"173.47"},{"v":160.03333333333336,"d":"160.03"},{"v":144.7666666666667,"d":"144.77"},{"v":202.16666666666669,"d":"202.17"},{"v":217.43333333333334,"d":"217.43"},{"v":230.86666666666667,"d":"230.87"},204,175.3,17004000,{"v":0.052227722772277226,"d":"5.22%"}]
[10,"Others","ADANIPORTS",401.75,{"v":403.98333333333335,"d":"403.98"},{"v":393.4666666666667,"d":"393.47"},{"v":385.18333333333334,"d":"385.18"},{"v":374.6666666666667,"d":"374.67"},{"v":412.2666666666667,"d":"412.27"},{"v":422.78333333333336,"d":"422.78"},{"v":431.0666666666667,"d":"431.07"},414.5,395.7,12120000,{"v":0.004766839378238342,"d":"0.48%"}]
{"$rows_left_out":226}
{"sheet":"Cash Intra","index":2,"n_rows":251,"n_cols":13,"rows_kept":251,"merged":[[7,0,8,0],[7,1,8,1],[7,2,8,2],[7,3,8,3],[7,4,7,6],[7,7,7,9]]}
[]
[]
[]
[]
[{"$nulls":12},"Back to Main Page"]
["FOR INTRA DAY TRADING",{"$nulls":9},{"$f":"Main!B10","v":"2018-03-07"}]
[]
["Sr.no","Scrip","CLOSE RATE","Pivot Point","Supports",null,null,"Resistances"]
[null,null,"Point",null,"S1","S2","S3","R1","R2","R3","HIGH","LOW","Total Trade Quanity in Lakhs"]
[1,"Nifty 50",10249.25,{"v":10302.166666666666,"d":"10302.17"},{"v":10162.983333333332,"d":"10162.98"},{"v":10076.716666666665,"d":"10076.72"},{"v":9937.533333333331,"d":"9937.53"},{"v":10388.433333333332,"d":"10388.43"},{"v":10527.616666666667,"d":"10527.62"},{"v":10613.883333333333,"d":"10613.88"},10441.35,10215.9]
[2,"Nifty Bank",24448.45,{"v":24616.916666666668,"d":"24616.92"},{"v":24193.583333333336,"d":"24193.58"},{"v":23938.716666666667,"d":"23938.72"},{"v":23515.383333333335,"d":"23515.38"},{"v":24871.783333333336,"d":"24871.78"},{"v":25295.116666666672,"d":"25295.12"},{"v":25549.983333333337,"d":"25549.98"},25040.25,24362.05]
[3,"Nifty CPSE",2561.3,{"v":2568.9666666666667,"d":"2568.97"},{"v":2547.2833333333333,"d":"2547.28"},{"v":2533.2666666666664,"d":"2533.27"},{"v":2511.583333333333,"d":"2511.58"},{"v":2582.9833333333336,"d":"2582.98"},{"v":2604.666666666667,"d":"2604.67"},{"v":2618.683333333334,"d":"2618.68"},2590.65,2554.95]
[4,"Nifty Infra",3363.7,{"v":3381.4,"d":"3381.40"},3328.55,{"v":3293.4,"d":"3293.40"},3240.55,3416.55,{"v":3469.3999999999996,"d":"3469.40"},3504.55,3434.25,3346.25]
[5,"Nifty IT",12706.1,{"v":12768.033333333335,"d":"12768.03"},{"v":12605.51666666667,"d":"12605.52"},{"v":12504.933333333336,"d":"12504.93"},{"v":12342.416666666672,"d":"12342.42"},{"v":12868.616666666669,"d":"12868.62"},{"v":13031.133333333335,"d":"13031.13"},{"v":13131.716666666667,"d":"13131.72"},12930.55,12667.45]
[6,"Nifty PSE",3984.75,{"v":3999.433333333333,"d":"3999.43"},{"v":3959.216666666666,"d":"3959.22"},{"v":3933.683333333333,"d":"3933.68"},{"v":3893.466666666666,"d":"3893.47"},{"v":4024.966666666666,"d":"4024.97"},{"v":4065.183333333333,"d":"4065.18"},{"v":4090.716666666666,"d":"4090.72"},4039.65,3973.9]
[7,"Nifty Midcap 50",5046.05,5078.25,4994.05,4942.05,4857.85,5130.25,{"v":5214.450000000001,"d":"5214.45"},5266.45,5162.45,5026.25]
[8,"ABB",1475.45,{"v":1483.4833333333333,"d":"1483.48"},{"v":1442.9666666666667,"d":"1442.97"},{"v":1410.4833333333333,"d":"1410.48"},{"v":1369.9666666666667,"d":"1369.97"},{"v":1515.9666666666667,"d":"1515.97"},{"v":1556.4833333333336,"d":"1556.48"},{"v":1588.9666666666667,"d":"1588.97"},1524,1451,0.72789]
[9,"ACC",1595.3,{"v":1601.1000000000001,"d":"1601.10"},{"v":1585.2000000000003,"d":"1585.20"},{"v":1575.1000000000001,"d":"1575.10"},{"v":1559.2000000000003,"d":"1559.20"},{"v":1611.2000000000003,"d":"1611.20"},{"v":1627.1000000000004,"d":"1627.10"},{"v":1637.2000000000003,"d":"1637.20"},1617,1591,2.38297]
[10,"AIAENG",1401.95,{"v":1411.7,"d":"1411.70"},1370.45,1338.95,{"v":1297.7,"d":"1297.70"},{"v":1443.2,"d":"1443.20"},1484.45,1515.95,1452.95,1380.2,0.0818]
[11,"AUBANK",583.55,{"v":583.0666666666667,"d":"583.07"},{"v":573.1833333333334,"d":"573.18"},{"v":562.8166666666667,"d":"562.82"},{"v":552.9333333333334,"d":"552.93"},{"v":593.4333333333334,"d":"593.43"},{"v":603.3166666666668,"d":"603.32"},{"v":613.6833333333334,"d":"613.68"},592.95,572.7,0.64457]
{"$rows_left_out":225}
{"sheet":"MidCap Intra","index":3,"n_rows":512,"n_cols":13,"rows_kept":512,"merged":[[0,0,0,1],[8,0,9,0],[8,1,9,1],[8,2,9,2],[8,3,9,3],[8,4,8,6],[8,7,8,9]]}
[]
[]
[]
[]
[{"$nulls":11},"Back To Main Page"]
["FOR INTRA DAY TRADING",{"$nulls":9},{"$f":"Main!B10","v":"2018-03-07"}]
[null,null," "]
[]
["Sr.no","Scrip","CLOSE RATE","Pivot Point","Supports",null,null,"Resistances"]
[null,null,"Point",null,"S1","S2","S3","R1","R2","R3","HIGH","LOW","Total Trade Quanity in Lakhs"]
[1,"3MINDIA",20747.9,{"v":20816.266666666666,"d":"20816.27"},{"v":20532.88333333333,"d":"20532.88"},{"v":20317.866666666665,"d":"20317.87"},{"v":20034.48333333333,"d":"20034.48"},{"v":21031.283333333333,"d":"21031.28"},{"v":21314.66666666667,"d":"21314.67"},{"v":21529.683333333334,"d":"21529.68"},21099.65,20601.25,0.02669]
[2,"8KMILES",710.5,{"v":717.5166666666668,"d":"717.52"},{"v":696.0333333333335,"d":"696.03"},{"v":681.5666666666667,"d":"681.57"},{"v":660.0833333333335,"d":"660.08"},{"v":731.9833333333336,"d":"731.98"},{"v":753.4666666666669,"d":"753.47"},{"v":767.9333333333336,"d":"767.93"},739,703.05,1.58089]
[3,"ABB",1475.45,{"v":1483.4833333333333,"d":"1483.48"},{"v":1442.9666666666667,"d":"1442.97"},{"v":1410.4833333333333,"d":"1410.48"},{"v":1369.9666666666667,"d":"1369.97"},{"v":1515.9666666666667,"d":"1515.97"},{"v":1556.4833333333336,"d":"1556.48"},{"v":1588.9666666666667,"d":"1588.97"},1524,1451,0.72789]
[4,"ACC",1595.3,{"v":1601.1000000000001,"d":"1601.10"},{"v":1585.2000000000003,"d":"1585.20"},{"v":1575.1000000000001,"d":"1575.10"},{"v":1559.2000000000003,"d":"1559.20"},{"v":1611.2000000000003,"d":"1611.20"},{"v":1627.1000000000004,"d":"1627.10"},{"v":1637.2000000000003,"d":"1637.20"},1617,1591,2.38297]
[5,"AIAENG",1401.95,{"v":1411.7,"d":"1411.70"},1370.45,1338.95,{"v":1297.7,"d":"1297.70"},{"v":1443.2,"d":"1443.20"},1484.45,1515.95,1452.95,1380.2,0.0818]
[6,"APLAPOLLO",2003.9,{"v":2024.5166666666667,"d":"2024.52"},{"v":1979.3833333333332,"d":"1979.38"},{"v":1954.8666666666666,"d":"1954.87"},{"v":1909.7333333333331,"d":"1909.73"},{"v":2049.0333333333333,"d":"2049.03"},{"v":2094.166666666667,"d":"2094.17"},{"v":2118.6833333333334,"d":"2118.68"},2069.65,2000,0.65539]
[7,"AUBANK",583.55,{"v":583.0666666666667,"d":"583.07"},{"v":573.1833333333334,"d":"573.18"},{"v":562.8166666666667,"d":"562.82"},{"v":552.9333333333334,"d":"552.93"},{"v":593.4333333333334,"d":"593.43"},{"v":603.3166666666668,"d":"603.32"},{"v":613.6833333333334,"d":"613.68"},592.95,572.7,0.64457]
[8,"AARTIIND",1159.55,{"v":1161,"d":"1161.00"},1151.55,1143.55,{"v":1134.1,"d":"1134.10"},{"v":1169,"d":"1169.00"},{"v":1178.4499999999998,"d":"1178.45"},1186.45,1170.45,1153,0.11447]
[9,"ABAN",164.45,{"v":166.45000000000002,"d":"166.45"},{"v":161.50000000000003,"d":"161.50"},158.55,{"v":153.60000000000002,"d":"153.60"},{"v":169.40000000000003,"d":"169.40"},{"v":174.35000000000002,"d":"174.35"},{"v":177.30000000000004,"d":"177.30"},171.4,163.5,6.26726]
[10,"ADANIENT",186.2,{"v":189.88333333333333,"d":"189.88"},{"v":176.41666666666666,"d":"176.42"},{"v":166.63333333333333,"d":"166.63"},{"v":153.16666666666666,"d":"153.17"},{"v":199.66666666666666,"d":"199.67"},{"v":213.13333333333335,"d":"213.13"},{"v":222.91666666666666,"d":"222.92"},203.35,180.1,80.63223]
{"$rows_left_out":493}
{"sheet":"Bulk Deals","index":4,"n_rows":101,"n_cols":8,"rows_kept":101,"merged":[[4,0,4,1],[4,2,4,3],[6,1,6,2]]}
[" "]
[]
[]
[]
[]
[{"$nulls":4},"Back To Main Page"]
["Subject :","BULK DEAL",null,{"$f":"Main!B10","v":"2018-03-07"}]
[]
["Date","Scrip code","Scrip Name","Client Name","Buy / Sell","Quantity Traded","Trade Price / Wt.Avg.trade price","Exchange  "]
["2018-03-06",541006,"ANGEL","IDEAL MOTOR FINANCE PRIVATE LIMITED","BUY",{"v":176000,"d":"176,000"},28.05,"BSE"]
["2018-03-06",541006,"ANGEL","GLOBE STOCKS & SECURITIES LTD","BUY",{"v":152000,"d":"152,000"},28.5,"BSE"]
["2018-03-06",541006,"ANGEL","NARMADABEN HASMUKH PANSURIYA","BUY",{"v":328000,"d":"328,000"},27.19,"BSE"]
["2018-03-06",541006,"ANGEL","DAXA MAHESHBHAI PANSURIYA","BUY",{"v":276000,"d":"276,000"},27.12,"BSE"]
["2018-03-06",541006,"ANGEL","NNM SECURITIES PVT LTD","BUY",{"v":300000,"d":"300,000"},27.1,"BSE"]
["2018-03-06",541006,"ANGEL","JACKPOT VINTRADE PRIVATE LIMITED","BUY",{"v":248000,"d":"248,000"},27.1,"BSE"]
["2018-03-06",541006,"ANGEL","SANJEEV HARBANSLAL BHATIA","BUY",{"v":500000,"d":"500,000"},28.5,"BSE"]
["2018-03-06",530723,"ASITCFIN","KETAN JAYANTILAL KARANI","SELL",{"v":35000,"d":"35,000"},84.74,"BSE"]
["2018-03-06",530723,"ASITCFIN","LUO SHIXIN","BUY",{"v":30000,"d":"30,000"},84.55,"BSE"]
["2018-03-06",540006,"BULL","JAYKUMAR GURDASMAL DADLANI","BUY",{"v":40000,"d":"40,000"},80.1,"BSE"]
["2018-03-06",526546,"CHOKSILA","SHARAD KANAYALAL SHAH","SELL",{"v":59302,"d":"59,302"},28.45,"BSE"]
{"$rows_left_out":82}
{"sheet":"Call Tracker (Equity & F&O)","index":5,"n_rows":214,"n_cols":19,"rows_kept":214,"merged":[[8,9,8,10],[9,9,9,10],[10,9,10,10],[11,9,11,10],[12,9,12,10],[13,9,13,10],[14,9,14,10],[15,9,15,10],[16,9,16,10],[17,9,17,10],[18,9,18,10],[19,9,19,10],[20,9,20,10],[21,9,21,10],[22,9,22,10],[26,9,26,10],[31,9,31,10],[32,9,32,10],[33,9,33,10],[37,9,37,10],[42,9,42,10],[43,9,43,10],[44,9,44,10],[45,9,45,10],[46,9,46,10],[47,9,47,10],[51,9,51,10],[57,9,57,10],[58,9,58,10],[65,9,65,10],[66,9,66,10],[67,9,67,10],[68,9,68,10],[69,9,69,10],[76,9,76,10],[77,9,77,10],[78,9,78,10],[79,9,79,10],[80,9,80,10],[81,9,81,10],[82,9,82,10],[83,9,83,10],[85,9,85,10],[86,9,86,10],[87,9,87,10],[88,9,88,10],[89,9,89,10],[90,9,90,10],[91,9,91,10],[92,9,92,10],[93,9,93,10],[94,9,94,10],[95,9,95,10],[96,9,96,10],[97,9,97,10],[98,9,98,10],[99,9,99,10],[100,9,100,10],[101,9,101,10],[102,9,102,10],[103,9,103,10],[104,9,104,10],[105,9,105,10],[106,9,106,10],[107,9,107,10],[108,9,108,10],[109,9,109,10],[110,9,110,10],[111,9,111,10],[112,9,112,10],[113,9,113,10],[114,9,114,10],[115,9,115,10],[116,9,116,10],[117,9,117,10],[118,9,118,10],[119,9,119,10],[120,9,120,10],[121,9,121,10],[122,9,122,10],[123,9,123,10],[124,9,124,10],[125,9,125,10],[126,9,126,10],[127,9,127,10],[128,9,128,10],[129,9,129,10],[130,9,130,10],[131,9,131,10],[132,9,132,10],[133,9,133,10],[134,9,134,10],[135,9,135,10],[136,9,136,10],[137,9,137,10],[138,9,138,10],[139,9,139,10],[140,9,140,10],[141,9,141,10],[142,9,142,10],[143,9,143,10],[144,9,144,10],[145,9,145,10],[146,9,146,10],[147,9,147,10],[148,9,148,10],[149,9,149,10],[150,9,150,10],[151,9,151,10],[153,9,153,10],[154,9,154,10],[155,9,155,10],[156,9,156,10],[157,9,157,10],[158,9,158,10],[159,9,159,10],[160,9,160,10],[161,9,161,10],[162,9,162,10],[163,9,163,10],[164,9,164,10],[165,9,165,10],[166,9,166,10],[167,9,167,10],[168,9,168,10],[169,9,169,10],[170,9,170,10],[171,9,171,10],[172,9,172,10],[173,9,173,10],[174,9,174,10],[175,9,175,10],[176,9,176,10],[177,9,177,10],[178,9,178,10],[179,9,179,10],[180,9,180,10],[181,9,181,10],[182,9,182,10],[183,9,183,10],[184,9,184,10],[185,9,185,10],[186,9,186,10],[187,9,187,10],[188,9,188,10],[189,9,189,10],[190,9,190,10],[191,9,191,10],[192,9,192,10],[193,9,193,10],[194,9,194,10],[195,9,195,10],[196,9,196,10],[197,9,197,10],[198,9,198,10],[199,9,199,10],[200,9,200,10],[201,10,201,11]]}
[]
[]
[]
[]
[{"$nulls":13},"Back To Main Page"]
["Retail Research Technical Calls & Fundamental Performance Report for the month of March -2018 "]
[{"$nulls":13},{"$f":"Main!B10","v":"2018-03-07"}]
[null,"Positional  Call"]
["Sr.no","Date",null,"Company","Rec","Rec Price","Stop Loss***","Call Closed At","Target","Remark",null,"Profit / Loss per Share","Gain / Loss  %","Status","Closed Date","NSE Closed Price"]
[1,"2018-02-05",null,"UPL","Buy","710-718",684,null,"770-800","Open",{"$nulls":5},{"$f":"VLOOKUP(D10,Sheet2!$A$1:M2107,6,0)","v":702.4},null,null,"H"]
[2,"2018-02-09",null,"HINDUNILVR","Buy","1330-1334",1275,null,1450,"Open",{"$nulls":5},{"$f":"VLOOKUP(D11,Sheet2!$A$1:M2108,6,0)","v":1293.2},null,null,"A"]
[3,"2018-02-12",null,"ITC","Buy","271-272",250,null,310,"Open",{"$nulls":5},{"$f":"VLOOKUP(D12,Sheet2!$A$1:M2109,6,0)","v":256.5},null,null,"P"]
[4,"2018-02-12",null,"WIPRO","Buy",287,272,295.5,"310-315","Part profit of Rs.8.5/-",null,{"$f":"H13-F13-K13","v":8.5},{"$f":"L13/F13","v":{"v":0.029616724738675958,"d":"2.96%"}},"Successful","2018-02-23",{"$f":"VLOOKUP(D13,Sheet2!$A$1:M2110,6,0)","v":286.95},null,null,"R"]
[5,"2018-02-14",null,"COLPAL","Buy",1097.5,1050,1041,1200,"Loss of Rs.56.5/-",null,-56.5,{"v":-0.05148063781321185,"d":"-5.15%"},"Unsuccessful","2018-03-06",{"$f":"VLOOKUP(D14,Sheet2!$A$1:M2111,6,0)","v":1038.45},null,null,"R"]
[6,"2018-02-14",null,"GLENMARK","Buy",533.5,510,550,580,"Profit of Rs.16.5/-",null,{"$f":"H15-F15-K15","v":16.5},{"$f":"L15/F15","v":{"v":0.030927835051546393,"d":"3.09%"}},"Successful","2018-03-01",{"$f":"VLOOKUP(D15,Sheet2!$A$1:M2112,6,0)","v":560.8},null,null,"R"]
[7,"2018-02-15",null,"CADILAHC","Buy",415,394,392,"450-460","Loss of Rs.23/-",null,-23,{"v":-0.05542168674698795,"d":"-5.54%"},"Unsuccessful","2018-03-06",{"$f":"VLOOKUP(D16,Sheet2!$A$1:M2113,6,0)","v":389.6},null,null,"H"]
[8,"2018-02-20",null,"ALLCARGO","Buy",176.5,167,182.75,195,"Profit of Rs.6.25/-",null,{"$f":"H17-F17-K17","v":6.25},{"$f":"L17/F17","v":{"v":0.03541076487252125,"d":"3.54%"}},"Successful","2018-03-01",{"$f":"VLOOKUP(D17,Sheet2!$A$1:M2114,6,0)","v":170.4},null,null,"R"]
[9,"2018-02-22",null,"SBIN","Buy",270.5,257,270,"295-300","Loss of Rs.0.5/-",null,{"$f":"H18-F18-K18","v":-0.5},{"$f":"L18/F18","v":{"v":-1.8484288354898336E-3,"d":"-0.18%"}},"Unsuccessful","2018-03-05",{"$f":"VLOOKUP(D18,Sheet2!$A$1:M2115,6,0)","v":256.55},null,null,"H"]
[10,"2018-02-26",null,"DALMIABHA","Buy",2693,2600,2775,2900,"Profit of Rs.82/-",null,82,{"v":0.030449313033791312,"d":"3.04%"},"Successful","2018-03-01",{"$f":"VLOOKUP(D19,Sheet2!$A$1:M2116,6,0)","v":2669.15},null,null,"R"]
[11,"2018-02-28",null,"SUNPHARMA","Buy",544,515,561,600,"Profit of Rs.17/-",null,{"$f":"H20-F20-K20","v":17},{"$f":"L20/F20","v":{"v":0.03125,"d":"3.13%"}},"Successful","2018-03-06",{"$f":"VLOOKUP(D20,Sheet2!$A$1:M2117,6,0)","v":531.75},null,null,"R"]
{"$rows_left_out":189}
{"sheet":"Sheet1","index":6,"n_rows":0,"n_cols":0,"rows_kept":0,"hidden":true}

{"sheet":"Sheet3","index":7,"n_rows":0,"n_cols":0,"rows_kept":0,"hidden":true}

{"sheet":"Sheet4","index":8,"n_rows":0,"n_cols":0,"rows_kept":0,"hidden":true}

{"sheet":"Sheet5","index":9,"n_rows":0,"n_cols":0,"rows_kept":0,"hidden":true}

{"sheet":"Call Tracker (Currency)","index":10,"n_rows":58,"n_cols":18,"rows_kept":58,"hidden":true,"merged":[[1,8,1,9],[2,8,2,9],[3,8,3,9],[4,8,4,9],[5,8,5,9],[6,8,6,9],[7,8,7,9],[8,8,8,9],[9,8,9,9],[10,8,10,9],[11,8,11,9],[12,8,12,9],[13,8,13,9],[14,8,14,9],[15,8,15,9],[16,8,16,9],[17,8,17,9],[18,8,18,9],[19,8,19,9],[20,8,20,9],[21,8,21,9],[22,8,22,9],[23,8,23,9],[24,8,24,9],[25,8,25,9],[26,8,26,9],[27,8,27,9],[28,8,28,9],[29,8,29,9],[30,8,30,9],[31,8,31,9],[32,8,32,9],[33,8,33,9],[34,8,34,9],[35,8,35,9],[36,8,36,9],[37,8,37,9],[38,8,38,9],[39,8,39,9],[40,8,40,9],[41,8,41,9],[42,8,42,9],[43,8,43,9],[44,8,44,9],[45,8,45,9],[46,8,46,9],[47,8,47,9],[48,8,48,9],[49,8,49,9],[50,8,50,9],[51,8,51,9],[52,8,52,9],[53,8,53,9],[54,8,54,9],[55,8,55,9],[56,8,56,9],[57,8,57,9],[58,8,58,9],[59,8,59,9],[60,8,60,9],[61,8,61,9],[62,8,62,9],[63,8,63,9],[64,8,64,9],[65,8,65,9],[66,8,66,9],[67,8,67,9],[68,8,68,9],[69,8,69,9],[70,8,70,9],[71,8,71,9],[72,8,72,9],[73,8,73,9],[74,8,74,9],[75,8,75,9],[76,8,76,9],[77,8,77,9],[78,8,78,9],[79,8,79,9],[80,8,80,9],[81,8,81,9],[82,8,82,9],[83,8,83,9],[84,8,84,9],[85,8,85,9],[86,8,86,9],[87,8,87,9],[88,8,88,9],[89,8,89,9],[90,8,90,9],[91,8,91,9],[92,8,92,9],[93,8,93,9],[94,8,94,9],[95,8,95,9],[96,8,96,9],[97,8,97,9],[98,8,98,9],[99,8,99,9],[100,8,100,9],[101,8,101,9],[102,8,102,9],[103,8,103,9],[104,8,104,9],[105,8,105,9],[106,8,106,9],[107,8,107,9],[108,8,108,9],[109,8,109,9],[110,8,110,9],[111,8,111,9],[112,8,112,9],[113,8,113,9],[114,8,114,9],[115,8,115,9],[116,8,116,9],[117,8,117,9],[118,8,118,9],[119,8,119,9],[120,8,120,9],[121,8,121,9],[122,8,122,9],[123,8,123,9],[124,8,124,9]]}
["Master Trade High Risk"]
["Sr.no","Date","Company","Rec","Rec Price","Stop Loss","Call Closed At","Target","Remark",null,"Profit / Loss per share","Gain / Loss  per Lot","Lot","Status","Closed Date"]
[1,"2017-05-08","USDINR MAY FUT","Buy",64.3935,64.29,64.66,64.59,"Profit of Rs.0.27/-",null,{"v":0.2664999999999935,"d":"0.27"},266.4999999999935,1000,"Successful","2017-05-09",null,null,"P"]
[2,"2017-05-08","USDINR JUN FUT","Buy",64.6535,64.45,64.965,65.05,"Profit of Rs 0.31/-",null,{"v":0.31150000000000944,"d":"0.31"},311.50000000000944,1000,"Successful","2017-05-09",null,null,"P"]
[3,"2017-05-09","EUROINR MAY FUT","Sell",70.65,70.8,70.07,70.4,"Profit of Rs 0.58/-",null,{"v":0.580000000000013,"d":"0.58"},580.00000000001,1000,"Successful","2017-05-12",null,null,"P"]
[4,"2017-05-09","GBPINR MAY FUT","Buy",83.774,83.37,83.37,84.77,"Loss of Rs 0.40/-",null,{"v":-0.40399999999999636,"d":"-0.40"},-403.99999999999636,1000,"Unsuccessful","2017-05-11",null,null,"P"]
[5,"2017-05-11","USDINR MAY FUT","Buy",64.6555,64.55,64.55,64.86,"Loss of Rs.0.1055/-",null,-0.10550000000000637,{"$f":"K7*M7","v":{"v":-105.50000000000637,"d":"-105.50"}},1000,"Unsuccessful","2017-05-11",null,null,"P"]
[6,"2017-05-15","USDINR MAY FUT","Buy",64.2275,64.08,64.46,64.48,"Profit of Rs 0.23/-",null,{"v":0.2324999999999875,"d":"0.23"},232.4999999999875,1000,"Successful","2017-05-18",null,null,"P"]
[7,"2017-05-19","USDINR MAY FUT","Sell",64.83,65,65,64.5,"Loss of Rs.0.17/-",null,{"v":-0.1700000000000017,"d":"-0.17"},-170.0000000000017,1000,"Unsuccessful","2017-05-19",null,null,"P"]
[8,"2017-05-23","USDINR MAY FUT","Buy",64.83,64.62,64.95,65.2,"Profit of Rs 0.12/-",null,{"v":0.12000000000000455,"d":"0.12"},120.00000000000455,1000,"Successful","2017-05-24",null,null,"P"]
[9,"2017-05-25","USDINR MAY FUT","Buy",64.57,64.25,64.56,65,"Loss of Rs.0.01/-",null,-0.009999999999990905,-9.999999999990905,1000,"Neutral","2017-05-29",null,null,"P"]
[10,"2017-05-30","USDINR JUN FUT","Buy",64.9125,64.71,64.71,65.31,"Loss of Rs.0.20/-",null,{"v":-0.20250000000000057,"d":"-0.20"},-202.50000000000057,1000,"Unsuccessful","2017-05-31",null,null,"P"]
[11,"2017-06-01","USDINR JUN FUT","Buy",64.655,64.45,64.45,65.05,"Loss of Rs.0.20/-",null,{"$f":"G13-E13","v":{"v":-0.2049999999999983,"d":"-0.20"}},{"$f":"K13*M13","v":-204.9999999999983},{"v":1000,"d":"1000.00"},"Unsuccessful","2017-06-08",null,null,"P"]
[12,"2017-06-12","USDINR JUN FUT","Buy",64.45,64,64.7625,65.2,"Profit of Rs 0.31/-",null,{"v":0.3125,"d":"0.31"},312.5,1000,"Successful","2017-06-16"]
[13,"2017-06-16","USDINR JUN FUT","Buy",64.51,64.2,64.7,65.11,"Profit of Rs 0.19/-",null,{"v":0.18999999999999773,"d":"0.19"},189.99999999999773,1000,"Successful","2017-06-21"]
[14,"2017-06-22","USDINR JUN FUT","Buy",64.56,64.2,64.2,65.1,"Loss of Rs.0.36/-",null,{"v":-0.35999999999999943,"d":"-0.36"},-359.99999999999943,{"v":1000,"d":"1000.00"},"Unsuccessful","2017-06-30"]
[15,"2017-07-10","USDINR JUL FUT","Buy",64.67,64.4,64.4,65.15,"Loss of Rs.0.27/-",null,{"v":-0.269999999999996,"d":"-0.27"},-269.999999999996,{"v":1000,"d":"1000.00"},"Unsuccessful","2017-07-31"]
[16,"2017-08-02","USDINR AUG FUT","Buy",64.235,63.98,63.98,64.75,"Loss of Rs.0.26/-",null,{"v":-0.25500000000000256,"d":"-0.26"},-255.00000000000256,{"v":1000,"d":"1000.00"},"Unsuccessful","2017-08-02"]
[17,"2017-08-08","USDINR AUG FUT","Buy",63.9425,63.6,64.15,64.5,"Profit of Rs 0.21/-",null,{"v":0.20750000000000313,"d":"0.21"},207.50000000000313,1000,"Successful","2017-08-10"]
[18,"2017-08-22","USDINR AUG FUT","Buy",64.1175,63.9,64.01,64.5,"Loss of Rs.0.11/-",null,{"$f":"G20-E20","v":{"v":-0.1075000000000017,"d":"-0.11"}},{"$f":"K20*M20","v":-107.5000000000017},{"v":1000,"d":"1000.00"},"Unsuccessful","2017-08-29"]
{"$rows_left_out":39}
{"sheet":"Sheet2","index":11,"n_rows":1521,"n_cols":13,"rows_kept":1521,"hidden":true}
["SYMBOL","SERIES","OPEN","HIGH","LOW","CLOSE","LAST","PREVCLOSE","TOTTRDQTY","TOTTRDVAL","TIMESTAMP","TOTALTRADES","ISIN"]
["20MICRONS","EQ",49,49.95,47.05,47.2,47.35,48.7,81163,3929972.4,"2018-03-06",798,"INE144J01027"]
["3IINFOTECH","EQ",5.8,5.9,5.5,5.6,5.5,5.7,3263004,18785841.65,"2018-03-06",1207,"INE748C01020"]
["3MINDIA","EQ",20889,21099.65,20601.25,20747.9,20735,20832.6,2669,55465805.05,"2018-03-06",1037,"INE470A01017"]
["63MOONS","EQ",92.6,93,88.1,89.3,88.4,91.2,153311,13937710.4,"2018-03-06",1774,"INE111B01023"]
["8KMILES","EQ",722.5,739,703.05,710.5,704,718.25,158089,114282827.6,"2018-03-06",7001,"INE650K01021"]
["A2ZINFRA","EQ",34.15,34.45,32.5,32.75,32.55,33.95,424597,14155327.15,"2018-03-06",1868,"INE619I01012"]
["AARTIDRUGS","EQ",594,598.75,582.25,587.2,587.5,589.7,3664,2168382.35,"2018-03-06",285,"INE767A01016"]
["AARTIIND","EQ",1155.55,1170.45,1153,1159.55,1166,1161.85,11447,13345409.65,"2018-03-06",961,"INE769A01020"]
["AARVEEDEN","EQ",49,49,46.9,47.15,47,47.85,30736,1471472.6,"2018-03-06",299,"INE273D01019"]
["ABAN","EQ",169,171.4,163.5,164.45,164.3,166.75,626726,105115678.15,"2018-03-06",8507,"INE421A01028"]
["ABB","EQ",1500,1524,1451,1475.45,1460,1490.5,72789,107414908.75,"2018-03-06",4465,"INE117A01022"]
["ABBOTINDIA","EQ",5717,5769.95,5677,5712.1,5727,5737.2,54038,308593186.4,"2018-03-06",1026,"INE358A01014"]
["ABCAPITAL","EQ",162,162.65,157.75,158.15,157.95,160.85,2083839,333735795.55,"2018-03-06",20865,"INE674K01013"]
["ABFRL","EQ",146.75,151.45,143,143.8,143.5,145.2,911776,134586794.1,"2018-03-06",10584,"INE647O01011"]
["ACC","EQ",1614.7,1617,1591,1595.3,1591,1606.15,238297,381739943.2,"2018-03-06",20066,"INE012A01025"]
["ACCELYA","EQ",1364,1374,1349,1352.7,1364.95,1372.5,3280,4475154.4,"2018-03-06",951,"INE793A01012"]
["ACE","EQ",182.65,184.7,170.45,173.25,173,180.95,571781,102163846.85,"2018-03-06",6185,"INE731H01025"]
["ADANIENT","EQ",202.5,203.35,180.1,186.2,183,200.9,8063223,1559409715.1,"2018-03-06",42162,"INE423A01024"]
["ADANIPORTS","EQ",406.7,413.75,395.15,405.25,395.6,403.95,3321338,1354890281.45,"2018-03-06",58381,"INE742F01042"]
{"$rows_left_out":1501}