{"text_format":"3","workbook":"xlsx","n_sheets":6,"sheets":["Main","Future Intra","Cash Intra","MidCap Intra","Bulk Deals","Call Tracker (Equity & F&O)"],"not_rendered":{"images":2,"defined_names":1},"read":"whole","date_system":"1900"}

{"sheet":"Main","index":0,"n_rows":27,"n_cols":11,"rows_kept":27}
[null,"                                                                                                 "]
{"$rows_empty":8}
[null,"2023-08-30"]
[]
[null,"Sheet No.","Template Name","Summary"]
[null,1,"Future Intra","For Intraday trading in F&O segment"]
[null,2,"Cash Intra","For Intraday trading in cash market segment"]
[null,3,"Mid-cap Intra","For Intraday trading in Mid-cap stocks"]
[null,4,"Bulk Deals","Reveals Bulk Deals carried on NSE & BSE"]
[null,5,"Call Tracker"]
{"$rows_empty":9}
[{"$nulls":10},"`"]

{"sheet":"Future Intra","index":1,"n_rows":236,"n_cols":16,"rows_kept":236,"merged":[[8,0,9,0],[8,1,9,1],[8,2,9,2],[8,3,9,3],[8,6,8,8],[8,9,8,11]]}
[]
[]
[]
[]
[{"$nulls":12},"Back to Main Page"]
["FOR INTRA DAY TRADING",{"$nulls":10},{"$f":"Main!B10","v":"2023-08-30"}]
[]
[]
["Sr.no","Sector","Scrip","Expiry Date","CLOSE RATE","Pivot Point","Supports",null,null,"Resistances"]
[{"$nulls":4},"Point","Point","S1","S2","S3","R1","R2","R3","HIGH","LOW","OI","% Change in OI"]
[1,"Index","NIFTY","2023-08-31",{"v":19337.1,"d":"19337.10"},{"v":19336.683333333334,"d":"19336.68"},{"v":19306.416666666668,"d":"19306.42"},{"v":19275.733333333334,"d":"19275.73"},{"v":19245.466666666667,"d":"19245.47"},{"v":19367.36666666667,"d":"19367.37"},{"v":19397.63333333333,"d":"19397.63"},{"v":19428.31666666667,"d":"19428.32"},19366.95,19306,13681800,{"v":1.4236203874150495E-3,"d":"0%"}]
[2,"Index","BANKNIFTY","2023-08-31",{"v":44500.5,"d":"44500.50"},{"v":44543.88333333333,"d":"44543.88"},{"v":44399.76666666666,"d":"44399.77"},{"v":44299.03333333333,"d":"44299.03"},{"v":44154.916666666664,"d":"44154.92"},{"v":44644.61666666666,"d":"44644.62"},{"v":44788.73333333333,"d":"44788.73"},{"v":44889.46666666666,"d":"44889.47"},44688,44443.15,2258910,{"v":-0.009152218968977202,"d":"-1%"}]
[3,"Index","FINNIFTY","2023-09-26",19896.65,{"v":19893.100000000002,"d":"19893.10"},{"v":19871.350000000006,"d":"19871.35"},{"v":19846.050000000003,"d":"19846.05"},{"v":19824.300000000007,"d":"19824.30"},{"v":19918.400000000005,"d":"19918.40"},{"v":19940.149999999998,"d":"19940.15"},{"v":19965.450000000004,"d":"19965.45"},19914.85,19867.8,109320,{"v":0.23665158371040723,"d":"24%"}]
[4,"Index","MIDCPNIFTY","2023-09-25",{"v":8828.4,"d":"8828.40"},{"v":8818.633333333333,"d":"8818.63"},{"v":8797.466666666667,"d":"8797.47"},{"v":8766.533333333335,"d":"8766.53"},{"v":8745.366666666669,"d":"8745.37"},{"v":8849.566666666666,"d":"8849.57"},{"v":8870.733333333334,"d":"8870.73"},{"v":8901.666666666664,"d":"8901.67"},8839.8,8787.7,73425,{"v":-0.3945578231292517,"d":"-39%"}]
[5,"Chemical","AARTIIND","2023-08-31",{"v":481.7,"d":"481.70"},{"v":476.06666666666666,"d":"476.07"},{"v":467.43333333333334,"d":"467.43"},{"v":453.1666666666667,"d":"453.17"},{"v":444.53333333333336,"d":"444.53"},{"v":490.3333333333333,"d":"490.33"},{"v":498.96666666666664,"d":"498.97"},{"v":513.2333333333333,"d":"513.23"},484.7,461.8,12552000,{"v":0.02859952470703925,"d":"3%"}]
[6,"Capital_Goods","ABB","2023-08-31",4322.45,{"v":4304.416666666666,"d":"4304.42"},{"v":4272.1833333333325,"d":"4272.18"},{"v":4221.916666666666,"d":"4221.92"},{"v":4189.6833333333325,"d":"4189.68"},{"v":4354.6833333333325,"d":"4354.68"},{"v":4386.916666666666,"d":"4386.92"},{"v":4437.1833333333325,"d":"4437.18"},4336.65,4254.15,1578500,{"v":-0.02062975027144408,"d":"-2%"}]
[7,"Pharma","ABBOTINDIA","2023-08-31",{"v":23375.2,"d":"23375.20"},{"v":23332.88333333333,"d":"23332.88"},{"v":23215.816666666662,"d":"23215.82"},{"v":23056.43333333333,"d":"23056.43"},{"v":22939.36666666666,"d":"22939.37"},{"v":23492.266666666663,"d":"23492.27"},{"v":23609.33333333333,"d":"23609.33"},{"v":23768.716666666664,"d":"23768.72"},23449.95,23173.5,73440,{"v":-0.03164556962025317,"d":"-3%"}]
[8,"Others","ABCAPITAL","2023-08-31",180.85,{"v":180.63333333333333,"d":"180.63"},{"v":179.41666666666666,"d":"179.42"},{"v":177.98333333333332,"d":"177.98"},{"v":176.76666666666665,"d":"176.77"},{"v":182.06666666666666,"d":"182.07"},{"v":183.28333333333336,"d":"183.28"},{"v":184.71666666666667,"d":"184.72"},181.85,179.2,34770600,{"v":0.08309503784693019,"d":"8%"}]
[9,"Textile","ABFRL","2023-08-31",{"v":215.1,"d":"215.10"},{"v":215.88333333333333,"d":"215.88"},{"v":213.71666666666664,"d":"213.72"},{"v":212.33333333333331,"d":"212.33"},{"v":210.16666666666663,"d":"210.17"},{"v":217.26666666666665,"d":"217.27"},{"v":219.43333333333334,"d":"219.43"},{"v":220.81666666666666,"d":"220.82"},218.05,214.5,25776400,{"v":7.827589712310663E-3,"d":"1%"}]
[10,"Cement","ACC","2023-08-31",1986.95,{"v":1989.1166666666668,"d":"1989.12"},{"v":1975.5333333333335,"d":"1975.53"},{"v":1964.1166666666668,"d":"1964.12"},{"v":1950.5333333333335,"d":"1950.53"},{"v":2000.5333333333335,"d":"2000.53"},{"v":2014.1166666666666,"d":"2014.12"},{"v":2025.5333333333335,"d":"2025.53"},2002.7,1977.7,6620700,{"v":-0.012440148565803015,"d":"-1%"}]
{"$rows_left_out":202}
{"sheet":"Cash Intra","index":2,"n_rows":245,"n_cols":13,"rows_kept":245,"merged":[[7,0,8,0],[7,1,8,1],[7,2,8,2],[7,3,8,3],[7,4,7,6],[7,7,7,9]]}
[]
[]
[]
[]
[{"$nulls":12},"Back to Main Page"]
["FOR INTRA DAY TRADING",{"$nulls":9},{"$f":"Main!B10","v":"2023-08-30"}]
[]
["Sr.no",null,"CLOSE RATE","Pivot Point","Supports",null,null,"Resistances"]
[{"$nulls":4},"S1","S2","S3","R1","R2","R3","HIGH","LOW","Total Trade Quanity in Lakhs"]
[1,"Nifty 50",19342.65,{"v":19343.216666666667,"d":"19343.22"},{"v":19308.533333333333,"d":"19308.53"},{"v":19274.416666666664,"d":"19274.42"},{"v":19239.73333333333,"d":"19239.73"},{"v":19377.333333333336,"d":"19377.33"},{"v":19412.01666666667,"d":"19412.02"},{"v":19446.13333333334,"d":"19446.13"},{"v":19377.9,"d":"19377.90"},{"v":19309.1,"d":"19309.10"}]
[2,"Nifty Bank",44495.25,{"v":44532.68333333333,"d":"44532.68"},{"v":44392.366666666654,"d":"44392.37"},{"v":44289.48333333333,"d":"44289.48"},{"v":44149.16666666666,"d":"44149.17"},{"v":44635.56666666665,"d":"44635.57"},{"v":44775.88333333332,"d":"44775.88"},{"v":44878.76666666665,"d":"44878.77"},{"v":44673,"d":"44673.00"},{"v":44429.8,"d":"44429.80"}]
[3,"Nifty CPSE",3523.45,{"v":3521.5,"d":"3521.50"},3512.65,3501.85,{"v":3493,"d":"3493.00"},{"v":3532.3,"d":"3532.30"},{"v":3541.1500000000005,"d":"3541.15"},{"v":3551.9500000000003,"d":"3551.95"},3530.35,{"v":3510.7,"d":"3510.70"}]
[4,"Nifty Infra",5981.15,{"v":5976.216666666666,"d":"5976.22"},{"v":5961.983333333333,"d":"5961.98"},{"v":5942.816666666667,"d":"5942.82"},{"v":5928.583333333333,"d":"5928.58"},{"v":5995.383333333332,"d":"5995.38"},{"v":6009.616666666666,"d":"6009.62"},{"v":6028.783333333332,"d":"6028.78"},5990.45,5957.05]
[5,"Nifty IT",30866.05,{"v":30876.38333333333,"d":"30876.38"},{"v":30774.516666666663,"d":"30774.52"},{"v":30682.98333333333,"d":"30682.98"},{"v":30581.11666666666,"d":"30581.12"},{"v":30967.916666666664,"d":"30967.92"},{"v":31069.783333333333,"d":"31069.78"},{"v":31161.316666666666,"d":"31161.32"},30978.25,30784.85]
[6,"Nifty PSE",{"v":5525.6,"d":"5525.60"},{"v":5523.116666666668,"d":"5523.12"},{"v":5511.933333333335,"d":"5511.93"},{"v":5498.266666666667,"d":"5498.27"},{"v":5487.083333333335,"d":"5487.08"},{"v":5536.783333333336,"d":"5536.78"},{"v":5547.966666666668,"d":"5547.97"},{"v":5561.633333333336,"d":"5561.63"},{"v":5534.3,"d":"5534.30"},5509.45]
[7,"Nifty Midcap 50",11109.35,{"v":11108.133333333333,"d":"11108.13"},{"v":11087.166666666666,"d":"11087.17"},{"v":11064.983333333334,"d":"11064.98"},{"v":11044.016666666666,"d":"11044.02"},{"v":11130.316666666666,"d":"11130.32"},{"v":11151.283333333333,"d":"11151.28"},{"v":11173.466666666665,"d":"11173.47"},{"v":11129.1,"d":"11129.10"},11085.95]
[8,"ABB",4318.85,{"v":4297.633333333333,"d":"4297.63"},{"v":4265.316666666667,"d":"4265.32"},{"v":4211.783333333334,"d":"4211.78"},{"v":4179.466666666667,"d":"4179.47"},{"v":4351.166666666666,"d":"4351.17"},{"v":4383.483333333332,"d":"4383.48"},{"v":4437.0166666666655,"d":"4437.02"},4329.95,4244.1,1.87724]
[9,"ABBOTINDIA",23414.95,{"v":23368.56666666667,"d":"23368.57"},{"v":23262.233333333337,"d":"23262.23"},{"v":23109.516666666666,"d":"23109.52"},{"v":23003.183333333334,"d":"23003.18"},{"v":23521.28333333334,"d":"23521.28"},{"v":23627.616666666676,"d":"23627.62"},{"v":23780.333333333343,"d":"23780.33"},23474.9,23215.85,0.11307]
[10,"ABCAPITAL",180.4,180.25,179.05,{"v":177.70000000000002,"d":"177.70"},{"v":176.50000000000003,"d":"176.50"},{"v":181.6,"d":"181.60"},{"v":182.79999999999998,"d":"182.80"},{"v":184.14999999999998,"d":"184.15"},181.45,178.9,15.04934]
[11,"ABFRL",215.2,{"v":215.9333333333333,"d":"215.93"},{"v":213.76666666666662,"d":"213.77"},{"v":212.33333333333331,"d":"212.33"},{"v":210.16666666666663,"d":"210.17"},{"v":217.36666666666662,"d":"217.37"},{"v":219.5333333333333,"d":"219.53"},{"v":220.9666666666666,"d":"220.97"},218.1,214.5,11.02667]
{"$rows_left_out":226}
{"sheet":"MidCap Intra","index":3,"n_rows":530,"n_cols":13,"rows_kept":530,"merged":[[0,0,0,1],[8,0,9,0],[8,1,9,1],[8,2,9,2],[8,3,9,3],[8,4,8,6],[8,7,8,9]]}
[]
[]
[]
[]
[{"$nulls":11},"Back To Main Page"]
["FOR INTRA DAY TRADING",{"$nulls":9},{"$f":"Main!B10","v":"2023-08-30"}]
[null,null," "]
[]
["Sr.no","Scrip","CLOSE RATE","Pivot Point","Supports",null,null,"Resistances"]
[{"$nulls":4},"S1","S2","S3","R1","R2","R3","HIGH","LOW","Total Trade Quanity in Lakhs"]
[1,"360ONE",507.05,{"v":506.34999999999997,"d":"506.35"},{"v":500.69999999999993,"d":"500.70"},{"v":494.34999999999997,"d":"494.35"},{"v":488.69999999999993,"d":"488.70"},{"v":512.6999999999999,"d":"512.70"},{"v":518.3499999999999,"d":"518.35"},{"v":524.6999999999999,"d":"524.70"},512,500,1.19137]
[2,"3MINDIA",31581.15,{"v":31319.066666666666,"d":"31319.07"},{"v":30649.13333333333,"d":"30649.13"},{"v":29717.116666666665,"d":"29717.12"},{"v":29047.18333333333,"d":"29047.18"},{"v":32251.083333333332,"d":"32251.08"},{"v":32921.01666666666,"d":"32921.02"},{"v":33853.03333333333,"d":"33853.03"},31989,30387.05,0.06072]
[3,"AARTIDRUGS",553.4,547.35,{"v":536.0500000000001,"d":"536.05"},{"v":518.7,"d":"518.70"},{"v":507.4000000000001,"d":"507.40"},{"v":564.7,"d":"564.70"},{"v":576,"d":"576.00"},593.35,558.65,530,4.81599]
[4,"AARTIIND",481.3,{"v":475.4166666666667,"d":"475.42"},{"v":466.83333333333337,"d":"466.83"},{"v":452.3666666666667,"d":"452.37"},{"v":443.78333333333336,"d":"443.78"},{"v":489.8833333333334,"d":"489.88"},{"v":498.46666666666675,"d":"498.47"},{"v":512.9333333333334,"d":"512.93"},484,460.95,39.14344]
[5,"AAVAS",1601.1,{"v":1600.7166666666665,"d":"1600.72"},{"v":1591.433333333333,"d":"1591.43"},{"v":1581.7666666666664,"d":"1581.77"},{"v":1572.483333333333,"d":"1572.48"},{"v":1610.383333333333,"d":"1610.38"},{"v":1619.6666666666663,"d":"1619.67"},{"v":1629.333333333333,"d":"1629.33"},1610,1591.05,2.68971]
[6,"ABB",4318.85,{"v":4297.633333333333,"d":"4297.63"},{"v":4265.316666666667,"d":"4265.32"},{"v":4211.783333333334,"d":"4211.78"},{"v":4179.466666666667,"d":"4179.47"},{"v":4351.166666666666,"d":"4351.17"},{"v":4383.483333333332,"d":"4383.48"},{"v":4437.0166666666655,"d":"4437.02"},4329.95,4244.1,1.87724]
[7,"ABBOTINDIA",23414.95,{"v":23368.56666666667,"d":"23368.57"},{"v":23262.233333333337,"d":"23262.23"},{"v":23109.516666666666,"d":"23109.52"},{"v":23003.183333333334,"d":"23003.18"},{"v":23521.28333333334,"d":"23521.28"},{"v":23627.616666666676,"d":"23627.62"},{"v":23780.333333333343,"d":"23780.33"},23474.9,23215.85,0.11307]
[8,"ACC",1981.8,{"v":1985.0666666666666,"d":"1985.07"},{"v":1972.7833333333333,"d":"1972.78"},{"v":1963.7666666666667,"d":"1963.77"},{"v":1951.4833333333333,"d":"1951.48"},{"v":1994.0833333333333,"d":"1994.08"},{"v":2006.3666666666666,"d":"2006.37"},{"v":2015.3833333333332,"d":"2015.38"},1997.35,1976.05,3.52542]
[9,"ADANIENT",2506.45,{"v":2496.0333333333333,"d":"2496.03"},{"v":2455.4166666666665,"d":"2455.42"},{"v":2404.383333333333,"d":"2404.38"},{"v":2363.7666666666664,"d":"2363.77"},{"v":2547.0666666666666,"d":"2547.07"},{"v":2587.6833333333334,"d":"2587.68"},{"v":2638.7166666666667,"d":"2638.72"},2536.65,2445,48.0215]
[10,"ADANIGREEN",974.5,{"v":974.1833333333334,"d":"974.18"},{"v":963.3666666666668,"d":"963.37"},{"v":952.2333333333333,"d":"952.23"},{"v":941.4166666666667,"d":"941.42"},{"v":985.3166666666668,"d":"985.32"},{"v":996.1333333333334,"d":"996.13"},{"v":1007.2666666666669,"d":"1007.27"},985,963.05,14.69569]
{"$rows_left_out":511}
{"sheet":"Bulk Deals","index":4,"n_rows":164,"n_cols":8,"rows_kept":164,"merged":[[4,0,4,1],[4,2,4,3],[6,1,6,2]]}
[" "]
[]
[]
[]
[]
[{"$nulls":4},"Back To Main Page"]
["Subject :","BULK DEAL",null,{"$f":"Main!B10","v":"2023-08-30"}]
[]
["Date","Scrip code","Scrip Name","Client Name","Buy / Sell","Quantity Traded","Trade Price / Wt.Avg.trade price","Exchange  "]
["2023-08-29",540615,"7NR","VAX FASHION PRIVATE LIMITED","BUY",108,0.63,"BSE"]
["2023-08-29",540615,"7NR","VAX FASHION PRIVATE LIMITED","SELL",{"v":2100000,"d":"2,100,000"},0.64,"BSE"]
["2023-08-29",543349,"AMIORG","GIRISHKUMAR LIMBABHAI CHOVATIA","SELL",{"v":625000,"d":"625,000"},1250.39,"BSE"]
["2023-08-29",543349,"AMIORG","MORGAN STANLEY ASIA SINGAPORE PTE NON ODI","BUY",{"v":621898,"d":"621,898"},1250,"BSE"]
["2023-08-29",533758,"APLAPOLLO","RAHUL GUPTA","SELL",{"v":1501000,"d":"1,501,000"},1621.46,"BSE"]
["2023-08-29",537069,"ARNOLD","KEEMTEE FINANCIAL SERVICES LTD","BUY",{"v":838261,"d":"838,261"},17.55,"BSE"]
["2023-08-29",537069,"ARNOLD","RAUDRAMUKHI COMMERCE PVT LTD","BUY",{"v":684350,"d":"684,350"},17.86,"BSE"]
["2023-08-29",537069,"ARNOLD","ACQUITOR FINANCIAL SERVICES PVT.LTD.","SELL",{"v":1700000,"d":"1,700,000"},17.76,"BSE"]
["2023-08-29",537069,"ARNOLD","SETU SECURITIES PVT. LTD.","SELL",{"v":199386,"d":"199,386"},17.65,"BSE"]
["2023-08-29",537069,"ARNOLD","SETU SECURITIES PVT. LTD.","BUY",{"v":207501,"d":"207,501"},18.02,"BSE"]
["2023-08-29",543443,"ASCENSIVE","BEELINE BROKING LIMITED","SELL",{"v":24000,"d":"24,000"},40.06,"BSE"]
{"$rows_left_out":145}
{"sheet":"Call Tracker (Equity & F&O)","index":5,"n_rows":351,"n_cols":18,"rows_kept":351,"merged":[[113,0,114,0],[113,1,114,1],[113,8,114,8],[113,9,114,9],[124,0,125,0],[124,1,125,1],[124,9,125,9],[124,13,125,13],[124,14,125,14],[124,15,125,15],[131,0,132,0],[131,1,132,1],[131,9,132,9]]}
[]
[]
[]
[]
[{"$nulls":12},"Back To Main Page"]
["Retail Research Technical Calls & Fundamental Performance Report for the month of August-2023"]
[{"$nulls":12},{"$f":"Main!B10","v":"2023-08-30"}]
[null,"Positional  Call"]
["Sr.no","Date",null,"Company","Rec","Rec Price","Stop Loss***","Call Closed At","Target","Remark","Profit / Loss per Share","All charges","Net Gain / Loss  %","Status","Closed Date","Market Closing Price"]
[1,"2023-06-15",null,"ATUL","Accu",6800,6400,7150,"7400-7600","Profit of Rs.350/-",{"$f":"H10-F10","v":350},{"$f":"(F10*-0.3)/100","v":{"v":-20.4,"d":"-20.40"}},{"$f":"(K10+L10)/F10","v":{"v":0.04847058823529412,"d":"4.85%"}},"Successful","2023-08-01"," ",null,"H"]
[2,"2023-07-04",null,"BIOCON","Accu<>",253.5,234,272,"300-320","Profit of Rs.18.5/-",{"$f":"H11-F11","v":18.5},{"$f":"(F11*-0.3)/100","v":{"v":-0.7605,"d":"-0.76"}},{"$f":"(K11+L11)/F11","v":{"v":0.06997830374753451,"d":"7.00%"}},"Successful","2023-08-08"," ",null,"H"]
[3,"2023-07-05",null,"GMMPFAUDLR","Accu",1465,1395,1545,"1580-1640","Profit of Rs.80/-",{"$f":"H12-F12","v":80},{"$f":"(F12*-0.3)/100","v":{"v":-4.395,"d":"-4.40"}},{"$f":"(K12+L12)/F12","v":{"v":0.05160750853242321,"d":"5.16%"}},"Successful","2023-08-11"," ",null,"N"]
[4,"2023-07-12",null,"HDFCBANK","Accu","1595-1655",1540,null,"1800-1900","Open",{"$nulls":5},{"$f":"VLOOKUP(D13,'MidCap Intra'!$B$11:$C$568,2,0)","v":{"v":1590.3,"d":"1590.30"}},null,"H"]
[5,"2023-07-13",null,"JAMNAAUTO","Accu<>",106.4,102,113.5,"118-122","Profit of Rs.7.1/-",{"$f":"H14-F14","v":7.099999999999994},{"$f":"(F14*-0.3)/100","v":{"v":-0.31920000000000004,"d":"-0.32"}},{"$f":"(K14+L14)/F14","v":{"v":0.06372932330827062,"d":"6.37%"}},"Successful","2023-08-14"," ",null,"H"]
[6,"2023-07-18",null,"SBIN","Accu",579,548,581,"640-660","Profit of Rs.2/-",{"$f":"H15-F15","v":2},{"$f":"(F15*-0.3)/100","v":{"v":-1.7369999999999999,"d":"-1.74"}},{"$f":"(K15+L15)/F15","v":{"v":4.5423143350604512E-4,"d":"0.05%"}},"Neutral","2023-08-24"," ",null,"H"]
[7,"2023-07-18",null,"REDINGTON","Accu",178,168,170,"195-205","Loss of Rs.8/-",{"$f":"H16-F16","v":-8},{"$f":"(F16*-0.3)/100","v":{"v":-0.534,"d":"-0.53"}},{"$f":"(K16+L16)/F16","v":{"v":-0.0479438202247191,"d":"-4.79%"}},"Unsuccessful","2023-08-02",null,null,"H"]
[8,"2023-07-26",null,"JKPAPER","Accu",326,299,345.5,"350-370","Profit of Rs.19.5/-",{"$f":"H17-F17","v":19.5},{"$f":"(F17*-0.3)/100","v":{"v":-0.978,"d":"-0.98"}},{"$f":"(K17+L17)/F17","v":{"v":0.05681595092024539,"d":"5.68%"}},"Successful","2023-08-02",null,null,"H"]
[9,"2023-07-26",null,"BANKBARODA","Accu","191-197",185,null,"215-225","Open",{"$nulls":5},{"$f":"VLOOKUP(D18,'MidCap Intra'!$B$11:$C$568,2,0)","v":191.15},null,"H"]
[10,"2023-07-26",null,"RVNL","Accu","121-134",118,null,"145-150","Open",{"$nulls":5},{"$f":"VLOOKUP(D19,'MidCap Intra'!$B$11:$C$568,2,0)","v":127.75},null,"H"]
[11,"2023-07-27",null,"INDUSTOWER","Accu",173.5,164,164,"190-200","Loss of Rs.9.5/-",{"$f":"H20-F20","v":-9.5},{"$f":"(F20*-0.3)/100","v":{"v":-0.5205,"d":"-0.52"}},{"$f":"(K20+L20)/F20","v":{"v":-0.057755043227665705,"d":"-5.78%"}},"Unsuccessful","2023-08-16",null,null,"H"]
{"$rows_left_out":318}