{"text_format":"3","workbook":"xlsx","n_sheets":6,"sheets":["Main","Future Intra","Cash Intra","MidCap Intra","Bulk Deals","Call Tracker (Equity & F&O)"],"not_rendered":{"images":2,"defined_names":3},"read":"whole","date_system":"1900"}

{"sheet":"Main","index":0,"n_rows":27,"n_cols":11,"rows_kept":27}
[null,"                                                                                                 "]
{"$rows_empty":8}
[null,"2023-05-30"]
[]
[null,"Sheet No.","Template Name","Summary"]
[null,1,"Future Intra","For Intraday trading in F&O segment"]
[null,2,"Cash Intra","For Intraday trading in cash market segment"]
[null,3,"Mid-cap Intra","For Intraday trading in Mid-cap stocks"]
[null,4,"Bulk Deals","Reveals Bulk Deals carried on NSE & BSE"]
[null,5,"Call Tracker"]
{"$rows_empty":9}
[{"$nulls":10},"`"]

{"sheet":"Future Intra","index":1,"n_rows":236,"n_cols":16,"rows_kept":236,"merged":[[8,0,9,0],[8,1,9,1],[8,2,9,2],[8,3,9,3],[8,6,8,8],[8,9,8,11]]}
[]
[]
[]
[]
[{"$nulls":12},"Back to Main Page"]
["FOR INTRA DAY TRADING",{"$nulls":10},{"$f":"Main!B10","v":"2023-05-30"}]
[]
[]
["Sr.no","Sector","Scrip","Expiry Date","CLOSE RATE","Pivot Point","Supports",null,null,"Resistances"]
[{"$nulls":4},"Point","Point","S1","S2","S3","R1","R2","R3","HIGH","LOW","OI","% Change in OI"]
[1,"Index","NIFTY","2023-06-29",{"v":18673.7,"d":"18673.70"},{"v":18679.8,"d":"18679.80"},{"v":18642.1,"d":"18642.10"},{"v":18610.5,"d":"18610.50"},{"v":18572.8,"d":"18572.80"},{"v":18711.399999999998,"d":"18711.40"},{"v":18749.100000000002,"d":"18749.10"},{"v":18780.699999999997,"d":"18780.70"},18717.5,18648.2,10321850,{"v":0.008396916734239295,"d":"0.84%"}]
[2,"Index","BANKNIFTY","2023-06-29",{"v":44368.3,"d":"44368.30"},{"v":44364.43333333333,"d":"44364.43"},{"v":44203.866666666654,"d":"44203.87"},{"v":44039.43333333333,"d":"44039.43"},{"v":43878.866666666654,"d":"43878.87"},{"v":44528.866666666654,"d":"44528.87"},{"v":44689.43333333332,"d":"44689.43"},{"v":44853.866666666654,"d":"44853.87"},44525,44200,2300615,{"v":4.262609948272475E-3,"d":"0.43%"}]
[3,"Index","FINNIFTY","2023-05-30",19536.25,{"v":19547.13333333333,"d":"19547.13"},{"v":19476.916666666664,"d":"19476.92"},{"v":19417.583333333332,"d":"19417.58"},{"v":19347.366666666665,"d":"19347.37"},{"v":19606.466666666664,"d":"19606.47"},{"v":19676.68333333333,"d":"19676.68"},{"v":19736.016666666663,"d":"19736.02"},19617.35,19487.8,54320,{"v":0.10316815597075549,"d":"10.32%"}]
[4,"Index","MIDCPNIFTY","2023-05-31",7759.95,{"v":7762.033333333333,"d":"7762.03"},{"v":7757.866666666666,"d":"7757.87"},{"v":7755.783333333333,"d":"7755.78"},{"v":7751.616666666666,"d":"7751.62"},{"v":7764.116666666666,"d":"7764.12"},{"v":7768.283333333334,"d":"7768.28"},{"v":7770.366666666666,"d":"7770.37"},7766.2,7759.95,150,{"v":1,"d":"100.00%"}]
[5,"Chemical","AARTIIND","2023-06-29",{"v":518.4,"d":"518.40"},{"v":517.5500000000001,"d":"517.55"},{"v":514.6000000000001,"d":"514.60"},{"v":510.80000000000007,"d":"510.80"},{"v":507.85000000000014,"d":"507.85"},{"v":521.3500000000001,"d":"521.35"},{"v":524.3000000000002,"d":"524.30"},{"v":528.1000000000001,"d":"528.10"},520.5,513.75,5082300,{"v":8.81319597451319E-3,"d":"0.88%"}]
[6,"Capital_Goods","ABB","2023-06-29",4045.35,4048.15,{"v":4022.4,"d":"4022.40"},3999.45,{"v":3973.7,"d":"3973.70"},{"v":4071.1000000000004,"d":"4071.10"},4096.85,{"v":4119.800000000001,"d":"4119.80"},4073.9,4025.2,1359000,{"v":2.2123893805309734E-3,"d":"0.22%"}]
[7,"Pharma","ABBOTINDIA","2023-06-29",22066.65,{"v":22048.600000000002,"d":"22048.60"},{"v":21928.100000000006,"d":"21928.10"},{"v":21789.550000000003,"d":"21789.55"},{"v":21669.050000000007,"d":"21669.05"},{"v":22187.150000000005,"d":"22187.15"},{"v":22307.649999999998,"d":"22307.65"},{"v":22446.200000000004,"d":"22446.20"},22169.1,21910.05,65360,{"v":0.019975031210986267,"d":"2.00%"}]
[8,"Others","ABCAPITAL","2023-06-29",166.95,{"v":167.31666666666666,"d":"167.32"},{"v":165.38333333333333,"d":"165.38"},{"v":163.81666666666666,"d":"163.82"},{"v":161.88333333333333,"d":"161.88"},{"v":168.88333333333333,"d":"168.88"},{"v":170.81666666666666,"d":"170.82"},{"v":172.38333333333333,"d":"172.38"},169.25,165.75,28679400,{"v":0.008736942070275403,"d":"0.87%"}]
[9,"Textile","ABFRL","2023-06-29",{"v":198.3,"d":"198.30"},{"v":198.4,"d":"198.40"},{"v":196.9,"d":"196.90"},{"v":195.5,"d":"195.50"},{"v":194,"d":"194.00"},{"v":199.8,"d":"199.80"},{"v":201.3,"d":"201.30"},{"v":202.70000000000002,"d":"202.70"},199.9,197,28995200,{"v":0.017889740781307048,"d":"1.79%"}]
[10,"Cement","ACC","2023-06-29",{"v":1807.8,"d":"1807.80"},{"v":1807.6000000000001,"d":"1807.60"},{"v":1793.2000000000003,"d":"1793.20"},{"v":1778.6000000000001,"d":"1778.60"},{"v":1764.2000000000003,"d":"1764.20"},{"v":1822.2000000000003,"d":"1822.20"},{"v":1836.6000000000004,"d":"1836.60"},{"v":1851.2000000000003,"d":"1851.20"},1822,1793,4782400,{"v":0.014499209808975297,"d":"1.45%"}]
{"$rows_left_out":202}
{"sheet":"Cash Intra","index":2,"n_rows":246,"n_cols":13,"rows_kept":246,"merged":[[7,0,8,0],[7,1,8,1],[7,2,8,2],[7,3,8,3],[7,4,7,6],[7,7,7,9]]}
[]
[]
[]
[]
[{"$nulls":12},"Back to Main Page"]
["FOR INTRA DAY TRADING",{"$nulls":9},{"$f":"Main!B10","v":"2023-05-30"}]
[]
["Sr.no",null,"CLOSE RATE","Pivot Point","Supports",null,null,"Resistances"]
[{"$nulls":4},"S1","S2","S3","R1","R2","R3","HIGH","LOW","Total Trade Quanity in Lakhs"]
[1,"Nifty 50",18598.65,{"v":18607.033333333336,"d":"18607.03"},{"v":18572.866666666672,"d":"18572.87"},{"v":18547.083333333336,"d":"18547.08"},{"v":18512.91666666667,"d":"18512.92"},{"v":18632.816666666673,"d":"18632.82"},{"v":18666.983333333337,"d":"18666.98"},{"v":18692.766666666674,"d":"18692.77"},{"v":18641.2,"d":"18641.20"},18581.25]
[2,"Nifty Bank",{"v":44311.9,"d":"44311.90"},{"v":44329.73333333334,"d":"44329.73"},{"v":44176.116666666676,"d":"44176.12"},{"v":44040.333333333336,"d":"44040.33"},{"v":43886.716666666674,"d":"43886.72"},{"v":44465.51666666668,"d":"44465.52"},{"v":44619.133333333346,"d":"44619.13"},{"v":44754.91666666668,"d":"44754.92"},44483.35,44193.95]
[3,"Nifty CPSE",3124.45,3120.75,{"v":3103.6,"d":"3103.60"},3082.75,{"v":3065.6,"d":"3065.60"},{"v":3141.6,"d":"3141.60"},{"v":3158.7499999999995,"d":"3158.75"},{"v":3179.6,"d":"3179.60"},{"v":3137.9,"d":"3137.90"},{"v":3099.9,"d":"3099.90"}]
[4,"Nifty Infra",{"v":5475,"d":"5475.00"},{"v":5471.716666666667,"d":"5471.72"},{"v":5461.033333333335,"d":"5461.03"},{"v":5447.0666666666675,"d":"5447.07"},{"v":5436.383333333335,"d":"5436.38"},{"v":5485.683333333334,"d":"5485.68"},{"v":5496.366666666667,"d":"5496.37"},{"v":5510.333333333334,"d":"5510.33"},{"v":5482.4,"d":"5482.40"},5457.75]
[5,"Nifty IT",{"v":29240.2,"d":"29240.20"},{"v":29366.683333333334,"d":"29366.68"},{"v":29073.76666666667,"d":"29073.77"},{"v":28907.333333333336,"d":"28907.33"},{"v":28614.41666666667,"d":"28614.42"},{"v":29533.11666666667,"d":"29533.12"},{"v":29826.033333333333,"d":"29826.03"},{"v":29992.466666666667,"d":"29992.47"},{"v":29659.6,"d":"29659.60"},29200.25]
[6,"Nifty PSE",{"v":4813.1,"d":"4813.10"},{"v":4806.566666666667,"d":"4806.57"},{"v":4783.483333333334,"d":"4783.48"},{"v":4753.866666666667,"d":"4753.87"},{"v":4730.783333333334,"d":"4730.78"},{"v":4836.183333333333,"d":"4836.18"},{"v":4859.266666666667,"d":"4859.27"},{"v":4888.883333333333,"d":"4888.88"},4829.65,4776.95]
[7,"Nifty Midcap 50",9470.35,{"v":9456.316666666668,"d":"9456.32"},{"v":9433.933333333334,"d":"9433.93"},{"v":9397.516666666666,"d":"9397.52"},{"v":9375.133333333333,"d":"9375.13"},{"v":9492.733333333335,"d":"9492.73"},{"v":9515.11666666667,"d":"9515.12"},{"v":9551.533333333336,"d":"9551.53"},{"v":9478.7,"d":"9478.70"},{"v":9419.9,"d":"9419.90"}]
[8,"ABB",4031.15,4033.85,{"v":4009.6,"d":"4009.60"},3988.05,{"v":3963.8,"d":"3963.80"},{"v":4055.3999999999996,"d":"4055.40"},{"v":4079.6499999999996,"d":"4079.65"},{"v":4101.199999999999,"d":"4101.20"},4058.1,4012.3,2.77673]
[9,"ACC",1794.4,{"v":1793.8833333333332,"d":"1793.88"},{"v":1779.7666666666664,"d":"1779.77"},{"v":1765.1333333333332,"d":"1765.13"},{"v":1751.0166666666664,"d":"1751.02"},{"v":1808.5166666666664,"d":"1808.52"},{"v":1822.6333333333332,"d":"1822.63"},{"v":1837.2666666666664,"d":"1837.27"},1808,1779.25,3.89902]
[10,"AUBANK",790.4,{"v":787.3166666666666,"d":"787.32"},{"v":779.6333333333332,"d":"779.63"},{"v":768.8666666666666,"d":"768.87"},{"v":761.1833333333332,"d":"761.18"},{"v":798.0833333333333,"d":"798.08"},{"v":805.7666666666667,"d":"805.77"},{"v":816.5333333333333,"d":"816.53"},795,776.55,26.25329]
[11,"ABBOTINDIA",21893.8,{"v":21876.266666666666,"d":"21876.27"},{"v":21764.533333333333,"d":"21764.53"},{"v":21635.266666666666,"d":"21635.27"},{"v":21523.533333333333,"d":"21523.53"},{"v":22005.533333333333,"d":"22005.53"},{"v":22117.266666666663,"d":"22117.27"},{"v":22246.533333333333,"d":"22246.53"},21988,21747,0.06045]
{"$rows_left_out":227}
{"sheet":"MidCap Intra","index":3,"n_rows":532,"n_cols":13,"rows_kept":532,"merged":[[0,0,0,1],[8,0,9,0],[8,1,9,1],[8,2,9,2],[8,3,9,3],[8,4,8,6],[8,7,8,9]]}
[]
[]
[]
[]
[{"$nulls":11},"Back To Main Page"]
["FOR INTRA DAY TRADING",{"$nulls":9},{"$f":"Main!B10","v":"2023-05-30"}]
[null,null," "]
[]
["Sr.no","Scrip","CLOSE RATE","Pivot Point","Supports",null,null,"Resistances"]
[{"$nulls":4},"S1","S2","S3","R1","R2","R3","HIGH","LOW","Total Trade Quanity in Lakhs"]
[1,"360ONE",419.75,{"v":418.8666666666666,"d":"418.87"},{"v":417.23333333333323,"d":"417.23"},{"v":414.71666666666664,"d":"414.72"},{"v":413.08333333333326,"d":"413.08"},{"v":421.3833333333332,"d":"421.38"},{"v":423.01666666666654,"d":"423.02"},{"v":425.5333333333332,"d":"425.53"},420.5,416.35,0.77997]
[2,"3MINDIA",24147.25,{"v":24142.88333333333,"d":"24142.88"},{"v":23944.316666666662,"d":"23944.32"},{"v":23741.38333333333,"d":"23741.38"},{"v":23542.816666666662,"d":"23542.82"},{"v":24345.816666666662,"d":"24345.82"},{"v":24544.383333333328,"d":"24544.38"},{"v":24747.316666666662,"d":"24747.32"},24341.45,23939.95,0.01365]
[3,"ABB",4031.15,4033.85,{"v":4009.6,"d":"4009.60"},3988.05,{"v":3963.8,"d":"3963.80"},{"v":4055.3999999999996,"d":"4055.40"},{"v":4079.6499999999996,"d":"4079.65"},{"v":4101.199999999999,"d":"4101.20"},4058.1,4012.3,2.77673]
[4,"ACC",1794.4,{"v":1793.8833333333332,"d":"1793.88"},{"v":1779.7666666666664,"d":"1779.77"},{"v":1765.1333333333332,"d":"1765.13"},{"v":1751.0166666666664,"d":"1751.02"},{"v":1808.5166666666664,"d":"1808.52"},{"v":1822.6333333333332,"d":"1822.63"},{"v":1837.2666666666664,"d":"1837.27"},1808,1779.25,3.89902]
[5,"AIAENG",2789.75,{"v":2798.7000000000003,"d":"2798.70"},{"v":2752.0500000000006,"d":"2752.05"},{"v":2714.3500000000004,"d":"2714.35"},{"v":2667.7000000000007,"d":"2667.70"},{"v":2836.4000000000005,"d":"2836.40"},2883.05,{"v":2920.7500000000005,"d":"2920.75"},2845.35,2761,2.55424]
[6,"APLAPOLLO",1135.75,{"v":1132.6499999999999,"d":"1132.65"},{"v":1125.2999999999997,"d":"1125.30"},1114.85,{"v":1107.4999999999998,"d":"1107.50"},{"v":1143.0999999999997,"d":"1143.10"},{"v":1150.4499999999996,"d":"1150.45"},{"v":1160.8999999999996,"d":"1160.90"},1140,1122.2,3.27334]
[7,"AUBANK",790.4,{"v":787.3166666666666,"d":"787.32"},{"v":779.6333333333332,"d":"779.63"},{"v":768.8666666666666,"d":"768.87"},{"v":761.1833333333332,"d":"761.18"},{"v":798.0833333333333,"d":"798.08"},{"v":805.7666666666667,"d":"805.77"},{"v":816.5333333333333,"d":"816.53"},795,776.55,26.25329]
[8,"AARTIDRUGS",443.85,{"v":445.76666666666665,"d":"445.77"},{"v":439.6333333333333,"d":"439.63"},{"v":435.4166666666667,"d":"435.42"},{"v":429.28333333333336,"d":"429.28"},{"v":449.9833333333333,"d":"449.98"},{"v":456.1166666666666,"d":"456.12"},{"v":460.33333333333326,"d":"460.33"},451.9,441.55,0.83133]
[9,"AAVAS",1389.7,{"v":1389.2333333333333,"d":"1389.23"},{"v":1380.4666666666667,"d":"1380.47"},{"v":1371.2333333333333,"d":"1371.23"},{"v":1362.4666666666667,"d":"1362.47"},{"v":1398.4666666666667,"d":"1398.47"},{"v":1407.2333333333336,"d":"1407.23"},{"v":1416.4666666666667,"d":"1416.47"},1398,1380,2.19015]
[10,"ABBOTINDIA",21893.8,{"v":21876.266666666666,"d":"21876.27"},{"v":21764.533333333333,"d":"21764.53"},{"v":21635.266666666666,"d":"21635.27"},{"v":21523.533333333333,"d":"21523.53"},{"v":22005.533333333333,"d":"22005.53"},{"v":22117.266666666663,"d":"22117.27"},{"v":22246.533333333333,"d":"22246.53"},21988,21747,0.06045]
{"$rows_left_out":513}
{"sheet":"Bulk Deals","index":4,"n_rows":133,"n_cols":8,"rows_kept":133,"merged":[[4,0,4,1],[4,2,4,3],[6,1,6,2]]}
[" "]
[]
[]
[]
[]
[{"$nulls":4},"Back To Main Page"]
["Subject :","BULK DEAL",null,{"$f":"Main!B10","v":"2023-05-30"}]
[]
["Date","Scrip code","Scrip Name","Client Name","Buy / Sell","Quantity Traded","Trade Price / Wt.Avg.trade price","Exchange  "]
["2023-05-29",538351,"AFEL","MUKESH JAIN","SELL",{"v":72813,"d":"72,813"},10.86,"BSE"]
["2023-05-29",541865,"ASRL","VADASSERY DEVASSY HENRY","SELL",{"v":202373,"d":"202,373"},36.64,"BSE"]
["2023-05-29",538734,"CEINSYSTECH","ELDER VENTURE LLP","SELL",{"v":122836,"d":"122,836"},160.16,"BSE"]
["2023-05-29",537326,"CHEMTECH","SAHASTRAA ADVISORS PRIVATE LIMITED","BUY",{"v":70000,"d":"70,000"},37.5,"BSE"]
["2023-05-29",538868,"CSL","RAJU RAMGOPAL KHANDELWAL","BUY",{"v":106600,"d":"106,600"},8.68,"BSE"]
["2023-05-29",540361,"DANUBE","SUNIL HUKUMAT RAJDEV","BUY",{"v":264250,"d":"264,250"},16.7,"BSE"]
["2023-05-29",543651,"DAPS","SELVAMURTHY AKILANDESWARI","BUY",{"v":28000,"d":"28,000"},35.58,"BSE"]
["2023-05-29",539770,"DARJEELING","ANKIT AJITBHAI PANCHAL","SELL",{"v":18197,"d":"18,197"},4.61,"BSE"]
["2023-05-29",539770,"DARJEELING","MAHENDRA GIRDHARILAL WADHWANI","BUY",{"v":22833,"d":"22,833"},4.61,"BSE"]
["2023-05-29",543475,"EKENNIS","MEHUL BHARATBHAI SHAH HUF","SELL",{"v":15200,"d":"15,200"},87.8,"BSE"]
["2023-05-29",543475,"EKENNIS","VINOD MANJIBHAI CHAUHAN","SELL",{"v":10400,"d":"10,400"},87.05,"BSE"]
{"$rows_left_out":114}
{"sheet":"Call Tracker (Equity & F&O)","index":5,"n_rows":345,"n_cols":18,"rows_kept":345,"merged":[[93,0,94,0],[93,1,94,1],[93,9,94,9],[93,14,94,14],[93,15,94,15],[99,0,100,0],[99,1,100,1],[99,9,100,9],[99,12,100,12],[99,14,100,14],[99,15,100,15]]}
[]
[]
[]
[]
[{"$nulls":12},"Back To Main Page"]
["Retail Research Technical Calls & Fundamental Performance Report for the month of May-2023"]
[{"$nulls":12},{"$f":"Main!B10","v":"2023-05-30"}]
[null,"Positional  Call"]
["Sr.no","Date",null,"Company","Rec","Rec Price","Stop Loss***","Call Closed At","Target","Remark","Profit / Loss per Share","All charges","Net Gain / Loss  %","Status","Closed Date","Market Closing Price"]
[1,"2023-04-11",null,"SHARDACROP","Accu",460,425,489,"500-530","Profit of Rs.29/-",{"$f":"H10-F10","v":29},{"$f":"(F10*-0.7)/100","v":-3.22},{"$f":"(K10+L10)/F10","v":{"v":0.05604347826086957,"d":"5.60%"}},"Successful","2023-05-11",null,null,"H"]
[2,"2023-04-12",null,"SUDARSCHEM","Accu",400,377,429,"440-460","Profit of Rs.29/-",29,{"v":-2.8,"d":"-2.80"},{"v":0.0655,"d":"6.55%"},"Successful","2023-05-24",null,null,"H"]
[3,"2023-04-17",null,"REDINGTON","Accu",167.5,158,177.5,"180-190","Profit of Rs.10/-",{"$f":"H12-F12","v":10},{"$f":"(F12*-0.7)/100","v":{"v":-1.1724999999999999,"d":"-1.17"}},{"$f":"(K12+L12)/F12","v":{"v":0.05270149253731344,"d":"5.27%"}},"Successful","2023-05-12",null,null,"H"]
[4,"2023-04-17",null,"HCLTECH","Accu",1035,945,1092.5,"1150-1200","Profit of Rs.29/-",{"$f":"H13-F13","v":57.5},{"$f":"(F13*-0.7)/100","v":{"v":-7.245,"d":"-7.25"}},{"$f":"(K13+L13)/F13","v":{"v":0.04855555555555556,"d":"4.86%"}},"Successful","2023-05-11",null,null,"H"]
[5,"2023-04-17",null,"KOLTEPATIL","Accu",248.5,233,265.5,"280-290","Profit of Rs.17/-",{"$f":"H14-F14","v":17},{"$f":"(F14*-0.7)/100","v":{"v":-1.7394999999999998,"d":"-1.74"}},{"$f":"(K14+L14)/F14","v":{"v":0.061410462776659965,"d":"6.14%"}},"Successful","2023-05-03",null,null,"N"]
[6,"2023-04-24",null,"BHARTIARTL","Accu",772.5,735,818,"850-900","Profit of Rs.45.5/-",{"$f":"H15-F15","v":45.5},{"$f":"(F15*-0.7)/100","v":{"v":-5.4075,"d":"-5.41"}},{"$f":"(K15+L15)/F15","v":{"v":0.05189967637540453,"d":"5.19%"}},"Successful","2023-05-25",null,null,"H"]
[7,"2023-04-25",null,"MASTEK","Accu",1715,1550,1817.5,"1900-2000","Profit of Rs.102.5/-",{"$f":"H16-F16","v":102.5},{"$f":"(F16*-0.7)/100","v":{"v":-12.005,"d":"-12.01"}},{"$f":"(K16+L16)/F16","v":{"v":0.05276676384839651,"d":"5.28%"}},"Successful","2023-05-17",null,null,"H"]
[8,"2023-04-28",null,"GNFC","Accu",580,530,614,"640-680","Profit of Rs.34/-",{"$f":"H17-F17","v":34},{"$f":"(F17*-0.7)/100","v":-4.06},{"$f":"(K17+L17)/F17","v":{"v":0.051620689655172414,"d":"5.16%"}},"Successful","2023-05-11",null,null,"H"]
[9,"2023-05-03",null,"TATAELXSI","Accu",6575,6150,6970,"7000-7300","Profit of Rs.395/-",{"$f":"H18-F18","v":395},{"$f":"(F18*-0.7)/100","v":{"v":-46.025,"d":"-46.03"}},{"$f":"(K18+L18)/F18","v":{"v":0.05307604562737643,"d":"5.31%"}},"Successful","2023-05-09",null,null,"H"]
[10,"2023-05-09",null,"KANSAINER","Accu","400-410",379,null,"450-470","Open",{"$nulls":5},{"$f":"VLOOKUP(D19,'MidCap Intra'!B37:C537,2,0)","v":413.65},null,"H"]
[11,"2023-05-12",null,"RECLTD","Accu",130.5,119,136.75,"140-150","Profit of Rs.6.25/-",{"$f":"H20-F20","v":6.25},{"$f":"(F20*-0.7)/100","v":{"v":-0.9135,"d":"-0.91"}},{"$f":"(K20+L20)/F20","v":{"v":0.04089272030651341,"d":"4.09%"}},"Successful","2023-05-29",null,null,"H"]
{"$rows_left_out":319}