{"text_format":"3","workbook":"xlsx","n_sheets":10,"sheets":["Main","Future Intra","Cash Intra","MidCap Intra","Bulk Deals","Call Tracker (Equity & F&O)","Sheet2","Sheet1","Sheet3","Sheet4"],"not_rendered":{"images":4,"defined_names":5},"read":"whole","date_system":"1900"}

{"sheet":"Main","index":0,"n_rows":27,"n_cols":11,"rows_kept":27}
[null,"                                                                                                 "]
{"$rows_empty":8}
[null,"2019-07-29"]
[]
[null,"Sheet No.","Template Name","Summary"]
[null,1,"Future Intra","For Intraday trading in F&O segment"]
[null,2,"Cash Intra","For Intraday trading in cash market segment"]
[null,3,"Mid-cap Intra","For Intraday trading in Mid-cap stocks"]
[null,4,"Bulk Deals","Reveals Bulk Deals carried on NSE & BSE"]
[null,5,"Call Tracker"]
{"$rows_empty":9}
[{"$nulls":10},"`"]

{"sheet":"Future Intra","index":1,"n_rows":205,"n_cols":15,"rows_kept":205,"merged":[[8,0,9,0],[8,1,9,1],[8,2,9,2],[8,5,8,7],[8,8,8,10]]}
[]
[]
[]
[]
[{"$nulls":12},"Back to Main Page"]
["FOR INTRA DAY TRADING",{"$nulls":10},{"$f":"Main!B10","v":"2019-07-29"}]
[]
[]
["Sr.no","Sector","Scrip","CLOSE RATE","Pivot Point","Supports",null,null,"Resistances"]
[null,"Sector",null,"Point","Point","S1","S2","S3","R1","R2","R3","HIGH","LOW","OI","% Change in OI"]
[1,"Index","BANKNIFTY",29465.65,{"v":29367.083333333332,"d":"29367.08"},{"v":29224.166666666664,"d":"29224.17"},{"v":28982.68333333333,"d":"28982.68"},{"v":28839.766666666663,"d":"28839.77"},{"v":29608.566666666666,"d":"29608.57"},{"v":29751.48333333333,"d":"29751.48"},{"v":29992.966666666667,"d":"29992.97"},29510,29125.6,1420060,{"v":0.008737284764448485,"d":"0.87%"}]
[2,"Index","NIFTY",{"v":11327,"d":"11327.00"},{"v":11306.383333333333,"d":"11306.38"},{"v":11267.766666666666,"d":"11267.77"},{"v":11208.533333333333,"d":"11208.53"},{"v":11169.916666666666,"d":"11169.92"},{"v":11365.616666666667,"d":"11365.62"},{"v":11404.233333333332,"d":"11404.23"},{"v":11463.466666666667,"d":"11463.47"},11345,11247.15,17664675,{"v":-0.014019708805331592,"d":"-1.40%"}]
[3,"Index","NIFTYIT",{"v":15427,"d":"15427.00"},{"v":15434,"d":"15434.00"},{"v":15329,"d":"15329.00"},{"v":15231,"d":"15231.00"},{"v":15126,"d":"15126.00"},{"v":15532,"d":"15532.00"},{"v":15637,"d":"15637.00"},{"v":15735,"d":"15735.00"},15539,15336,13000,{"v":0.05263157894736842,"d":"5.26%"}]
[4,"Cement","ACC",{"v":1590.9,"d":"1590.90"},{"v":1586.3,"d":"1586.30"},{"v":1574.8,"d":"1574.80"},{"v":1558.7,"d":"1558.70"},{"v":1547.2,"d":"1547.20"},{"v":1602.3999999999999,"d":"1602.40"},{"v":1613.8999999999999,"d":"1613.90"},{"v":1629.9999999999998,"d":"1630.00"},1597.8,1570.2,2232800,{"v":0.0780224024719969,"d":"7.80%"}]
[5,"Others","ADANIENT",{"v":132.1,"d":"132.10"},{"v":131.70000000000002,"d":"131.70"},{"v":128.75000000000003,"d":"128.75"},{"v":125.4,"d":"125.40"},{"v":122.45000000000002,"d":"122.45"},{"v":135.05000000000004,"d":"135.05"},{"v":138.00000000000003,"d":"138.00"},{"v":141.35000000000005,"d":"141.35"},134.65,128.35,28648000,{"v":-1.533528509689112E-3,"d":"-0.15%"}]
[6,"Others","ADANIPORTS",{"v":383.8,"d":"383.80"},383.25,{"v":379.8,"d":"379.80"},{"v":375.8,"d":"375.80"},372.35,387.25,{"v":390.70000000000005,"d":"390.70"},{"v":394.7,"d":"394.70"},386.7,379.25,15495000,{"v":-4.8379293662312528E-4,"d":"-0.05%"}]
[7,"Power","ADANIPOWER",{"v":63.2,"d":"63.20"},{"v":62.866666666666674,"d":"62.87"},{"v":62.033333333333346,"d":"62.03"},{"v":60.866666666666674,"d":"60.87"},{"v":60.033333333333346,"d":"60.03"},{"v":64.03333333333335,"d":"64.03"},{"v":64.86666666666667,"d":"64.87"},{"v":66.03333333333335,"d":"66.03"},63.7,61.7,114580000,{"v":0.004030844724851034,"d":"0.40%"}]
[8,"Automobile","AMARAJABAT",{"v":644,"d":"644.00"},{"v":639.4833333333333,"d":"639.48"},{"v":632.5666666666667,"d":"632.57"},{"v":621.1333333333333,"d":"621.13"},{"v":614.2166666666667,"d":"614.22"},{"v":650.9166666666667,"d":"650.92"},{"v":657.8333333333333,"d":"657.83"},{"v":669.2666666666668,"d":"669.27"},646.4,628.05,1565900,{"v":0.04974190520882215,"d":"4.97%"}]
[9,"Cement","AMBUJACEM",{"v":215,"d":"215.00"},{"v":213.9,"d":"213.90"},{"v":211.4,"d":"211.40"},{"v":207.8,"d":"207.80"},{"v":205.3,"d":"205.30"},{"v":217.5,"d":"217.50"},{"v":220,"d":"220.00"},{"v":223.6,"d":"223.60"},216.4,210.3,18835000,{"v":0.036598789212988446,"d":"3.66%"}]
[10,"Others","APOLLOHOSP",{"v":1371,"d":"1371.00"},{"v":1358.6833333333332,"d":"1358.68"},{"v":1343.4166666666663,"d":"1343.42"},{"v":1315.833333333333,"d":"1315.83"},{"v":1300.5666666666662,"d":"1300.57"},{"v":1386.2666666666664,"d":"1386.27"},{"v":1401.5333333333333,"d":"1401.53"},{"v":1429.1166666666666,"d":"1429.12"},1373.95,1331.1,1414000,{"v":0.008919015340706386,"d":"0.89%"}]
{"$rows_left_out":172}
{"sheet":"Cash Intra","index":2,"n_rows":247,"n_cols":13,"rows_kept":247,"merged":[[7,0,8,0],[7,1,8,1],[7,2,8,2],[7,3,8,3],[7,4,7,6],[7,7,7,9]]}
[]
[]
[]
[]
[{"$nulls":12},"Back to Main Page"]
["FOR INTRA DAY TRADING",{"$nulls":9},{"$f":"Main!B10","v":"2019-07-29"}]
[]
["Sr.no","Scrip","CLOSE RATE","Pivot Point","Supports",null,null,"Resistances"]
[null,null,"Point",null,"S1","S2","S3","R1","R2","R3","HIGH","LOW","Total Trade Quanity in Lakhs"]
[1,"Nifty 50",11284.3,{"v":11267.316666666666,"d":"11267.32"},{"v":11227.033333333331,"d":"11227.03"},{"v":11169.766666666665,"d":"11169.77"},{"v":11129.48333333333,"d":"11129.48"},{"v":11324.583333333332,"d":"11324.58"},{"v":11364.866666666665,"d":"11364.87"},{"v":11422.133333333333,"d":"11422.13"},11307.6,11210.05]
[2,"Nifty Bank",29325.3,{"v":29232.966666666664,"d":"29232.97"},{"v":29086.83333333333,"d":"29086.83"},{"v":28848.366666666665,"d":"28848.37"},{"v":28702.23333333333,"d":"28702.23"},{"v":29471.433333333327,"d":"29471.43"},{"v":29617.566666666666,"d":"29617.57"},{"v":29856.033333333326,"d":"29856.03"},29379.1,28994.5]
[3,"Nifty CPSE",2054.7,{"v":2059.0666666666666,"d":"2059.07"},{"v":2038.8833333333332,"d":"2038.88"},{"v":2023.0666666666666,"d":"2023.07"},{"v":2002.8833333333332,"d":"2002.88"},{"v":2074.883333333333,"d":"2074.88"},{"v":2095.0666666666666,"d":"2095.07"},{"v":2110.883333333333,"d":"2110.88"},2079.25,2043.25]
[4,"Nifty Infra",3137.15,{"v":3133.6,"d":"3133.60"},3117.85,3098.55,{"v":3082.8,"d":"3082.80"},{"v":3152.8999999999996,"d":"3152.90"},{"v":3168.6499999999996,"d":"3168.65"},{"v":3187.9499999999994,"d":"3187.95"},3149.35,3114.3]
[5,"Nifty IT",15348.05,{"v":15358.349999999999,"d":"15358.35"},{"v":15255.049999999997,"d":"15255.05"},15162.05,{"v":15058.749999999998,"d":"15058.75"},{"v":15451.349999999997,"d":"15451.35"},15554.65,{"v":15647.649999999996,"d":"15647.65"},15461.65,15265.35]
[6,"Nifty PSE",3279.3,{"v":3280.116666666667,"d":"3280.12"},{"v":3262.2833333333338,"d":"3262.28"},{"v":3245.266666666667,"d":"3245.27"},{"v":3227.433333333334,"d":"3227.43"},{"v":3297.1333333333337,"d":"3297.13"},{"v":3314.9666666666667,"d":"3314.97"},{"v":3331.9833333333336,"d":"3331.98"},3297.95,3263.1]
[7,"Nifty Midcap 50",4421.1,{"v":4409.216666666667,"d":"4409.22"},{"v":4381.133333333334,"d":"4381.13"},{"v":4341.166666666667,"d":"4341.17"},{"v":4313.083333333334,"d":"4313.08"},{"v":4449.183333333334,"d":"4449.18"},{"v":4477.266666666666,"d":"4477.27"},{"v":4517.2333333333345,"d":"4517.23"},4437.3,4369.25]
[8,"ABB",1382.05,{"v":1393.3500000000001,"d":"1393.35"},{"v":1358.7000000000003,"d":"1358.70"},{"v":1335.3500000000001,"d":"1335.35"},{"v":1300.7000000000003,"d":"1300.70"},{"v":1416.7000000000003,"d":"1416.70"},{"v":1451.3500000000004,"d":"1451.35"},{"v":1474.7000000000003,"d":"1474.70"},1428,1370,0.93398]
[9,"ACC",1581.95,{"v":1579.6833333333332,"d":"1579.68"},{"v":1570.3666666666663,"d":"1570.37"},{"v":1558.783333333333,"d":"1558.78"},{"v":1549.4666666666662,"d":"1549.47"},{"v":1591.2666666666664,"d":"1591.27"},{"v":1600.5833333333335,"d":"1600.58"},{"v":1612.1666666666665,"d":"1612.17"},1589,1568.1,4.8042]
[10,"AUBANK",659.45,{"v":663.8166666666667,"d":"663.82"},{"v":650.6333333333334,"d":"650.63"},{"v":641.8166666666667,"d":"641.82"},{"v":628.6333333333334,"d":"628.63"},{"v":672.6333333333334,"d":"672.63"},{"v":685.8166666666666,"d":"685.82"},{"v":694.6333333333334,"d":"694.63"},677,655,4.55634]
[11,"ADANIPORTS",381.65,{"v":381.0833333333333,"d":"381.08"},{"v":377.76666666666665,"d":"377.77"},{"v":373.8833333333333,"d":"373.88"},{"v":370.56666666666666,"d":"370.57"},{"v":384.96666666666664,"d":"384.97"},{"v":388.28333333333336,"d":"388.28"},{"v":392.16666666666663,"d":"392.17"},384.4,377.2,27.01597]
{"$rows_left_out":228}
{"sheet":"MidCap Intra","index":3,"n_rows":545,"n_cols":13,"rows_kept":545,"merged":[[0,0,0,1],[8,0,9,0],[8,1,9,1],[8,2,9,2],[8,3,9,3],[8,4,8,6],[8,7,8,9]]}
[]
[]
[]
[]
[{"$nulls":11},"Back To Main Page"]
["FOR INTRA DAY TRADING",{"$nulls":9},{"$f":"Main!B10","v":"2019-07-29"}]
[null,null," "]
[]
["Sr.no","Scrip","CLOSE RATE","Pivot Point","Supports",null,null,"Resistances"]
[null,null,"Point",null,"S1","S2","S3","R1","R2","R3","HIGH","LOW","Total Trade Quanity in Lakhs"]
[1,"3MINDIA",20903.4,{"v":20934.716666666667,"d":"20934.72"},{"v":20711.783333333333,"d":"20711.78"},{"v":20520.166666666664,"d":"20520.17"},{"v":20297.23333333333,"d":"20297.23"},{"v":21126.333333333336,"d":"21126.33"},{"v":21349.26666666667,"d":"21349.27"},{"v":21540.88333333334,"d":"21540.88"},21157.65,20743.1,0.02335]
[2,"ABB",1382.05,{"v":1393.3500000000001,"d":"1393.35"},{"v":1358.7000000000003,"d":"1358.70"},{"v":1335.3500000000001,"d":"1335.35"},{"v":1300.7000000000003,"d":"1300.70"},{"v":1416.7000000000003,"d":"1416.70"},{"v":1451.3500000000004,"d":"1451.35"},{"v":1474.7000000000003,"d":"1474.70"},1428,1370,0.93398]
[3,"ACC",1581.95,{"v":1579.6833333333332,"d":"1579.68"},{"v":1570.3666666666663,"d":"1570.37"},{"v":1558.783333333333,"d":"1558.78"},{"v":1549.4666666666662,"d":"1549.47"},{"v":1591.2666666666664,"d":"1591.27"},{"v":1600.5833333333335,"d":"1600.58"},{"v":1612.1666666666665,"d":"1612.17"},1589,1568.1,4.8042]
[4,"AIAENG",1722.4,{"v":1728.8166666666666,"d":"1728.82"},{"v":1704.6333333333332,"d":"1704.63"},{"v":1686.8666666666666,"d":"1686.87"},{"v":1662.6833333333332,"d":"1662.68"},{"v":1746.5833333333333,"d":"1746.58"},{"v":1770.7666666666667,"d":"1770.77"},{"v":1788.5333333333333,"d":"1788.53"},1753,1711.05,0.48339]
[5,"APLAPOLLO",1451.85,{"v":1457,"d":"1457.00"},1438.85,1425.85,{"v":1407.6999999999998,"d":"1407.70"},{"v":1470,"d":"1470.00"},1488.15,1501.15,1475.15,1444,0.07208]
[6,"AUBANK",659.45,{"v":663.8166666666667,"d":"663.82"},{"v":650.6333333333334,"d":"650.63"},{"v":641.8166666666667,"d":"641.82"},{"v":628.6333333333334,"d":"628.63"},{"v":672.6333333333334,"d":"672.63"},{"v":685.8166666666666,"d":"685.82"},{"v":694.6333333333334,"d":"694.63"},677,655,4.55634]
[7,"AAVAS",1460.35,{"v":1463.8833333333332,"d":"1463.88"},{"v":1446.4666666666665,"d":"1446.47"},{"v":1432.5833333333333,"d":"1432.58"},{"v":1415.1666666666665,"d":"1415.17"},{"v":1477.7666666666664,"d":"1477.77"},{"v":1495.1833333333334,"d":"1495.18"},{"v":1509.0666666666664,"d":"1509.07"},1481.3,1450,0.04453]
[8,"ADANIGREEN",49.6,{"v":49.38333333333333,"d":"49.38"},{"v":48.416666666666664,"d":"48.42"},{"v":47.233333333333334,"d":"47.23"},{"v":46.266666666666666,"d":"46.27"},{"v":50.56666666666666,"d":"50.57"},{"v":51.53333333333333,"d":"51.53"},{"v":52.71666666666666,"d":"52.72"},50.35,48.2,7.7796]
[9,"ADANIPORTS",381.65,{"v":381.0833333333333,"d":"381.08"},{"v":377.76666666666665,"d":"377.77"},{"v":373.8833333333333,"d":"373.88"},{"v":370.56666666666666,"d":"370.57"},{"v":384.96666666666664,"d":"384.97"},{"v":388.28333333333336,"d":"388.28"},{"v":392.16666666666663,"d":"392.17"},384.4,377.2,27.01597]
[10,"ADANIPOWER",62.9,{"v":62.583333333333336,"d":"62.58"},{"v":61.76666666666667,"d":"61.77"},{"v":60.63333333333334,"d":"60.63"},{"v":59.81666666666668,"d":"59.82"},{"v":63.71666666666667,"d":"63.72"},{"v":64.53333333333333,"d":"64.53"},{"v":65.66666666666666,"d":"65.67"},63.4,61.45,85.97588]
{"$rows_left_out":513}
{"sheet":"Bulk Deals","index":4,"n_rows":70,"n_cols":8,"rows_kept":70,"merged":[[4,0,4,1],[4,2,4,3],[6,1,6,2]]}
[" "]
[]
[]
[]
[]
[{"$nulls":4},"Back To Main Page"]
["Subject :","BULK DEAL",null,{"$f":"Main!B10","v":"2019-07-29"}]
[]
["Date","Scrip code","Scrip Name","Client Name","Buy / Sell","Quantity Traded","Trade Price / Wt.Avg.trade price","Exchange  "]
["2019-07-26",537766,"BCP","ACHINTYA COMMODITIES PRIVATE LIMITED","BUY",{"v":528903,"d":"528,903"},41.73,"BSE"]
["2019-07-26",537766,"BCP","ACHINTYA COMMODITIES PRIVATE LIMITED","SELL",{"v":531817,"d":"531,817"},41.67,"BSE"]
["2019-07-26",542727,"CPML","MOHAMED ZAHEED","SELL",{"v":28000,"d":"28,000"},30.1,"BSE"]
["2019-07-26",542727,"CPML","VIJETA BROKING INDIA PRIVATE LIMITED","BUY",{"v":36000,"d":"36,000"},30.09,"BSE"]
["2019-07-26",538432,"DIVINUS","MANOJKUMAR GUNVANTRAI SOMANI","SELL",{"v":42600,"d":"42,600"},24.25,"BSE"]
["2019-07-26",542724,"EARUM","MOHIT PRAKASH JALAN","SELL",{"v":45000,"d":"45,000"},46.25,"BSE"]
["2019-07-26",533704,"ESSARSHPNG","INDIA OPPORTUNITIES GROWTH FUND LTD - PINEWOOD STRATEGY","BUY",{"v":7400000,"d":"7,400,000"},9.5,"BSE"]
["2019-07-26",533704,"ESSARSHPNG","CITOC INVESTMENT SERVICES LLP","SELL",{"v":7364883,"d":"7,364,883"},{"v":9.5,"d":"9.50"},"BSE"]
["2019-07-26",540937,"MEDICO","ARYAMAN BROKING LIMITED","BUY",{"v":30000,"d":"30,000"},{"v":83.5,"d":"83.50"},"BSE"]
["2019-07-26",540937,"MEDICO","ARYAMAN BROKING LIMITED","SELL",{"v":22800,"d":"22,800"},86.75,"BSE"]
["2019-07-26",540937,"MEDICO","PANKAJ PIYUSH TRADE AND INVESTMENT LTD","SELL",{"v":30000,"d":"30,000"},83.5,"BSE"]
{"$rows_left_out":51}
{"sheet":"Call Tracker (Equity & F&O)","index":5,"n_rows":341,"n_cols":18,"rows_kept":341,"merged":[[131,0,132,0],[131,1,132,1],[131,9,132,9],[131,11,132,11],[131,12,132,12],[131,13,132,13],[131,14,132,14],[131,17,132,17],[134,0,135,0],[134,1,135,1],[134,9,135,9],[134,11,135,11],[134,12,135,12],[134,13,135,13],[134,14,135,14],[134,17,135,17],[136,0,137,0],[136,1,137,1],[136,9,137,9],[136,11,137,11],[136,12,137,12],[136,13,137,13],[136,14,137,14],[140,0,141,0],[140,1,141,1],[140,9,141,9],[140,11,141,11],[140,12,141,12],[140,13,141,13],[140,14,141,14],[142,0,143,0],[142,1,143,1],[142,9,143,9],[142,11,143,11],[142,12,143,12],[142,13,143,13],[142,14,143,14],[144,0,145,0],[144,1,145,1],[144,9,145,9],[144,11,145,11],[144,12,145,12],[144,13,145,13],[144,14,145,14]]}
[]
[]
[]
[]
[{"$nulls":12},"Back To Main Page"]
["Retail Research Technical Calls & Fundamental Performance Report for the month of July-2019 "]
[{"$nulls":12},{"$f":"Main!B10","v":"2019-07-29"}]
[null,"Positional  Call"]
["Sr.no","Date",null,"Company","Rec","Rec Price","Stop Loss***","Call Closed At","Target","Remark","Profit / Loss per Share","Gain / Loss  %","Status","Closed Date","NSE Closed Price"]
[1,"2019-05-27",null,"TATAELXSI","Buy",874,818.7,863,"970-990","Loss of Rs.11/-",{"$f":"H10-F10","v":-11},{"$f":"K10/F10","v":{"v":-0.012585812356979404,"d":"-1.26%"}},"Unsuccessful","2019-07-16",{"$nulls":3},"R"]
[2,"2019-05-28",null,"BAJAJFINSV","Sell",8175,8625,7925,7300,"Profit of Rs.250/-",{"$f":"F11-H11","v":250},{"v":0.03058103975535168,"d":"3.06%"},"Successful","2019-07-08",{"$nulls":3},"H"]
[3,"2019-05-31",null,"ITC","Buy",286,268.3,265.5,"315-325","Loss of Rs.20.5/-",{"$f":"H12-F12","v":-20.5},{"$f":"K12/F12","v":{"v":-0.07167832167832168,"d":"-7.17%"}},"Unsuccessful","2019-07-22",{"$nulls":3},"R"]
[4,"2019-06-13",null,"GODREJCP","Buy",677.5,644,639.5,"740-750","Loss of Rs.38/-",{"$f":"H13-F13","v":-38},{"$f":"K13/F13","v":{"v":-0.05608856088560885,"d":"-5.61%"}},"Unsuccessful","2019-07-10",{"$nulls":3},"H"]
[5,"2019-06-17",null,"SUNTV","Buy",517,476,507,"575-585","Loss of Rs.10/-",{"$f":"H14-F14","v":-10},{"$f":"K14/F14","v":{"v":-0.019342359767891684,"d":"-1.93%"}},"Unsuccessful","2019-07-08",{"$nulls":3},"R"]
[6,"2019-06-21",null,"AJANTPHARM","Buy",955,897.7,894,"1060-1080","Loss of Rs.61/-",{"$f":"H15-F15","v":-61},{"$f":"K15/F15","v":{"v":-0.06387434554973823,"d":"-6.39%"}},"Unsuccessful","2019-07-11",{"$nulls":3},"R"]
[7,"2019-06-24",null,"ESCORTS","Buy",549.5,518,545.25,600,"Loss of Rs.4.25/-",-4.25,{"v":-7.7343039126478615E-3,"d":"-0.77%"},"Neutral","2019-07-08",{"$nulls":3},"H"]
[8,"2019-06-25",null,"JUBLFOOD","Buy",1262.5,1158.3,1145,"1450 -1470","Loss of Rs.117.50/-",-117.5,{"v":-0.09306930693069307,"d":"-9.31%"},"Unsuccessful","2019-07-24",{"$nulls":3},"R"]
[9,"2019-07-04",null,"TORNTPHARM","Buy",1545,1454,1638,"1730-1750","Profit of Rs.93/-",{"$f":"H18-F18","v":93},{"$f":"K18/F18","v":{"v":0.06019417475728155,"d":"6.02%"}},"Successful","2019-07-26",{"$nulls":3},"R"]
[10,"2019-07-10",null,"TCS","Buy","2105-2115",1973,null,"2295-2345","Open",{"$nulls":4},{"$f":"VLOOKUP(D19,Sheet2!A6:M1645,6,0)","v":2109.05},null,null,"H"]
[11,"2019-07-11",null,"BAJAJ-AUTO","Buy",2670,2527,2527,"1920-1950","Loss of Rs.143/-",{"$f":"H20-F20","v":-143},{"$f":"K20/F20","v":{"v":-0.05355805243445693,"d":"-5.36%"}},"Unsuccessful","2019-07-22",{"$nulls":3},"R"]
{"$rows_left_out":322}
{"sheet":"Sheet2","index":6,"n_rows":1899,"n_cols":14,"rows_kept":1899,"hidden":true}
["SYMBOL","SERIES","OPEN","HIGH","LOW","CLOSE","LAST","PREVCLOSE","TOTTRDQTY","TOTTRDVAL","TIMESTAMP","TOTALTRADES","ISIN","ISIN"]
["20MICRONS","EQ",35.9,35.9,34.7,35.15,35.05,35.1,7698,272092.8,"2019-07-26",101,"INE144J01027"]
["3IINFOTECH","EQ",2.5,2.65,2.4,2.55,2.55,2.45,1486242,3785973.3,"2019-07-26",616,"INE748C01020"]
["3MINDIA","EQ",20900,21157.65,20743.1,20903.4,20950,21162.15,2335,48721582.85,"2019-07-26",578,"INE470A01017"]
["3PLAND","EQ",7.5,7.85,7.4,7.85,7.65,7.5,1425,10633.85,"2019-07-26",8,"INE105C01023"]
["5PAISA","EQ",195,203,190,195.45,195.75,196.6,11362,2241283.3,"2019-07-26",650,"INE618L01018"]
["63MOONS","EQ",93.3,93.3,88.35,88.9,89.2,92.9,94402,8550672.8,"2019-07-26",1628,"INE111B01023"]
["8KMILES","EQ",66.35,66.35,66.35,66.35,66.35,69.8,67142,4454871.7,"2019-07-26",412,"INE650K01021"]
["A2ZINFRA","EQ",10.1,11.1,9.9,10.8,11,10.35,748407,7776878,"2019-07-26",1103,"INE619I01012"]
["AARTIDRUGS","EQ",487.9,495,480,487,486.4,484.25,7876,3824241.65,"2019-07-26",578,"INE767A01016"]
["AARTIIND","EQ",1661.65,1661.65,1621.05,1638.4,1638.85,1648.05,61817,101071106.45,"2019-07-26",2635,"INE769A01020"]
["AARVEEDEN","EQ",18.15,18.15,16.75,17,17,16.75,4257,74050.8,"2019-07-26",122,"INE273D01019"]
["AAVAS","EQ",1481.1,1481.3,1450,1460.35,1453,1469.5,4453,6523617.45,"2019-07-26",1124,"INE216P01012"]
["ABAN","EQ",31.85,31.85,30.5,30.85,31.1,31.5,99289,3067493.4,"2019-07-26",972,"INE421A01028"]
["ABB","EQ",1410,1428,1370,1382.05,1379.9,1402.8,93398,129778088.5,"2019-07-26",6523,"INE117A01022"]
["ABBOTINDIA","EQ",8673.2,8673.2,8536,8571.7,8570,8599.35,3230,27687836.95,"2019-07-26",324,"INE358A01014"]
["ABCAPITAL","EQ",85.85,87.4,83.55,87.05,87,85.9,1566872,134010540.6,"2019-07-26",19339,"INE674K01013"]
["ABFRL","EQ",202.2,203.7,196,196.85,197,204.95,429929,85711041.25,"2019-07-26",14337,"INE647O01011"]
["ABSLNN50ET","EQ",262.26,266,261.93,265,265,261.93,1968,523377.2,"2019-07-26",9,"INF209KB1B87"]
["ACC","EQ",1585,1589,1568.1,1581.95,1580.5,1585.25,480420,759421683.35,"2019-07-26",30968,"INE012A01025"]
{"$rows_left_out":1680}
{"sheet":"Sheet1","index":7,"n_rows":0,"n_cols":0,"rows_kept":0,"hidden":true}

{"sheet":"Sheet3","index":8,"n_rows":0,"n_cols":0,"rows_kept":0,"hidden":true}

{"sheet":"Sheet4","index":9,"n_rows":0,"n_cols":0,"rows_kept":0,"hidden":true}