{"text_format":"3","workbook":"xlsx","n_sheets":6,"sheets":["Main","Future Intra","Cash Intra","MidCap Intra","Bulk Deals","Call Tracker (Equity & F&O)"],"not_rendered":{"images":2,"defined_names":1},"read":"whole","date_system":"1900"}

{"sheet":"Main","index":0,"n_rows":27,"n_cols":11,"rows_kept":27}
[null,"                                                                                                 "]
{"$rows_empty":8}
[null,"2023-06-28"]
[]
[null,"Sheet No.","Template Name","Summary"]
[null,1,"Future Intra","For Intraday trading in F&O segment"]
[null,2,"Cash Intra","For Intraday trading in cash market segment"]
[null,3,"Mid-cap Intra","For Intraday trading in Mid-cap stocks"]
[null,4,"Bulk Deals","Reveals Bulk Deals carried on NSE & BSE"]
[null,5,"Call Tracker"]
{"$rows_empty":9}
[{"$nulls":10},"`"]

{"sheet":"Future Intra","index":1,"n_rows":236,"n_cols":16,"rows_kept":236,"merged":[[8,0,9,0],[8,1,9,1],[8,2,9,2],[8,3,9,3],[8,6,8,8],[8,9,8,11]]}
[]
[]
[]
[]
[{"$nulls":12},"Back to Main Page"]
["FOR INTRA DAY TRADING",{"$nulls":10},{"$f":"Main!B10","v":"2023-06-28"}]
[]
[]
["Sr.no","Sector","Scrip","Expiry Date","CLOSE RATE","Pivot Point","Supports",null,null,"Resistances"]
[{"$nulls":4},"Point","Point","S1","S2","S3","R1","R2","R3","HIGH","LOW","OI","% Change in OI"]
[1,"Index","NIFTY","2023-06-29",{"v":18811.2,"d":"18811.20"},{"v":18787.86666666667,"d":"18787.87"},{"v":18753.333333333336,"d":"18753.33"},{"v":18695.466666666667,"d":"18695.47"},{"v":18660.933333333334,"d":"18660.93"},{"v":18845.733333333337,"d":"18845.73"},{"v":18880.26666666667,"d":"18880.27"},{"v":18938.13333333334,"d":"18938.13"},18822.4,18730,12317250,{"v":0.08972799377159263,"d":"8.97%"}]
[2,"Index","BANKNIFTY","2023-06-29",44089.45,{"v":43981.81666666667,"d":"43981.82"},{"v":43808.633333333346,"d":"43808.63"},{"v":43527.81666666667,"d":"43527.82"},{"v":43354.633333333346,"d":"43354.63"},{"v":44262.633333333346,"d":"44262.63"},{"v":44435.81666666668,"d":"44435.82"},{"v":44716.633333333346,"d":"44716.63"},44155,43701,3136580,{"v":0.15224151453535895,"d":"15.22%"}]
[3,"Index","FINNIFTY","2023-07-25",19753.55,{"v":19720.13333333333,"d":"19720.13"},{"v":19657.61666666666,"d":"19657.62"},{"v":19561.68333333333,"d":"19561.68"},{"v":19499.16666666666,"d":"19499.17"},{"v":19816.066666666662,"d":"19816.07"},{"v":19878.583333333332,"d":"19878.58"},{"v":19974.516666666663,"d":"19974.52"},19782.65,19624.2,122840,{"v":1.1311589174184593,"d":"113.12%"}]
[4,"Index","MIDCPNIFTY","2023-07-26",{"v":8132.2,"d":"8132.20"},{"v":8123.400000000001,"d":"8123.40"},{"v":8098.800000000001,"d":"8098.80"},{"v":8065.400000000001,"d":"8065.40"},{"v":8040.800000000001,"d":"8040.80"},{"v":8156.800000000001,"d":"8156.80"},{"v":8181.4000000000015,"d":"8181.40"},{"v":8214.800000000001,"d":"8214.80"},8148,8090,17475,{"v":0.5228758169934641,"d":"52.29%"}]
[5,"Chemical","AARTIIND","2023-06-29",507.95,{"v":510.5333333333333,"d":"510.53"},{"v":504.16666666666663,"d":"504.17"},{"v":500.3833333333333,"d":"500.38"},{"v":494.01666666666665,"d":"494.02"},{"v":514.3166666666666,"d":"514.32"},{"v":520.6833333333334,"d":"520.68"},{"v":524.4666666666666,"d":"524.47"},516.9,506.75,7313400,{"v":-0.012129889777393559,"d":"-1.21%"}]
[6,"Capital_Goods","ABB","2023-06-29",4301.55,{"v":4309.599999999999,"d":"4309.60"},{"v":4272.949999999999,"d":"4272.95"},{"v":4244.349999999999,"d":"4244.35"},{"v":4207.699999999999,"d":"4207.70"},{"v":4338.199999999999,"d":"4338.20"},{"v":4374.8499999999985,"d":"4374.85"},{"v":4403.449999999999,"d":"4403.45"},4346.25,4281,1403250,{"v":-0.029564315352697094,"d":"-2.96%"}]
[7,"Pharma","ABBOTINDIA","2023-06-29",{"v":22685.3,"d":"22685.30"},{"v":22750.683333333334,"d":"22750.68"},{"v":22534.666666666668,"d":"22534.67"},{"v":22384.033333333333,"d":"22384.03"},{"v":22168.016666666666,"d":"22168.02"},{"v":22901.31666666667,"d":"22901.32"},{"v":23117.333333333332,"d":"23117.33"},{"v":23267.96666666667,"d":"23267.97"},22966.7,22600.05,59520,{"v":-0.061198738170347,"d":"-6.12%"}]
[8,"Others","ABCAPITAL","2023-06-29",{"v":191.9,"d":"191.90"},188.25,183.75,{"v":175.6,"d":"175.60"},{"v":171.1,"d":"171.10"},{"v":196.4,"d":"196.40"},{"v":200.9,"d":"200.90"},209.05,192.75,180.1,36676800,{"v":-0.006727113190991518,"d":"-0.67%"}]
[9,"Textile","ABFRL","2023-06-29",210.55,{"v":210.5666666666667,"d":"210.57"},{"v":207.83333333333337,"d":"207.83"},{"v":205.11666666666667,"d":"205.12"},{"v":202.38333333333335,"d":"202.38"},{"v":213.2833333333334,"d":"213.28"},{"v":216.01666666666668,"d":"216.02"},{"v":218.7333333333334,"d":"218.73"},213.3,207.85,29572400,{"v":-0.056099585062240664,"d":"-5.61%"}]
[10,"Cement","ACC","2023-06-29",1790.45,{"v":1791.5166666666667,"d":"1791.52"},{"v":1775.9833333333333,"d":"1775.98"},{"v":1761.5166666666667,"d":"1761.52"},{"v":1745.9833333333333,"d":"1745.98"},{"v":1805.9833333333333,"d":"1805.98"},{"v":1821.5166666666667,"d":"1821.52"},{"v":1835.9833333333333,"d":"1835.98"},1807.05,1777.05,4609200,{"v":-3.6316472114137485E-3,"d":"-0.36%"}]
{"$rows_left_out":202}
{"sheet":"Cash Intra","index":2,"n_rows":246,"n_cols":13,"rows_kept":246,"merged":[[7,0,8,0],[7,1,8,1],[7,2,8,2],[7,3,8,3],[7,4,7,6],[7,7,7,9]]}
[]
[]
[]
[]
[{"$nulls":12},"Back to Main Page"]
["FOR INTRA DAY TRADING",{"$nulls":9},{"$f":"Main!B10","v":"2023-06-28"}]
[]
["Sr.no",null,"CLOSE RATE","Pivot Point","Supports",null,null,"Resistances"]
[{"$nulls":4},"S1","S2","S3","R1","R2","R3","HIGH","LOW","Total Trade Quanity in Lakhs"]
[1,"Nifty 50",{"v":18817.4,"d":"18817.40"},{"v":18786.966666666667,"d":"18786.97"},{"v":18744.683333333334,"d":"18744.68"},{"v":18671.966666666667,"d":"18671.97"},{"v":18629.683333333334,"d":"18629.68"},{"v":18859.683333333334,"d":"18859.68"},{"v":18901.966666666667,"d":"18901.97"},{"v":18974.683333333334,"d":"18974.68"},18829.25,18714.25]
[2,"Nifty Bank",{"v":44121.5,"d":"44121.50"},{"v":44003.1,"d":"44003.10"},{"v":43811.549999999996,"d":"43811.55"},{"v":43501.6,"d":"43501.60"},{"v":43310.049999999996,"d":"43310.05"},{"v":44313.049999999996,"d":"44313.05"},{"v":44504.6,"d":"44504.60"},{"v":44814.549999999996,"d":"44814.55"},44194.65,43693.15]
[3,"Nifty CPSE",{"v":3181.5,"d":"3181.50"},{"v":3185.9,"d":"3185.90"},{"v":3171.7000000000003,"d":"3171.70"},{"v":3161.9,"d":"3161.90"},{"v":3147.7000000000003,"d":"3147.70"},{"v":3195.7000000000003,"d":"3195.70"},{"v":3209.9,"d":"3209.90"},{"v":3219.7000000000003,"d":"3219.70"},{"v":3200.1,"d":"3200.10"},{"v":3176.1,"d":"3176.10"}]
[4,"Nifty Infra",5634.85,{"v":5632.400000000001,"d":"5632.40"},{"v":5623.200000000001,"d":"5623.20"},5611.55,5602.35,{"v":5644.050000000001,"d":"5644.05"},5653.25,{"v":5664.9000000000015,"d":"5664.90"},{"v":5641.6,"d":"5641.60"},5620.75]
[5,"Nifty IT",28800.15,{"v":28750.816666666666,"d":"28750.82"},{"v":28679.783333333333,"d":"28679.78"},{"v":28559.416666666668,"d":"28559.42"},{"v":28488.383333333335,"d":"28488.38"},{"v":28871.18333333333,"d":"28871.18"},{"v":28942.216666666664,"d":"28942.22"},{"v":29062.58333333333,"d":"29062.58"},28821.85,28630.45]
[6,"Nifty PSE",{"v":4970.1,"d":"4970.10"},{"v":4973.150000000001,"d":"4973.15"},{"v":4959.250000000001,"d":"4959.25"},{"v":4948.400000000001,"d":"4948.40"},{"v":4934.500000000001,"d":"4934.50"},{"v":4984.000000000001,"d":"4984.00"},{"v":4997.900000000001,"d":"4997.90"},{"v":5008.750000000001,"d":"5008.75"},4987.05,{"v":4962.3,"d":"4962.30"}]
[7,"Nifty Midcap 50",{"v":9945.1,"d":"9945.10"},{"v":9934.483333333334,"d":"9934.48"},{"v":9911.416666666668,"d":"9911.42"},{"v":9877.733333333334,"d":"9877.73"},{"v":9854.666666666668,"d":"9854.67"},{"v":9968.166666666668,"d":"9968.17"},{"v":9991.233333333334,"d":"9991.23"},{"v":10024.916666666668,"d":"10024.92"},9957.55,{"v":9900.8,"d":"9900.80"}]
[8,"ABB",4294.5,{"v":4303.833333333333,"d":"4303.83"},{"v":4260.666666666666,"d":"4260.67"},{"v":4226.833333333333,"d":"4226.83"},{"v":4183.666666666666,"d":"4183.67"},{"v":4337.666666666666,"d":"4337.67"},{"v":4380.833333333332,"d":"4380.83"},{"v":4414.666666666666,"d":"4414.67"},4347,4270,2.17841]
[9,"ABBOTINDIA",22707.8,{"v":22785.683333333334,"d":"22785.68"},{"v":22554.166666666668,"d":"22554.17"},{"v":22400.533333333333,"d":"22400.53"},{"v":22169.016666666666,"d":"22169.02"},{"v":22939.31666666667,"d":"22939.32"},{"v":23170.833333333332,"d":"23170.83"},{"v":23324.46666666667,"d":"23324.47"},23017.2,22632.05,0.18854]
[10,"ABCAPITAL",192.3,{"v":188.4666666666667,"d":"188.47"},{"v":183.63333333333338,"d":"183.63"},{"v":174.9666666666667,"d":"174.97"},{"v":170.13333333333338,"d":"170.13"},{"v":197.13333333333338,"d":"197.13"},{"v":201.9666666666667,"d":"201.97"},{"v":210.63333333333338,"d":"210.63"},193.3,179.8,290.42894]
[11,"ABFRL",210.9,{"v":210.5666666666667,"d":"210.57"},{"v":207.83333333333337,"d":"207.83"},{"v":204.76666666666668,"d":"204.77"},{"v":202.03333333333336,"d":"202.03"},{"v":213.63333333333338,"d":"213.63"},{"v":216.36666666666667,"d":"216.37"},{"v":219.4333333333334,"d":"219.43"},213.3,207.5,40.6287]
{"$rows_left_out":227}
{"sheet":"MidCap Intra","index":3,"n_rows":531,"n_cols":13,"rows_kept":531,"merged":[[0,0,0,1],[8,0,9,0],[8,1,9,1],[8,2,9,2],[8,3,9,3],[8,4,8,6],[8,7,8,9]]}
[]
[]
[]
[]
[{"$nulls":11},"Back To Main Page"]
["FOR INTRA DAY TRADING",{"$nulls":9},{"$f":"Main!B10","v":"2023-06-28"}]
[null,null," "]
[]
["Sr.no","Scrip","CLOSE RATE","Pivot Point","Supports",null,null,"Resistances"]
[{"$nulls":4},"S1","S2","S3","R1","R2","R3","HIGH","LOW","Total Trade Quanity in Lakhs"]
[1,"360ONE",456.7,455.25,451.55,{"v":446.40000000000003,"d":"446.40"},{"v":442.70000000000005,"d":"442.70"},{"v":460.4,"d":"460.40"},{"v":464.1,"d":"464.10"},{"v":469.24999999999994,"d":"469.25"},458.95,450.1,3.57643]
[2,"3MINDIA",27680.85,{"v":27616.933333333334,"d":"27616.93"},{"v":27483.916666666668,"d":"27483.92"},{"v":27286.983333333334,"d":"27286.98"},{"v":27153.966666666667,"d":"27153.97"},{"v":27813.86666666667,"d":"27813.87"},{"v":27946.88333333333,"d":"27946.88"},{"v":28143.81666666667,"d":"28143.82"},27749.95,27420,0.01761]
[3,"AARTIDRUGS",445.6,{"v":447.61666666666673,"d":"447.62"},{"v":441.93333333333345,"d":"441.93"},{"v":438.2666666666667,"d":"438.27"},{"v":432.5833333333334,"d":"432.58"},{"v":451.2833333333335,"d":"451.28"},{"v":456.96666666666675,"d":"456.97"},{"v":460.6333333333335,"d":"460.63"},453.3,443.95,1.88295]
[4,"AARTIIND",507.45,{"v":509.7166666666667,"d":"509.72"},{"v":503.73333333333335,"d":"503.73"},{"v":500.01666666666665,"d":"500.02"},{"v":494.0333333333333,"d":"494.03"},{"v":513.4333333333334,"d":"513.43"},{"v":519.4166666666667,"d":"519.42"},{"v":523.1333333333334,"d":"523.13"},515.7,506,13.07198]
[5,"AAVAS",1508.75,{"v":1498.7666666666667,"d":"1498.77"},{"v":1460.5333333333333,"d":"1460.53"},{"v":1412.3166666666666,"d":"1412.32"},{"v":1374.0833333333333,"d":"1374.08"},{"v":1546.9833333333333,"d":"1546.98"},{"v":1585.2166666666665,"d":"1585.22"},{"v":1633.4333333333334,"d":"1633.43"},1537,1450.55,11.23978]
[6,"ABB",4294.5,{"v":4303.833333333333,"d":"4303.83"},{"v":4260.666666666666,"d":"4260.67"},{"v":4226.833333333333,"d":"4226.83"},{"v":4183.666666666666,"d":"4183.67"},{"v":4337.666666666666,"d":"4337.67"},{"v":4380.833333333332,"d":"4380.83"},{"v":4414.666666666666,"d":"4414.67"},4347,4270,2.17841]
[7,"ABBOTINDIA",22707.8,{"v":22785.683333333334,"d":"22785.68"},{"v":22554.166666666668,"d":"22554.17"},{"v":22400.533333333333,"d":"22400.53"},{"v":22169.016666666666,"d":"22169.02"},{"v":22939.31666666667,"d":"22939.32"},{"v":23170.833333333332,"d":"23170.83"},{"v":23324.46666666667,"d":"23324.47"},23017.2,22632.05,0.18854]
[8,"ABCAPITAL",192.3,{"v":188.4666666666667,"d":"188.47"},{"v":183.63333333333338,"d":"183.63"},{"v":174.9666666666667,"d":"174.97"},{"v":170.13333333333338,"d":"170.13"},{"v":197.13333333333338,"d":"197.13"},{"v":201.9666666666667,"d":"201.97"},{"v":210.63333333333338,"d":"210.63"},193.3,179.8,290.42894]
[9,"ABFRL",210.9,{"v":210.5666666666667,"d":"210.57"},{"v":207.83333333333337,"d":"207.83"},{"v":204.76666666666668,"d":"204.77"},{"v":202.03333333333336,"d":"202.03"},{"v":213.63333333333338,"d":"213.63"},{"v":216.36666666666667,"d":"216.37"},{"v":219.4333333333334,"d":"219.43"},213.3,207.5,40.6287]
[10,"ACC",1788.6,{"v":1788.7,"d":"1788.70"},{"v":1775.4,"d":"1775.40"},{"v":1762.2,"d":"1762.20"},{"v":1748.9,"d":"1748.90"},{"v":1801.9,"d":"1801.90"},{"v":1815.1999999999998,"d":"1815.20"},{"v":1828.4,"d":"1828.40"},1802,1775.5,6.98909]
{"$rows_left_out":512}
{"sheet":"Bulk Deals","index":4,"n_rows":129,"n_cols":8,"rows_kept":129,"merged":[[4,0,4,1],[4,2,4,3],[6,1,6,2]]}
[" "]
[]
[]
[]
[]
[{"$nulls":4},"Back To Main Page"]
["Subject :","BULK DEAL",null,{"$f":"Main!B10","v":"2023-06-28"}]
[]
["Date","Scrip code","Scrip Name","Client Name","Buy / Sell","Quantity Traded","Trade Price / Wt.Avg.trade price","Exchange  "]
["2023-06-27",538465,"AMARSEC","AAMIR IQBAL GAUR","SELL",{"v":16700,"d":"16,700"},28,"BSE"]
["2023-06-27",543920,"CFF","ARYAMAN BROKING LIMITED","SELL",{"v":104000,"d":"104,000"},184.29,"BSE"]
["2023-06-27",543920,"CFF","ARYAMAN BROKING LIMITED","BUY",800,182.45,"BSE"]
["2023-06-27",538868,"CSL","SUMAN BAGRA","SELL",{"v":165000,"d":"165,000"},7.95,"BSE"]
["2023-06-27",531380,"CSURGSU","VIJAY KALIDAS MAJREKAR","BUY",{"v":51326,"d":"51,326"},64.15,"BSE"]
["2023-06-27",531380,"CSURGSU","VIPUL NAVINCHANDRA SHAH","SELL",{"v":28849,"d":"28,849"},64.15,"BSE"]
["2023-06-27",516003,"DUROPLY","AMODINI SALES PRIVATE LIMITED","BUY",{"v":82550,"d":"82,550"},202.3,"BSE"]
["2023-06-27",516003,"DUROPLY","CUCKOO FISCAL SERVICES LIMITED","SELL",{"v":90000,"d":"90,000"},202.52,"BSE"]
["2023-06-27",542724,"EARUM","DIPAK MATHURBHAI SALVI","BUY",{"v":28313,"d":"28,313"},2.28,"BSE"]
["2023-06-27",542724,"EARUM","DIPAK MATHURBHAI SALVI","SELL",{"v":505313,"d":"505,313"},2.21,"BSE"]
["2023-06-27",542724,"EARUM","MALTI SALVI","BUY",{"v":609730,"d":"609,730"},2.37,"BSE"]
{"$rows_left_out":110}
{"sheet":"Call Tracker (Equity & F&O)","index":5,"n_rows":343,"n_cols":18,"rows_kept":343,"merged":[[96,0,97,0],[96,1,97,1],[96,9,97,9],[96,12,97,12],[96,13,97,13],[96,14,97,14],[96,15,97,15],[119,0,120,0],[119,1,120,1],[119,9,120,9],[119,14,120,14]]}
[]
[]
[]
[]
[{"$nulls":12},"Back To Main Page"]
["Retail Research Technical Calls & Fundamental Performance Report for the month of June-2023"]
[{"$nulls":12},{"$f":"Main!B10","v":"2023-06-28"}]
[null,"Positional  Call"]
["Sr.no","Date",null,"Company","Rec","Rec Price","Stop Loss***","Call Closed At","Target","Remark","Profit / Loss per Share","All charges","Net Gain / Loss  %","Status","Closed Date","Market Closing Price"]
[1,"2023-05-12",null,"SBIN","Accu","562-574",538,null,"600-630","Open",{"$nulls":5},{"$f":"VLOOKUP(D10,'MidCap Intra'!B39:C538,2,0)","v":{"v":566.1,"d":"566.10"}},null,"H"]
[2,"2023-05-22",null,"JSWSTEEL","Accu",691,637,732,"740-780","Profit of Rs.41/-",{"$f":"H11-F11","v":41},{"$f":"(F11*-0.7)/100","v":{"v":-4.837,"d":"-4.84"}},{"$f":"(K11+L11)/F11","v":{"v":0.05233429811866859,"d":"5.23%"}},"Successful","2023-06-07",null,null,"H"]
[3,"2023-05-31",null,"GSFC","Accu",157,144,166.5,"170-175","Profit of Rs.9.5/-",{"$f":"H12-F12","v":9.5},{"$f":"(F12*-0.7)/100","v":{"v":-1.099,"d":"-1.10"}},{"$f":"(K12+L12)/F12","v":{"v":0.05350955414012739,"d":"5.35%"}},"Successful","2023-06-21",null,null,"H"]
[4,"2023-06-05",null,"REDINGTON","Accu",180.5,164,193.5,"195-200","Profit of Rs.13/-",{"$f":"H13-F13","v":13},{"$f":"(F13*-0.7)/100","v":{"v":-1.2634999999999998,"d":"-1.26"}},{"$f":"(K13+L13)/F13","v":{"v":0.06502216066481994,"d":"6.50%"}},"Successful","2023-06-14",null,null,"H"]
[5,"2023-06-07",null,"UBL","Accu","1435-1495",1385,null,"1600-1650","Open",{"$nulls":5},{"$f":"VLOOKUP(D14,'MidCap Intra'!B43:C542,2,0)","v":1498.75},null,"H"]
[6,"2023-06-09",null,"KNRCON","Accu",230,200,248,"270-290","Profit of Rs.18/-",{"$f":"H15-F15","v":18},{"$f":"(F15*-0.7)/100","v":-1.61},{"$f":"(K15+L15)/F15","v":{"v":0.07126086956521739,"d":"7.13%"}},"Successful","2023-06-19",null,null,"H"]
[7,"2023-06-12",null,"SUMICHEM","Accu",401,370,423,"430-450","Profit of Rs.22/-",{"$f":"H16-F16","v":22},{"$f":"(F16*-0.7)/100","v":{"v":-2.807,"d":"-2.81"}},{"$f":"(K16+L16)/F16","v":{"v":0.047862842892768084,"d":"4.79%"}},"Successful","2023-06-19",null,null,"H"]
[8,"2023-06-13",null,"BAYERCROP","Accu","4015-4215",3900,null,"4500-4600","Open",{"$nulls":5},{"$f":"VLOOKUP(D17,'MidCap Intra'!B46:C545,2,0)","v":4325.75},null,"H"]
[9,"2023-06-15",null,"ATUL","Accu","6650-6950",6400,null,"7400-7600","Open",{"$nulls":5},{"$f":"VLOOKUP(D18,'MidCap Intra'!B47:C546,2,0)","v":6994.05},null,"H"]
[10,"2023-06-15",null,"OBEROIRLTY","Accu","990-1030",930,null,"1150-1200","Open",{"$nulls":5},{"$f":"VLOOKUP(D19,'MidCap Intra'!B48:C547,2,0)","v":984.15},null,"H"]
[11,"2023-06-16",null,"IGL","Accu",465,434,490.5,"500-520","Profit of Rs.25.5/-",{"$f":"H20-F20","v":25.5},{"$f":"(F20*-0.7)/100","v":{"v":-3.255,"d":"-3.26"}},{"$f":"(K20+L20)/F20","v":{"v":0.04783870967741936,"d":"4.78%"}},"Successful","2023-06-22",null,null,"H"]
{"$rows_left_out":316}