{"text_format":"3","workbook":"xlsx","n_sheets":11,"sheets":["Main","Future Intra","Cash Intra","MidCap Intra","Bulk Deals","Call Tracker (Equity & F&O)","Sheet2","Sheet1","Sheet3","Sheet4","Sheet5"],"not_rendered":{"images":4,"defined_names":5},"read":"whole","date_system":"1900"}

{"sheet":"Main","index":0,"n_rows":27,"n_cols":11,"rows_kept":27}
[null,"                                                                                                 "]
{"$rows_empty":8}
[null,"2019-10-27"]
[]
[null,"Sheet No.","Template Name","Summary"]
[null,1,"Future Intra","For Intraday trading in F&O segment"]
[null,2,"Cash Intra","For Intraday trading in cash market segment"]
[null,3,"Mid-cap Intra","For Intraday trading in Mid-cap stocks"]
[null,4,"Bulk Deals","Reveals Bulk Deals carried on NSE & BSE"]
[null,5,"Call Tracker"]
{"$rows_empty":9}
[{"$nulls":10},"`"]

{"sheet":"Future Intra","index":1,"n_rows":193,"n_cols":15,"rows_kept":193,"merged":[[8,0,9,0],[8,1,9,1],[8,2,9,2],[8,5,8,7],[8,8,8,10]]}
[]
[]
[]
[]
[{"$nulls":12},"Back to Main Page"]
["FOR INTRA DAY TRADING",{"$nulls":10},{"$f":"Main!B10","v":"2019-10-27"}]
[]
[]
["Sr.no","Sector","Scrip","CLOSE RATE","Pivot Point","Supports",null,null,"Resistances"]
[null,"Sector",null,"Point","Point","S1","S2","S3","R1","R2","R3","HIGH","LOW","OI","% Change in OI"]
[1,"Index","BANKNIFTY",29431.85,{"v":29274.816666666666,"d":"29274.82"},{"v":29069.63333333333,"d":"29069.63"},{"v":28707.416666666664,"d":"28707.42"},{"v":28502.23333333333,"d":"28502.23"},{"v":29637.033333333333,"d":"29637.03"},{"v":29842.216666666667,"d":"29842.22"},{"v":30204.433333333334,"d":"30204.43"},29480,28912.6,1349880,{"v":-0.1567044829826578,"d":"-15.67%"}]
[2,"Index","NIFTY",11608.95,11583.85,{"v":11527.7,"d":"11527.70"},11446.45,{"v":11390.300000000001,"d":"11390.30"},{"v":11665.1,"d":"11665.10"},{"v":11721.249999999998,"d":"11721.25"},{"v":11802.5,"d":"11802.50"},11640,11502.6,16290225,{"v":-0.014111805076437053,"d":"-1.41%"}]
[3,"Index","NIFTYIT",{"v":14965,"d":"14965.00"},{"v":14915.666666666666,"d":"14915.67"},{"v":14832.333333333332,"d":"14832.33"},{"v":14699.666666666666,"d":"14699.67"},{"v":14616.333333333332,"d":"14616.33"},{"v":15048.333333333332,"d":"15048.33"},{"v":15131.666666666664,"d":"15131.67"},{"v":15264.333333333332,"d":"15264.33"},14999,14783,19600,{"v":-0.12694877505567928,"d":"-12.69%"}]
[4,"Cement","ACC",{"v":1523,"d":"1523.00"},{"v":1517.6833333333334,"d":"1517.68"},{"v":1507.3666666666668,"d":"1507.37"},{"v":1491.7333333333333,"d":"1491.73"},{"v":1481.4166666666667,"d":"1481.42"},{"v":1533.3166666666668,"d":"1533.32"},{"v":1543.6333333333334,"d":"1543.63"},{"v":1559.2666666666669,"d":"1559.27"},1528,1502.05,2362800,{"v":0.01967892283790782,"d":"1.97%"}]
[5,"Others","ADANIENT",181.15,{"v":180.85000000000002,"d":"180.85"},{"v":177.90000000000003,"d":"177.90"},174.65,{"v":171.70000000000002,"d":"171.70"},{"v":184.10000000000005,"d":"184.10"},{"v":187.05000000000004,"d":"187.05"},{"v":190.30000000000007,"d":"190.30"},183.8,177.6,34236000,{"v":-0.009375,"d":"-0.94%"}]
[6,"Others","ADANIPORTS",399.75,{"v":399.73333333333335,"d":"399.73"},{"v":397.3166666666667,"d":"397.32"},{"v":394.8833333333334,"d":"394.88"},{"v":392.46666666666675,"d":"392.47"},{"v":402.1666666666667,"d":"402.17"},{"v":404.5833333333333,"d":"404.58"},{"v":407.01666666666665,"d":"407.02"},402.15,397.3,13112500,{"v":-0.02054154995331466,"d":"-2.05%"}]
[7,"Power","ADANIPOWER",64.35,{"v":64.08333333333333,"d":"64.08"},{"v":63.36666666666666,"d":"63.37"},{"v":62.38333333333333,"d":"62.38"},{"v":61.666666666666664,"d":"61.67"},{"v":65.06666666666666,"d":"65.07"},{"v":65.78333333333333,"d":"65.78"},{"v":66.76666666666665,"d":"66.77"},64.8,63.1,96920000,{"v":0.005185646131507986,"d":"0.52%"}]
[8,"Automobile","AMARAJABAT",652.65,{"v":655.0833333333334,"d":"655.08"},{"v":646.4166666666667,"d":"646.42"},{"v":640.1833333333334,"d":"640.18"},{"v":631.5166666666668,"d":"631.52"},{"v":661.3166666666667,"d":"661.32"},{"v":669.9833333333335,"d":"669.98"},{"v":676.2166666666667,"d":"676.22"},663.75,648.85,1831200,{"v":0.07433264887063655,"d":"7.43%"}]
[9,"Cement","AMBUJACEM",{"v":197.2,"d":"197.20"},{"v":197.0666666666667,"d":"197.07"},{"v":195.23333333333338,"d":"195.23"},{"v":193.26666666666668,"d":"193.27"},{"v":191.43333333333337,"d":"191.43"},{"v":199.0333333333334,"d":"199.03"},{"v":200.8666666666667,"d":"200.87"},{"v":202.8333333333334,"d":"202.83"},198.9,195.1,21117500,{"v":-0.01630371491789915,"d":"-1.63%"}]
[10,"Others","APOLLOHOSP",{"v":1521.8,"d":"1521.80"},{"v":1524.5833333333333,"d":"1524.58"},{"v":1505.2166666666665,"d":"1505.22"},{"v":1488.6333333333332,"d":"1488.63"},{"v":1469.2666666666664,"d":"1469.27"},{"v":1541.1666666666665,"d":"1541.17"},{"v":1560.5333333333333,"d":"1560.53"},{"v":1577.1166666666666,"d":"1577.12"},1543.95,1508,1329500,{"v":-5.981308411214953E-3,"d":"-0.60%"}]
{"$rows_left_out":160}
{"sheet":"Cash Intra","index":2,"n_rows":247,"n_cols":13,"rows_kept":247,"merged":[[7,0,8,0],[7,1,8,1],[7,2,8,2],[7,3,8,3],[7,4,7,6],[7,7,7,9]]}
[]
[]
[]
[]
[{"$nulls":12},"Back to Main Page"]
["FOR INTRA DAY TRADING",{"$nulls":9},{"$f":"Main!B10","v":"2019-10-27"}]
[]
["Sr.no","Scrip","CLOSE RATE","Pivot Point","Supports",null,null,"Resistances"]
[null,null,"Point",null,"S1","S2","S3","R1","R2","R3","HIGH","LOW","Total Trade Quanity in Lakhs"]
[1,"Nifty 50",11583.9,11573.85,{"v":11500.800000000001,"d":"11500.80"},{"v":11417.7,"d":"11417.70"},{"v":11344.650000000001,"d":"11344.65"},11656.95,{"v":11730,"d":"11730.00"},{"v":11813.1,"d":"11813.10"},11646.9,11490.75]
[2,"Nifty Bank",29395.95,{"v":29257.283333333336,"d":"29257.28"},{"v":29062.466666666674,"d":"29062.47"},{"v":28728.983333333337,"d":"28728.98"},{"v":28534.166666666675,"d":"28534.17"},{"v":29590.766666666674,"d":"29590.77"},{"v":29785.583333333332,"d":"29785.58"},{"v":30119.066666666673,"d":"30119.07"},29452.1,28923.8]
[3,"Nifty CPSE",2011.25,{"v":2012.1833333333332,"d":"2012.18"},{"v":1996.6666666666663,"d":"1996.67"},{"v":1982.083333333333,"d":"1982.08"},{"v":1966.5666666666662,"d":"1966.57"},{"v":2026.7666666666664,"d":"2026.77"},{"v":2042.2833333333333,"d":"2042.28"},{"v":2056.866666666667,"d":"2056.87"},2027.7,1997.6]
[4,"Nifty Infra",3253.1,{"v":3256.2333333333336,"d":"3256.23"},{"v":3232.816666666667,"d":"3232.82"},{"v":3212.5333333333333,"d":"3212.53"},{"v":3189.116666666667,"d":"3189.12"},{"v":3276.5166666666673,"d":"3276.52"},{"v":3299.9333333333334,"d":"3299.93"},{"v":3320.2166666666676,"d":"3320.22"},3279.65,3235.95]
[5,"Nifty IT",14898.85,{"v":14854.483333333332,"d":"14854.48"},{"v":14765.216666666664,"d":"14765.22"},{"v":14631.583333333332,"d":"14631.58"},{"v":14542.316666666664,"d":"14542.32"},{"v":14988.116666666663,"d":"14988.12"},{"v":15077.38333333333,"d":"15077.38"},{"v":15211.016666666663,"d":"15211.02"},14943.75,14720.85]
[6,"Nifty PSE",3351.65,{"v":3348.283333333333,"d":"3348.28"},{"v":3326.3166666666657,"d":"3326.32"},{"v":3300.9833333333327,"d":"3300.98"},{"v":3279.0166666666655,"d":"3279.02"},{"v":3373.616666666666,"d":"3373.62"},{"v":3395.583333333333,"d":"3395.58"},{"v":3420.916666666666,"d":"3420.92"},3370.25,3322.95]
[7,"Nifty Midcap 50",4447.3,4445.55,{"v":4421.150000000001,"d":"4421.15"},{"v":4395,"d":"4395.00"},{"v":4370.6,"d":"4370.60"},{"v":4471.700000000001,"d":"4471.70"},{"v":4496.1,"d":"4496.10"},{"v":4522.250000000001,"d":"4522.25"},4469.95,4419.4]
[8,"ACC",1518.4,{"v":1514.7833333333335,"d":"1514.78"},{"v":1504.616666666667,"d":"1504.62"},{"v":1490.8333333333335,"d":"1490.83"},{"v":1480.666666666667,"d":"1480.67"},{"v":1528.566666666667,"d":"1528.57"},{"v":1538.7333333333336,"d":"1538.73"},{"v":1552.516666666667,"d":"1552.52"},1524.95,1501,6.45397]
[9,"AUBANK",688.4,{"v":685.4499999999999,"d":"685.45"},{"v":675.9499999999998,"d":"675.95"},{"v":663.4999999999999,"d":"663.50"},{"v":653.9999999999998,"d":"654.00"},{"v":697.8999999999999,"d":"697.90"},{"v":707.4000000000001,"d":"707.40"},{"v":719.8499999999999,"d":"719.85"},694.95,673,4.86059]
[10,"ADANIPORTS",398.95,{"v":399.5833333333333,"d":"399.58"},{"v":396.21666666666664,"d":"396.22"},{"v":393.48333333333335,"d":"393.48"},{"v":390.1166666666667,"d":"390.12"},{"v":402.3166666666666,"d":"402.32"},{"v":405.6833333333333,"d":"405.68"},{"v":408.4166666666666,"d":"408.42"},402.95,396.85,32.72059]
[11,"ADANIPOWER",64.2,{"v":64.11666666666666,"d":"64.12"},{"v":63.23333333333332,"d":"63.23"},{"v":62.26666666666666,"d":"62.27"},{"v":61.38333333333332,"d":"61.38"},{"v":65.08333333333331,"d":"65.08"},{"v":65.96666666666667,"d":"65.97"},{"v":66.93333333333332,"d":"66.93"},65,63.15,67.67043]
{"$rows_left_out":228}
{"sheet":"MidCap Intra","index":3,"n_rows":545,"n_cols":13,"rows_kept":545,"merged":[[0,0,0,1],[8,0,9,0],[8,1,9,1],[8,2,9,2],[8,3,9,3],[8,4,8,6],[8,7,8,9]]}
[]
[]
[]
[]
[{"$nulls":11},"Back To Main Page"]
["FOR INTRA DAY TRADING",{"$nulls":9},{"$f":"Main!B10","v":"2019-10-27"}]
[null,null," "]
[]
["Sr.no","Scrip","CLOSE RATE","Pivot Point","Supports",null,null,"Resistances"]
[null,null,"Point",null,"S1","S2","S3","R1","R2","R3","HIGH","LOW","Total Trade Quanity in Lakhs"]
[1,"3MINDIA",21898.1,21621.75,{"v":21178.5,"d":"21178.50"},{"v":20458.9,"d":"20458.90"},20015.65,22341.35,{"v":22784.6,"d":"22784.60"},{"v":23504.199999999997,"d":"23504.20"},22065,20902.15,0.04425]
[2,"ACC",1518.4,{"v":1514.7833333333335,"d":"1514.78"},{"v":1504.616666666667,"d":"1504.62"},{"v":1490.8333333333335,"d":"1490.83"},{"v":1480.666666666667,"d":"1480.67"},{"v":1528.566666666667,"d":"1528.57"},{"v":1538.7333333333336,"d":"1538.73"},{"v":1552.516666666667,"d":"1552.52"},1524.95,1501,6.45397]
[3,"AIAENG",1672.7,{"v":1664.8,"d":"1664.80"},{"v":1648.8999999999999,"d":"1648.90"},{"v":1625.1,"d":"1625.10"},{"v":1609.1999999999998,"d":"1609.20"},{"v":1688.6,"d":"1688.60"},{"v":1704.5,"d":"1704.50"},{"v":1728.3,"d":"1728.30"},1680.7,1641,0.15163]
[4,"APLAPOLLO",1388.05,{"v":1387.6833333333334,"d":"1387.68"},{"v":1375.3666666666668,"d":"1375.37"},{"v":1362.6833333333334,"d":"1362.68"},{"v":1350.3666666666668,"d":"1350.37"},{"v":1400.3666666666668,"d":"1400.37"},{"v":1412.6833333333334,"d":"1412.68"},{"v":1425.3666666666668,"d":"1425.37"},1400,1375,0.09331]
[5,"AUBANK",688.4,{"v":685.4499999999999,"d":"685.45"},{"v":675.9499999999998,"d":"675.95"},{"v":663.4999999999999,"d":"663.50"},{"v":653.9999999999998,"d":"654.00"},{"v":697.8999999999999,"d":"697.90"},{"v":707.4000000000001,"d":"707.40"},{"v":719.8499999999999,"d":"719.85"},694.95,673,4.86059]
[6,"AAVAS",1624.1,{"v":1622.9333333333334,"d":"1622.93"},{"v":1586.8666666666668,"d":"1586.87"},{"v":1549.6333333333334,"d":"1549.63"},{"v":1513.5666666666668,"d":"1513.57"},{"v":1660.1666666666667,"d":"1660.17"},{"v":1696.2333333333333,"d":"1696.23"},{"v":1733.4666666666667,"d":"1733.47"},1659,1585.7,0.49684]
[7,"ABBOTINDIA",11407.25,{"v":11342.416666666666,"d":"11342.42"},{"v":11190.833333333332,"d":"11190.83"},{"v":10974.416666666666,"d":"10974.42"},{"v":10822.833333333332,"d":"10822.83"},{"v":11558.833333333332,"d":"11558.83"},{"v":11710.416666666664,"d":"11710.42"},{"v":11926.833333333332,"d":"11926.83"},11494,11126,0.15152]
[8,"ADANIGAS",146.75,{"v":146.98333333333332,"d":"146.98"},{"v":144.51666666666665,"d":"144.52"},{"v":142.28333333333333,"d":"142.28"},{"v":139.81666666666666,"d":"139.82"},{"v":149.21666666666664,"d":"149.22"},{"v":151.68333333333328,"d":"151.68"},{"v":153.91666666666663,"d":"153.92"},149.45,144.75,7.12618]
[9,"ADANIGREEN",88.95,{"v":89.01666666666667,"d":"89.02"},{"v":84.93333333333334,"d":"84.93"},{"v":80.91666666666667,"d":"80.92"},{"v":76.83333333333334,"d":"76.83"},{"v":93.03333333333333,"d":"93.03"},{"v":97.11666666666667,"d":"97.12"},{"v":101.13333333333333,"d":"101.13"},93.1,85,31.9258]
[10,"ADANIPORTS",398.95,{"v":399.5833333333333,"d":"399.58"},{"v":396.21666666666664,"d":"396.22"},{"v":393.48333333333335,"d":"393.48"},{"v":390.1166666666667,"d":"390.12"},{"v":402.3166666666666,"d":"402.32"},{"v":405.6833333333333,"d":"405.68"},{"v":408.4166666666666,"d":"408.42"},402.95,396.85,32.72059]
{"$rows_left_out":513}
{"sheet":"Bulk Deals","index":4,"n_rows":42,"n_cols":8,"rows_kept":42,"merged":[[4,0,4,1],[4,2,4,3],[6,1,6,2]]}
[" "]
[]
[]
[]
[]
[{"$nulls":4},"Back To Main Page"]
["Subject :","BULK DEAL",null,{"$f":"Main!B10","v":"2019-10-27"}]
[]
["Date","Scrip code","Scrip Name","Client Name","Buy / Sell","Quantity Traded","Trade Price / Wt.Avg.trade price","Exchange  "]
["2019-10-25",511463,"ALEXANDER","KAHAR NIKLESH KANAIYABHAI","BUY",{"v":54076,"d":"54,076"},18.76,"BSE"]
["2019-10-25",511463,"ALEXANDER","KAHAR NIKLESH KANAIYABHAI","SELL",{"v":3692,"d":"3,692"},18.66,"BSE"]
["2019-10-25",539770,"DARJEELING","DEEPAK CHHANALAL SHAH (HUF)","BUY",{"v":16750,"d":"16,750"},86.62,"BSE"]
["2019-10-25",539770,"DARJEELING","PINKYBEN KETANKUMAR TRIVEDI","SELL",{"v":16750,"d":"16,750"},86.62,"BSE"]
["2019-10-25",542724,"EARUM","ATULKUMAR A PATEL","SELL",{"v":33000,"d":"33,000"},58.75,"BSE"]
["2019-10-25",542724,"EARUM","YASH DEEPAKKUMAR JAIN","SELL",{"v":33000,"d":"33,000"},59.43,"BSE"]
["2019-10-25",542446,"JONJUA","BADAMILAL BANSHILAL GARG","BUY",{"v":31200,"d":"31,200"},30.33,"BSE"]
["2019-10-25",542446,"JONJUA","BADAMILAL BANSHILAL GARG","SELL",{"v":31200,"d":"31,200"},30.23,"BSE"]
["2019-10-25",538765,"JSHL","VIVEK DWIVEDI","BUY",{"v":80000,"d":"80,000"},10.12,"BSE"]
["2019-10-25",538765,"JSHL","VIVEK DWIVEDI","SELL",{"v":70000,"d":"70,000"},10.12,"BSE"]
["2019-10-25",500245,"KIRLFER","HDFC MUTUAL FUND","BUY",{"v":1000000,"d":"1,000,000"},60.22,"BSE"]
{"$rows_left_out":23}
{"sheet":"Call Tracker (Equity & F&O)","index":5,"n_rows":342,"n_cols":18,"rows_kept":342,"merged":[[123,0,124,0],[123,1,124,1],[123,9,124,9],[123,11,124,11],[123,12,124,12],[123,13,124,13],[123,14,124,14],[125,0,126,0],[125,1,126,1],[125,9,126,9],[125,11,126,11],[125,12,126,12],[125,13,126,13],[125,14,126,14],[127,0,128,0],[127,1,128,1],[127,9,128,9],[127,11,128,11],[127,12,128,12],[127,13,128,13],[127,14,128,14],[129,0,130,0],[129,1,130,1],[129,9,130,9],[129,11,130,11],[129,12,130,12],[129,13,130,13],[129,14,130,14],[131,0,132,0],[131,1,132,1],[131,9,132,9],[131,11,132,11],[131,12,132,12],[131,13,132,13],[131,14,132,14],[133,0,134,0],[133,1,134,1],[133,9,134,9],[133,11,134,11],[133,12,134,12],[133,13,134,13],[133,14,134,14],[135,0,136,0],[135,1,136,1],[135,9,136,9],[135,11,136,11],[135,12,136,12],[135,13,136,13],[135,14,136,14],[137,0,138,0],[137,1,138,1],[137,9,138,9],[137,11,138,11],[137,12,138,12],[137,13,138,13],[137,14,138,14],[139,0,140,0],[139,1,140,1],[139,9,140,9],[139,11,140,11],[139,12,140,12],[139,13,140,13],[139,14,140,14],[141,0,142,0],[141,1,142,1],[141,9,142,9],[141,11,142,11],[141,12,142,12],[141,13,142,13],[141,14,142,14],[143,0,144,0],[143,1,144,1],[143,9,144,9],[143,11,144,11],[143,12,144,12],[143,13,144,13],[143,14,144,14],[145,0,146,0],[145,1,146,1],[145,9,146,9],[145,11,146,11],[145,12,146,12],[145,13,146,13],[145,14,146,14],[147,0,148,0],[147,1,148,1],[147,9,148,9],[147,11,148,11],[147,12,148,12],[147,13,148,13],[147,14,148,14],[149,0,150,0],[149,1,150,1],[149,9,150,9],[149,11,150,11],[149,12,150,12],[149,13,150,13],[149,14,150,14],[155,0,156,0],[155,1,156,1],[155,9,156,9],[155,11,156,11],[155,12,156,12],[155,13,156,13],[155,14,156,14],[161,0,162,0],[161,1,162,1],[161,9,162,9],[161,11,162,11],[161,12,162,12],[161,13,162,13],[161,14,162,14]]}
[]
[]
[]
[]
[{"$nulls":12},"Back To Main Page"]
["Retail Research Technical Calls & Fundamental Performance Report for the month of October-2019 "]
[{"$nulls":12},{"$f":"Main!B10","v":"2019-10-27"}]
[null,"Positional  Call"]
["Sr.no","Date",null,"Company","Rec","Rec Price","Stop Loss***","Call Closed At","Target","Remark","Profit / Loss per Share","Gain / Loss  %","Status","Closed Date","NSE Closed Price"]
[1,"2019-08-30",null,"BIOCON","Buy{}",229.5,214.3,242.5,"255-260","Profit of Rs.13/-",{"$f":"H10-F10","v":13},{"$f":"K10/F10","v":{"v":0.05664488017429194,"d":"5.66%"}},"Successful","2019-10-10",{"$nulls":3},"R"]
[2,"2019-09-09",null,"TORNTPHARM","Sell",1705,1808,1618,"1560-1540","Profit of Rs.87/-",{"$f":"F11-H11","v":87},{"$f":"K11/F11","v":{"v":0.05102639296187683,"d":"5.10%"}},"Successful","2019-10-01",{"$nulls":3},"R"]
[3,"2019-09-25",null,"AXISBANK","Buy",695,628,730,"800-820","Profit of Rs.35/-",{"$f":"H12-F12","v":35},{"v":0.050359712230215826,"d":"5.04%"},"Successful","2019-10-23",{"$nulls":3},"H"]
[4,"2019-09-26",null,"HDFC","Buy",2070,1940,2138,"2250-2300","Part Profit of Rs.68/-",{"$f":"H13-F13","v":68},{"$f":"K13/F13","v":{"v":0.03285024154589372,"d":"3.29%"}},"Successful","2019-10-22",{"$f":"VLOOKUP(D13,Sheet2!A43:M1682,6,0)","v":2101.55},null,null,"H"]
[5,"2019-09-26",null,"BANKBARODA","Buy",96,89,89.5,"110-114","Loss of Rs.6.5/-",{"$f":"H14-F14","v":-6.5},{"$f":"K14/F14","v":{"v":-0.06770833333333333,"d":"-6.77%"}},"UnSuccessful","2019-10-01",{"$nulls":3},"H"]
[6,"2019-09-30",null,"BPCL","Sell",475,510,503,"420-410","Loss of Rs.28/-",{"$f":"F15-H15","v":-28},{"v":-0.05894736842105263,"d":"-5.89%"},"UnSuccessful","2019-10-03",{"$nulls":3},"H"]
[7,"2019-10-01",null,"CUMMINSIND","Buy",576.5,530,559.5,"640-660","Loss of Rs.17/-",{"$f":"H16-F16","v":-17},{"$f":"K16/F16","v":{"v":-0.029488291413703384,"d":"-2.95%"}},"UnSuccessful","2019-10-24",{"$nulls":3},"H"]
[8,"2019-10-01",null,"UPL","Buy","592-598",564,null,"650-660","Open",{"$nulls":4},{"$f":"VLOOKUP(D17,Sheet2!A47:M1686,6,0)","v":594.6},null,null,"R"]
[9,"2019-10-03",null,"HEIDELBERG","Buy",183,169,195,"205-210","Profit of Rs.12/-",{"$f":"H18-F18","v":12},{"$f":"K18/F18","v":{"v":0.06557377049180328,"d":"6.56%"}},"Successful","2019-10-18",{"$nulls":3},"H"]
[10,"2019-10-03",null,"APOLLOHOSP","Buy{}",1378.5,1286,1448,"1550-1580","Profit of Rs.69.5/-",{"$f":"H19-F19","v":69.5},{"$f":"K19/F19","v":{"v":0.050417120058034094,"d":"5.04%"}},"Successful","2019-10-11",{"$nulls":3},"R"]
[11,"2019-10-04",null,"HDFCAMC","Buy",2665,2537,2835,"2930-2960","Profit of Rs.170/-",{"$f":"H20-F20","v":170},{"$f":"K20/F20","v":{"v":0.06378986866791744,"d":"6.38%"}},"Successful","2019-10-18",{"$nulls":3},"R"]
{"$rows_left_out":323}
{"sheet":"Sheet2","index":6,"n_rows":1899,"n_cols":14,"rows_kept":1899,"hidden":true}
["SYMBOL","SERIES","OPEN","HIGH","LOW","CLOSE","LAST","PREVCLOSE","TOTTRDQTY","TOTTRDVAL","TIMESTAMP","TOTALTRADES","ISIN","ISIN"]
["20MICRONS","EQ",37.55,38.05,36.1,36.15,36.15,36.9,59862,2237315.75,"2019-10-25",362,"INE144J01027"]
["21STCENMGM","EQ",12.9,12.9,12.9,12.9,12.9,12.9,200,2580,"2019-10-25",1,"INE253B01015"]
["3IINFOTECH","EQ",2,2.05,1.95,1.95,2,2.05,1254571,2511358.1,"2019-10-25",475,"INE748C01020"]
["3MINDIA","EQ",21201,22065,20902.15,21898.1,21720,21261.05,4425,95855480.25,"2019-10-25",1827,"INE470A01017"]
["5PAISA","EQ",162.3,166.9,159,160.5,161,162.5,3034,487829,"2019-10-25",233,"INE618L01018"]
["63MOONS","EQ",119.25,125.75,118.1,122.45,122.4,118.45,187223,22950517.3,"2019-10-25",3227,"INE111B01023"]
["A2ZINFRA","EQ",8.9,9.1,8.45,8.5,8.45,8.9,469179,4096627.5,"2019-10-25",763,"INE619I01012"]
["AARTIDRUGS","EQ",528,533.9,519,520.55,520,526.3,15309,8008487.6,"2019-10-25",1528,"INE767A01016"]
["AARTIIND","EQ",870,892,855,869.95,869,868.55,121764,105919607.8,"2019-10-25",7199,"INE769A01020"]
["AARVEEDEN","EQ",14.65,14.65,13.95,14.3,14.3,14.25,1327,18885.15,"2019-10-25",18,"INE273D01019"]
["AAVAS","EQ",1659,1659,1585.7,1624.1,1588,1632.25,49684,80752984.15,"2019-10-25",4760,"INE216P01012"]
["ABAN","BE",24.8,25.5,24.4,25.05,25,24.95,19269,482531.15,"2019-10-25",207,"INE421A01028"]
["ABB","EQ",1520,1528.15,1481.6,1495.25,1495,1513.9,27316,40972228.55,"2019-10-25",2702,"INE117A01022"]
["ABBOTINDIA","EQ",11200,11494,11126,11407.25,11349.85,11112.05,15152,172526048.9,"2019-10-25",4349,"INE358A01014"]
["ABCAPITAL","EQ",81.5,81.7,78.75,79.05,79,80.9,1365709,108616781.6,"2019-10-25",22188,"INE674K01013"]
["ABFRL","EQ",203,205.4,201.3,203.95,204.15,202.45,277592,56623113.8,"2019-10-25",3535,"INE647O01011"]
["ABSLNN50ET","EQ",283.22,283.22,283,283,283,282,6,1699.1,"2019-10-25",2,"INF209KB1B87"]
["ACC","EQ",1524,1524.95,1501,1518.4,1519.5,1519.1,645397,978401170,"2019-10-25",23469,"INE012A01025"]
["ACCELYA","EQ",958.3,976.4,921.2,934.85,921.5,949.8,48254,46003577.4,"2019-10-25",2092,"INE793A01012"]
{"$rows_left_out":1701}
{"sheet":"Sheet1","index":7,"n_rows":0,"n_cols":0,"rows_kept":0,"hidden":true}

{"sheet":"Sheet3","index":8,"n_rows":0,"n_cols":0,"rows_kept":0,"hidden":true}

{"sheet":"Sheet4","index":9,"n_rows":0,"n_cols":0,"rows_kept":0,"hidden":true}

{"sheet":"Sheet5","index":10,"n_rows":0,"n_cols":0,"rows_kept":0,"hidden":true}