{"text_format":"3","workbook":"xlsx","n_sheets":7,"sheets":["Main","Future Intra","Cash Intra","MidCap Intra","Bulk Deals","Call Tracker (Equity)","Call Tracker (F&O)"],"not_rendered":{"images":4,"external_links":1,"defined_names":1},"read":"whole","date_system":"1900"}

{"sheet":"Main","index":0,"n_rows":27,"n_cols":11,"rows_kept":27}
[null,"                                                                                                 "]
[]
[]
[]
[]
[{"$nulls":6}," "]
[]
[]
[]
[null,"2024-08-29"]
[]
[null,"Sheet No.","Template Name","Summary"]
[null,1,"Future Intra","For Intraday trading in F&O segment"]
[null,2,"Cash Intra","For Intraday trading in cash market segment"]
[null,3,"Mid-cap Intra","For Intraday trading in Mid-cap stocks"]
[null,4,"Bulk Deals","Reveals Bulk Deals carried on NSE & BSE"]
[null,5,"Call Tracker"]
{"$rows_empty":9}
[{"$nulls":10},"`"]

{"sheet":"Future Intra","index":1,"n_rows":225,"n_cols":16,"rows_kept":225,"merged":[[8,0,9,0],[8,1,9,1],[8,2,9,2],[8,3,9,3],[8,6,8,8],[8,9,8,11]]}
[]
[]
[]
[]
[{"$nulls":12},"Back to Main Page"]
["FOR INTRA DAY TRADING",{"$nulls":10},{"$f":"Main!B10","v":"2024-08-29"}]
[]
[]
["Sr.no","Sector","Scrip","Expiry Date","CLOSE RATE","Pivot Point","Supports",null,null,"Resistances"]
[{"$nulls":4},"Point","Point","S1","S2","S3","R1","R2","R3","HIGH","LOW","OI","% Change in OI"]
[1,"Index","NIFTY","2024-08-29",25048.35,{"v":25058.13333333333,"d":"25058.13"},{"v":24971.266666666663,"d":"24971.27"},{"v":24894.18333333333,"d":"24894.18"},{"v":24807.316666666662,"d":"24807.32"},{"v":25135.216666666664,"d":"25135.22"},{"v":25222.083333333332,"d":"25222.08"},{"v":25299.166666666664,"d":"25299.17"},25145,24981.05,15253575,{"v":0.05267489285936109,"d":"5.27%"}]
[2,"Index","BANKNIFTY","2024-09-25",{"v":51428.8,"d":"51428.80"},{"v":51459.950000000004,"d":"51459.95"},{"v":51360.850000000006,"d":"51360.85"},{"v":51292.9,"d":"51292.90"},{"v":51193.8,"d":"51193.80"},{"v":51527.90000000001,"d":"51527.90"},{"v":51627,"d":"51627.00"},{"v":51694.95000000001,"d":"51694.95"},51559.05,51392,2381895,{"v":-0.24421355240048928,"d":"-24.42%"}]
[3,"Index","FINNIFTY","2024-09-24",{"v":23639.8,"d":"23639.80"},23644.05,23607.75,{"v":23575.7,"d":"23575.70"},{"v":23539.4,"d":"23539.40"},{"v":23676.1,"d":"23676.10"},{"v":23712.399999999994,"d":"23712.40"},{"v":23744.449999999997,"d":"23744.45"},23680.35,23612,71200,{"v":0.08330163560289083,"d":"8.33%"}]
[4,"Index","MIDCPNIFTY","2024-09-30",13118.75,{"v":13114.916666666666,"d":"13114.92"},{"v":13058.833333333332,"d":"13058.83"},{"v":12998.916666666666,"d":"12998.92"},{"v":12942.833333333332,"d":"12942.83"},{"v":13174.833333333332,"d":"13174.83"},{"v":13230.916666666664,"d":"13230.92"},{"v":13290.833333333332,"d":"13290.83"},13171,13055,2060100,{"v":0.06968170725375149,"d":"6.97%"}]
[5,"Index","NIFTYNXT50","2024-08-30",{"v":75303.3,"d":"75303.30"},{"v":75208.3,"d":"75208.30"},{"v":75036.15000000001,"d":"75036.15"},{"v":74769,"d":"74769.00"},74596.85,{"v":75475.45000000001,"d":"75475.45"},{"v":75647.6,"d":"75647.60"},{"v":75914.75000000001,"d":"75914.75"},75380.45,74941.15,15890,{"v":0.06859448554135844,"d":"6.86%"}]
[6,"Chemicals","AARTIIND","2024-08-29",641.65,640.75,631.05,{"v":620.4499999999999,"d":"620.45"},{"v":610.7499999999999,"d":"610.75"},651.35,{"v":661.0500000000001,"d":"661.05"},{"v":671.6500000000001,"d":"671.65"},650.45,630.15,11713000,{"v":-0.014720726783310902,"d":"-1.47%"}]
[7,"Capital_Goods","ABB","2024-08-29",{"v":7920.1,"d":"7920.10"},{"v":7897.716666666667,"d":"7897.72"},{"v":7854.283333333335,"d":"7854.28"},{"v":7788.466666666667,"d":"7788.47"},{"v":7745.033333333335,"d":"7745.03"},{"v":7963.533333333335,"d":"7963.53"},{"v":8006.966666666667,"d":"8006.97"},{"v":8072.783333333335,"d":"8072.78"},7941.15,7831.9,1749875,{"v":-0.028724068549226392,"d":"-2.87%"}]
[8,"Pharma","ABBOTINDIA","2024-08-29",29926.35,{"v":29896.033333333336,"d":"29896.03"},{"v":29620.16666666667,"d":"29620.17"},{"v":29313.983333333334,"d":"29313.98"},{"v":29038.11666666667,"d":"29038.12"},{"v":30202.216666666674,"d":"30202.22"},{"v":30478.083333333336,"d":"30478.08"},{"v":30784.266666666677,"d":"30784.27"},30171.9,29589.85,158940,{"v":0.005567506010375807,"d":"0.56%"}]
[9,"Finance","ABCAPITAL","2024-08-29",222.11,222.63,220.88,219.65,{"v":217.9,"d":"217.90"},{"v":223.85999999999999,"d":"223.86"},{"v":225.60999999999999,"d":"225.61"},{"v":226.83999999999997,"d":"226.84"},224.38,221.4,71404200,{"v":-0.02643204240907083,"d":"-2.64%"}]
[10,"Textile","ABFRL","2024-08-29",315.55,{"v":317.48333333333335,"d":"317.48"},{"v":310.8666666666667,"d":"310.87"},{"v":306.18333333333334,"d":"306.18"},{"v":299.56666666666666,"d":"299.57"},{"v":322.1666666666667,"d":"322.17"},{"v":328.78333333333336,"d":"328.78"},{"v":333.4666666666667,"d":"333.47"},324.1,312.8,52067600,{"v":0.1876408492468272,"d":"18.76%"}]
{"$rows_left_out":194}
{"sheet":"Cash Intra","index":2,"n_rows":243,"n_cols":13,"rows_kept":243,"merged":[[7,0,8,0],[7,1,8,1],[7,2,8,2],[7,3,8,3],[7,4,7,6],[7,7,7,9]]}
[]
[]
[]
[]
[{"$nulls":12},"Back to Main Page"]
["FOR INTRA DAY TRADING",{"$nulls":9},{"$f":"Main!B10","v":"2024-08-29"}]
[]
["Sr.no",null,"CLOSE RATE","Pivot Point","Supports",null,null,"Resistances"]
[{"$nulls":4},"S1","S2","S3","R1","R2","R3","HIGH","LOW","Total Trade Quanity in Lakhs"]
[1,"Nifty 50",25052.35,{"v":25048.86666666667,"d":"25048.87"},{"v":24968.13333333334,"d":"24968.13"},{"v":24883.91666666667,"d":"24883.92"},{"v":24803.18333333334,"d":"24803.18"},{"v":25133.083333333336,"d":"25133.08"},{"v":25213.816666666666,"d":"25213.82"},{"v":25298.033333333333,"d":"25298.03"},{"v":25129.6,"d":"25129.60"},24964.65]
[2,"Nifty Bank",51143.85,{"v":51146.1,"d":"51146.10"},51031.45,{"v":50919.049999999996,"d":"50919.05"},{"v":50804.399999999994,"d":"50804.40"},{"v":51258.5,"d":"51258.50"},{"v":51373.15000000001,"d":"51373.15"},51485.55,51260.75,{"v":51033.7,"d":"51033.70"}]
[3,"Nifty CPSE",7360.65,{"v":7372.416666666667,"d":"7372.42"},{"v":7332.183333333334,"d":"7332.18"},{"v":7303.716666666667,"d":"7303.72"},{"v":7263.4833333333345,"d":"7263.48"},{"v":7400.883333333334,"d":"7400.88"},{"v":7441.116666666666,"d":"7441.12"},{"v":7469.583333333334,"d":"7469.58"},7412.65,7343.95]
[4,"Nifty Infra",{"v":9344.3,"d":"9344.30"},{"v":9348.050000000001,"d":"9348.05"},{"v":9321.600000000002,"d":"9321.60"},{"v":9298.900000000001,"d":"9298.90"},{"v":9272.450000000003,"d":"9272.45"},{"v":9370.750000000002,"d":"9370.75"},{"v":9397.200000000003,"d":"9397.20"},{"v":9419.900000000001,"d":"9419.90"},{"v":9374.5,"d":"9374.50"},9325.35]
[5,"Nifty IT",{"v":42394.4,"d":"42394.40"},{"v":42235.48333333334,"d":"42235.48"},{"v":41753.81666666667,"d":"41753.82"},{"v":41113.23333333334,"d":"41113.23"},{"v":40631.56666666667,"d":"40631.57"},{"v":42876.06666666667,"d":"42876.07"},{"v":43357.73333333333,"d":"43357.73"},{"v":43998.31666666667,"d":"43998.32"},42717.15,{"v":41594.9,"d":"41594.90"}]
[6,"Nifty PSE",11400.75,{"v":11422.5,"d":"11422.50"},11364.65,11328.55,{"v":11270.699999999999,"d":"11270.70"},{"v":11458.6,"d":"11458.60"},{"v":11516.449999999999,"d":"11516.45"},{"v":11552.550000000001,"d":"11552.55"},11480.35,{"v":11386.4,"d":"11386.40"}]
[7,"Nifty Midcap 50",{"v":16586.2,"d":"16586.20"},{"v":16586.083333333332,"d":"16586.08"},{"v":16516.616666666665,"d":"16516.62"},{"v":16447.033333333333,"d":"16447.03"},{"v":16377.566666666666,"d":"16377.57"},{"v":16655.666666666664,"d":"16655.67"},{"v":16725.13333333333,"d":"16725.13"},{"v":16794.716666666664,"d":"16794.72"},16655.55,{"v":16516.5,"d":"16516.50"}]
[8,"ABB",7938.4,{"v":7913.133333333332,"d":"7913.13"},{"v":7870.316666666665,"d":"7870.32"},{"v":7802.233333333333,"d":"7802.23"},{"v":7759.416666666665,"d":"7759.42"},{"v":7981.216666666664,"d":"7981.22"},{"v":8024.033333333332,"d":"8024.03"},{"v":8092.116666666664,"d":"8092.12"},7955.95,7845.05,1.53307]
[9,"ACC",2330.35,{"v":2338.116666666667,"d":"2338.12"},{"v":2318.2333333333336,"d":"2318.23"},{"v":2306.116666666667,"d":"2306.12"},{"v":2286.2333333333336,"d":"2286.23"},{"v":2350.2333333333336,"d":"2350.23"},{"v":2370.116666666667,"d":"2370.12"},{"v":2382.2333333333336,"d":"2382.23"},2358,2326,1.42265]
[10,"APLAPOLLO",1475.6,{"v":1462.3333333333333,"d":"1462.33"},{"v":1443.5666666666666,"d":"1443.57"},{"v":1411.5333333333333,"d":"1411.53"},{"v":1392.7666666666667,"d":"1392.77"},{"v":1494.3666666666666,"d":"1494.37"},{"v":1513.1333333333334,"d":"1513.13"},{"v":1545.1666666666665,"d":"1545.17"},1481.1,1430.3,7.91]
[11,"AUBANK",632.55,{"v":631.7166666666667,"d":"631.72"},{"v":626.6833333333334,"d":"626.68"},{"v":620.8166666666667,"d":"620.82"},{"v":615.7833333333334,"d":"615.78"},{"v":637.5833333333334,"d":"637.58"},{"v":642.6166666666667,"d":"642.62"},{"v":648.4833333333333,"d":"648.48"},636.75,625.85,19.75857]
{"$rows_left_out":224}
{"sheet":"MidCap Intra","index":3,"n_rows":533,"n_cols":13,"rows_kept":533,"merged":[[0,0,0,1],[8,0,9,0],[8,1,9,1],[8,2,9,2],[8,3,9,3],[8,4,8,6],[8,7,8,9]]}
[]
[]
[]
[]
[{"$nulls":11},"Back To Main Page"]
["FOR INTRA DAY TRADING",{"$nulls":9},{"$f":"Main!B10","v":"2024-08-29"}]
[null,null," "]
[]
["Sr.no","Scrip","CLOSE RATE","Pivot Point","Supports",null,null,"Resistances"]
[{"$nulls":4},"S1","S2","S3","R1","R2","R3","HIGH","LOW","Total Trade Quanity in Lakhs"]
[1,"360ONE",1097.45,{"v":1108.8166666666668,"d":"1108.82"},{"v":1082.7333333333336,"d":"1082.73"},{"v":1068.0166666666667,"d":"1068.02"},{"v":1041.9333333333334,"d":"1041.93"},{"v":1123.5333333333338,"d":"1123.53"},{"v":1149.6166666666672,"d":"1149.62"},{"v":1164.333333333334,"d":"1164.33"},1134.9,1094.1,7.85486]
[2,"3MINDIA",35368.8,{"v":35602.933333333334,"d":"35602.93"},{"v":35055.86666666667,"d":"35055.87"},{"v":34742.933333333334,"d":"34742.93"},{"v":34195.86666666667,"d":"34195.87"},{"v":35915.86666666667,"d":"35915.87"},{"v":36462.933333333334,"d":"36462.93"},{"v":36775.86666666667,"d":"36775.87"},36150,35290,0.03858]
[3,"ABB",7938.4,{"v":7913.133333333332,"d":"7913.13"},{"v":7870.316666666665,"d":"7870.32"},{"v":7802.233333333333,"d":"7802.23"},{"v":7759.416666666665,"d":"7759.42"},{"v":7981.216666666664,"d":"7981.22"},{"v":8024.033333333332,"d":"8024.03"},{"v":8092.116666666664,"d":"8092.12"},7955.95,7845.05,1.53307]
[4,"ACC",2330.35,{"v":2338.116666666667,"d":"2338.12"},{"v":2318.2333333333336,"d":"2318.23"},{"v":2306.116666666667,"d":"2306.12"},{"v":2286.2333333333336,"d":"2286.23"},{"v":2350.2333333333336,"d":"2350.23"},{"v":2370.116666666667,"d":"2370.12"},{"v":2382.2333333333336,"d":"2382.23"},2358,2326,1.42265]
[5,"AIAENG",4359.3,{"v":4385.099999999999,"d":"4385.10"},{"v":4304.199999999999,"d":"4304.20"},{"v":4249.099999999999,"d":"4249.10"},{"v":4168.199999999999,"d":"4168.20"},{"v":4440.199999999999,"d":"4440.20"},{"v":4521.0999999999985,"d":"4521.10"},{"v":4576.199999999999,"d":"4576.20"},4466,4330,0.57335]
[6,"APLAPOLLO",1475.6,{"v":1462.3333333333333,"d":"1462.33"},{"v":1443.5666666666666,"d":"1443.57"},{"v":1411.5333333333333,"d":"1411.53"},{"v":1392.7666666666667,"d":"1392.77"},{"v":1494.3666666666666,"d":"1494.37"},{"v":1513.1333333333334,"d":"1513.13"},{"v":1545.1666666666665,"d":"1545.17"},1481.1,1430.3,7.91]
[7,"AUBANK",632.55,{"v":631.7166666666667,"d":"631.72"},{"v":626.6833333333334,"d":"626.68"},{"v":620.8166666666667,"d":"620.82"},{"v":615.7833333333334,"d":"615.78"},{"v":637.5833333333334,"d":"637.58"},{"v":642.6166666666667,"d":"642.62"},{"v":648.4833333333333,"d":"648.48"},636.75,625.85,19.75857]
[8,"AARTIIND",640.75,{"v":639.8000000000001,"d":"639.80"},{"v":630.7000000000002,"d":"630.70"},{"v":620.6500000000001,"d":"620.65"},{"v":611.5500000000002,"d":"611.55"},{"v":649.8500000000001,"d":"649.85"},658.95,{"v":669.0000000000001,"d":"669.00"},648.9,629.75,30.8453]
[9,"AAVAS",1720.1,{"v":1708.7,"d":"1708.70"},{"v":1692.9,"d":"1692.90"},{"v":1665.7,"d":"1665.70"},{"v":1649.9,"d":"1649.90"},{"v":1735.9,"d":"1735.90"},{"v":1751.6999999999998,"d":"1751.70"},{"v":1778.9,"d":"1778.90"},1724.5,1681.5,8.23956]
[10,"ABBOTINDIA",29955.25,29910.25,{"v":29675,"d":"29675.00"},29394.75,{"v":29159.5,"d":"29159.50"},{"v":30190.5,"d":"30190.50"},30425.75,{"v":30706,"d":"30706.00"},30145.5,29630,0.33538]
{"$rows_left_out":508}
{"sheet":"Bulk Deals","index":4,"n_rows":327,"n_cols":8,"rows_kept":327,"merged":[[4,0,4,1],[4,2,4,3],[6,1,6,2]]}
[" "]
[]
[]
[]
[]
[{"$nulls":4},"Back To Main Page"]
["Subject :","BULK DEAL",null,{"$f":"Main!B10","v":"2024-08-29"}]
[]
["Date","Scrip code","Scrip Name","Client Name","Buy / Sell","Quantity Traded","Trade Price / Wt.Avg.trade price","Exchange  "]
["2024-08-28",531525,"ACESOFT","ACE TECHNOLOGIES","SELL",{"v":32431,"d":"32,431"},306,"BSE"]
["2024-08-28",544224,"AFCOM","ISHAAN TRADEFIN LLP","SELL",{"v":230400,"d":"230,400"},437.61,"BSE"]
["2024-08-28",544224,"AFCOM","ISHAAN TRADEFIN LLP","BUY",{"v":168000,"d":"168,000"},444.07,"BSE"]
["2024-08-28",544224,"AFCOM","SAHASTRAA ADVISORS PRIVATE LIMITED","BUY",{"v":82800,"d":"82,800"},437.78,"BSE"]
["2024-08-28",544224,"AFCOM","SAHASTRAA ADVISORS PRIVATE LIMITED","SELL",{"v":204000,"d":"204,000"},431.88,"BSE"]
["2024-08-28",540135,"ARCFIN","SKSE SECURITIES LIMITED CORP CM/TM PROP A/C","BUY",{"v":4097351,"d":"4,097,351"},1.44,"BSE"]
["2024-08-28",540135,"ARCFIN","SKSE SECURITIES LIMITED CORP CM/TM PROP A/C","SELL",{"v":3658345,"d":"3,658,345"},1.46,"BSE"]
["2024-08-28",544177,"AZTEC","AG DYNAMIC FUNDS LIMITED","SELL",{"v":80000,"d":"80,000"},118.54,"BSE"]
["2024-08-28",539251,"BALKRISHNA","ANKITA VISHAL SHAH","BUY",{"v":1139,"d":"1,139"},25.5,"BSE"]
["2024-08-28",539251,"BALKRISHNA","ANKITA VISHAL SHAH","SELL",{"v":226139,"d":"226,139"},27.87,"BSE"]
["2024-08-28",543209,"BILLWIN","ANAND PRAKASH SHAH","BUY",{"v":33000,"d":"33,000"},64.13,"BSE"]
{"$rows_left_out":308}
{"sheet":"Call Tracker (Equity)","index":5,"n_rows":312,"n_cols":18,"rows_kept":312}
[]
[]
[]
[]
[{"$nulls":12},"Back To Main Page"]
["Retail Research Technical Calls & Fundamental Performance Report for the month of August-2024"]
[{"$nulls":12},{"$f":"Main!B10","v":"2024-08-29"}]
["Positional  Call (Timeframe- 1-3 Months)"]
["Sr.no","Date",null,"Company","Rec","Rec Price","Stop Loss***","Call Closed At","Target","Remark","Profit / Loss per Share","All charges","Net Gain / Loss  %","Status","Closed Date","Market Closing Price","Second Buying Date"]
[1,"2024-06-25",null,"HAPPSTMNDS","Accu",830,795,780,"900-950","Loss of Rs.50/-",{"$f":"H10-F10","v":-50},{"$f":"(F10*-0.3)/100","v":-2.49},{"$f":"(K10+L10)/F10","v":{"v":-0.06324096385542169,"d":"-6.32%"}},"Unsuccessful","2024-08-05",null,null,"H"]
[2,"2024-06-27",null,"BAJAJ-AUTO","Accu",9325,8900,9825,"10000-10400","Profit of Rs.500/-",{"$f":"H11-F11","v":500},{"$f":"(F11*-0.3)/100","v":{"v":-27.975,"d":"-27.98"}},{"$f":"(K11+L11)/F11","v":{"v":0.05061930294906166,"d":"5.06%"}},"Successful","2024-08-01",null,null,"H"]
[3,"2024-07-01",null,"RELIANCE","Accu",3075,2940,2900,"3300-3500","Loss of Rs.175/-",-175,{"v":-9.225,"d":"-9.23"},{"v":-0.05991056910569106,"d":"-5.99%"},"Unsuccessful","2024-08-05",null,null,"H"]
[4,"2024-07-19",null,"BAJAJFINSV","Accu",1617,1560,1555,"1720-1800","Loss of Rs.62/-",{"$f":"H13-F13","v":-62},{"$f":"(F13*-0.3)/100","v":{"v":-4.851,"d":"-4.85"}},{"$f":"(K13+L13)/F13","v":{"v":-0.0413426097711812,"d":"-4.13%"}},"Unsuccessful","2024-08-08",null,null,"H"]
[5,"2024-07-25",null,"NESTLEIND","Accu","2390-2470",2330,null,"2650-2800","Open",{"$nulls":5},{"$f":"VLOOKUP(D14,'MidCap Intra'!$B$11:$C$571,2,0)","v":{"v":2492.5,"d":"2492.50"}},null,"H"]
[6,"2024-07-26",null,"LTF","Accu",173.5,164,163.5,"195-205","Loss of Rs.10/-",{"$f":"H15-F15","v":-10},{"$f":"(F15*-0.3)/100","v":{"v":-0.5205,"d":"-0.52"}},{"$f":"(K15+L15)/F15","v":{"v":-0.060636887608069165,"d":"-6.06%"}},"Unsuccessful","2024-08-13",null,null,"H"]
[7,"2024-07-26",null,"RKFORGE","Accu",840,790,882,"900-950","Profit of Rs.42/-",{"$f":"H16-F16","v":42},{"$f":"(F16*-0.3)/100","v":-2.52},{"$f":"(K16+L16)/F16","v":{"v":0.04699999999999999,"d":"4.70%"}},"Successful","2024-08-02",null,null,"H"]
[8,"2024-07-29",null,"CARBORUNIV","Accu",1710,1645,1605,"1840-1940","Loss of Rs.105/-",-105,-5.13,{"v":-0.06440350877192982,"d":"-6.44%"},"Unsuccessful","2024-08-05",null,null,"H"]
[9,"2024-07-30",null,"LTTS","Accu",5105,4800,5380,"5540-5900","Profit of Rs.275/-",{"$f":"H18-F18","v":275},{"$f":"(F18*-0.3)/100","v":{"v":-15.315,"d":"-15.32"}},{"$f":"(K18+L18)/F18","v":{"v":0.05086875612144956,"d":"5.09%"}},"Successful","2024-08-20",null,null,"K"]
[10,"2024-07-30",null,"VBL","Accu",1565,1495,1490,"1700-1800","Loss of Rs.75/-",{"$f":"H19-F19","v":-75},{"$f":"(F19*-0.3)/100","v":{"v":-4.695,"d":"-4.70"}},{"$f":"(K19+L19)/F19","v":{"v":-0.050923322683706064,"d":"-5.09%"}},"Unsuccessful","2024-08-06",null,null,"H"]
[11,"2024-07-30",null,"IOC","Accu",177.5,167,167,"195-210","Loss of Rs.10.5/-",{"$f":"H20-F20","v":-10.5},{"$f":"(F20*-0.3)/100","v":{"v":-0.5325,"d":"-0.53"}},{"$f":"(K20+L20)/F20","v":{"v":-0.06215492957746479,"d":"-6.22%"}},"Unsuccessful","2024-08-06",null,null,"H"]
{"$rows_left_out":293}
{"sheet":"Call Tracker (F&O)","index":6,"n_rows":34,"n_cols":16,"rows_kept":34,"merged":[[24,0,25,0],[24,1,25,1],[24,9,25,9],[24,12,25,12],[24,13,25,13],[24,14,25,14],[24,15,25,15],[28,0,29,0],[28,1,29,1],[28,9,29,9],[28,12,29,12],[28,13,29,13],[28,14,29,14],[28,15,29,15]]}
[]
[]
[]
[]
[{"$nulls":12},"Back To Main Page"]
["Retail Research Technical Calls & Fundamental Performance Report for the month of August-2024"]
[{"$nulls":12},"2024-08-29"]
["Master Trade High Risk"]
["Sr.no","Date",null,"Company","Rec","Rec Price","Stop Loss","Call Closed At","Target","Remark","Profit / Loss per share","All charges","Gain / Loss  per Lot","Lot","Status","Closed Date"]
[1,"2024-08-19",null,"ICICIBANK AUG FUT","Buy",1180,1158,1199,1220,"Profit of Rs.19/-",{"$f":"H10-F10","v":19},{"v":50,"d":"50.00"},{"$f":"(K10*N10)-L10","v":{"v":13250,"d":"13250.0"}},700,"Successful","2024-08-23"]
[2,"2024-08-20",null,"BANKNIFTY AUG FUT","Buy",50900,50450,50570,"51400-51800","Loss of Rs.330/-",{"$f":"H11-F11","v":-330},{"v":50,"d":"50.00"},{"v":-5000,"d":"-5000.0"},15,"Unsuccessful","2024-08-21"]
[3,"2024-08-22",null,"RAMCOCEM AUG FUT","Buy",830,814,824,880,"Loss of Rs.6/-",{"$f":"H12-F12","v":-6},{"v":50,"d":"50.00"},{"v":-5150,"d":"-5150.0"},850,"Unsuccessful","2024-08-23"]
[4,"2024-08-26",null,"JUBLFOOD SEP FUT","Buy",653.5,643,662.25,690,"Profit of Rs.8.75/-",{"$f":"H13-F13","v":8.75},{"v":50,"d":"50.00"},10887.5,1250,"Successful","2024-08-27"]
[5,"2024-08-27",null,"GAIL SEP FUT","Buy",236.75,233.5,null,245,"Open"]
[6,"2024-08-28",null,"VOLTAS SEP FUT","Sell",1728,1746,1750,1670,"Loss of Rs.22/-",{"$f":"F15-H15","v":-22},{"v":50,"d":"50.00"},{"$f":"(K15*N15)-L15","v":{"v":-13250,"d":"-13250.0"}},600,"Unsuccessful","2024-08-28"]
[]
[]
[]
[]
["Master Trade Medium Risk "]
{"$rows_left_out":14}