{"text_format":"3","workbook":"xlsx","n_sheets":10,"sheets":["Main","Future Intra","Cash Intra","MidCap Intra","Bulk Deals","Call Tracker (Equity & F&O)","Sheet2","Sheet1","Sheet3","Sheet4"],"not_rendered":{"images":4,"defined_names":5},"read":"whole","date_system":"1900"}

{"sheet":"Main","index":0,"n_rows":27,"n_cols":11,"rows_kept":27}
[null,"                                                                                                 "]
{"$rows_empty":8}
[null,"2019-07-26"]
[]
[null,"Sheet No.","Template Name","Summary"]
[null,1,"Future Intra","For Intraday trading in F&O segment"]
[null,2,"Cash Intra","For Intraday trading in cash market segment"]
[null,3,"Mid-cap Intra","For Intraday trading in Mid-cap stocks"]
[null,4,"Bulk Deals","Reveals Bulk Deals carried on NSE & BSE"]
[null,5,"Call Tracker"]
{"$rows_empty":9}
[{"$nulls":10},"`"]

{"sheet":"Future Intra","index":1,"n_rows":236,"n_cols":15,"rows_kept":236,"merged":[[8,0,9,0],[8,1,9,1],[8,2,9,2],[8,5,8,7],[8,8,8,10]]}
[]
[]
[]
[]
[{"$nulls":12},"Back to Main Page"]
["FOR INTRA DAY TRADING",{"$nulls":10},{"$f":"Main!B10","v":"2019-07-26"}]
[]
[]
["Sr.no","Sector","Scrip","CLOSE RATE","Pivot Point","Supports",null,null,"Resistances"]
[null,"Sector",null,"Point","Point","S1","S2","S3","R1","R2","R3","HIGH","LOW","OI","% Change in OI"]
[1,"Index","BANKNIFTY",29201.15,{"v":29178.36666666667,"d":"29178.37"},{"v":29044.033333333336,"d":"29044.03"},{"v":28886.916666666668,"d":"28886.92"},{"v":28752.583333333336,"d":"28752.58"},{"v":29335.483333333337,"d":"29335.48"},{"v":29469.816666666666,"d":"29469.82"},{"v":29626.933333333338,"d":"29626.93"},29312.7,29021.25,1407760,{"v":-0.29057942531168424,"d":"-29.06%"}]
[2,"Index","NIFTY",11301.05,{"v":11322.466666666667,"d":"11322.47"},{"v":11258.683333333334,"d":"11258.68"},{"v":11216.316666666668,"d":"11216.32"},{"v":11152.533333333335,"d":"11152.53"},{"v":11364.833333333334,"d":"11364.83"},{"v":11428.616666666667,"d":"11428.62"},{"v":11470.983333333334,"d":"11470.98"},11386.25,11280.1,17915850,{"v":-0.18247620612121274,"d":"-18.25%"}]
[3,"Index","NIFTYIT",{"v":15569,"d":"15569.00"},{"v":15536.333333333334,"d":"15536.33"},{"v":15477.666666666668,"d":"15477.67"},{"v":15386.333333333334,"d":"15386.33"},{"v":15327.666666666668,"d":"15327.67"},{"v":15627.666666666668,"d":"15627.67"},{"v":15686.333333333336,"d":"15686.33"},{"v":15777.666666666668,"d":"15777.67"},15595,15445,12350,{"v":-0.2819767441860465,"d":"-28.20%"}]
[4,"Cement","ACC",{"v":1581.4,"d":"1581.40"},{"v":1585.3500000000001,"d":"1585.35"},{"v":1565.2000000000003,"d":"1565.20"},{"v":1549.0000000000002,"d":"1549.00"},{"v":1528.8500000000004,"d":"1528.85"},{"v":1601.5500000000002,"d":"1601.55"},{"v":1621.7000000000003,"d":"1621.70"},{"v":1637.9,"d":"1637.90"},1605.5,1569.15,2071200,{"v":-0.0537280701754386,"d":"-5.37%"}]
[5,"Others","ADANIENT",129.35,{"v":129.38333333333333,"d":"129.38"},{"v":127.46666666666664,"d":"127.47"},{"v":125.58333333333331,"d":"125.58"},{"v":123.66666666666663,"d":"123.67"},{"v":131.26666666666665,"d":"131.27"},{"v":133.18333333333334,"d":"133.18"},{"v":135.06666666666666,"d":"135.07"},131.3,127.5,28692000,{"v":-0.09156534954407294,"d":"-9.16%"}]
[6,"Others","ADANIPORTS",{"v":382.6,"d":"382.60"},{"v":383.18333333333334,"d":"383.18"},{"v":378.6166666666667,"d":"378.62"},{"v":374.6333333333333,"d":"374.63"},{"v":370.06666666666666,"d":"370.07"},{"v":387.1666666666667,"d":"387.17"},{"v":391.7333333333334,"d":"391.73"},{"v":395.7166666666667,"d":"395.72"},387.75,379.2,15502500,{"v":-0.04892638036809816,"d":"-4.89%"}]
[7,"Power","ADANIPOWER",62.15,62.15,{"v":60.2,"d":"60.20"},{"v":58.25000000000001,"d":"58.25"},{"v":56.30000000000001,"d":"56.30"},{"v":64.1,"d":"64.10"},66.05,{"v":67.99999999999999,"d":"68.00"},64.1,60.2,114120000,{"v":-0.12255881900661234,"d":"-12.26%"}]
[8,"Automobile","AMARAJABAT",631.25,628.15,622.65,614.05,608.55,636.75,642.25,650.85,633.65,619.55,1491700,{"v":-0.07868568958063121,"d":"-7.87%"}]
[9,"Cement","AMBUJACEM",215.15,{"v":215.98333333333335,"d":"215.98"},{"v":210.8166666666667,"d":"210.82"},{"v":206.48333333333335,"d":"206.48"},{"v":201.3166666666667,"d":"201.32"},{"v":220.3166666666667,"d":"220.32"},{"v":225.48333333333332,"d":"225.48"},{"v":229.8166666666667,"d":"229.82"},221.15,211.65,18170000,{"v":-0.04179301252471984,"d":"-4.18%"}]
[10,"Others","APOLLOHOSP",{"v":1352.2,"d":"1352.20"},{"v":1344.3666666666668,"d":"1344.37"},{"v":1330.8333333333335,"d":"1330.83"},{"v":1309.4666666666667,"d":"1309.47"},{"v":1295.9333333333334,"d":"1295.93"},{"v":1365.7333333333336,"d":"1365.73"},{"v":1379.2666666666669,"d":"1379.27"},{"v":1400.6333333333337,"d":"1400.63"},1357.9,1323,1401500,{"v":-0.1154938466393184,"d":"-11.55%"}]
{"$rows_left_out":172}
{"sheet":"Cash Intra","index":2,"n_rows":247,"n_cols":13,"rows_kept":247,"merged":[[7,0,8,0],[7,1,8,1],[7,2,8,2],[7,3,8,3],[7,4,7,6],[7,7,7,9]]}
[]
[]
[]
[]
[{"$nulls":12},"Back to Main Page"]
["FOR INTRA DAY TRADING",{"$nulls":9},{"$f":"Main!B10","v":"2019-07-26"}]
[]
["Sr.no","Scrip","CLOSE RATE","Pivot Point","Supports",null,null,"Resistances"]
[null,null,"Point",null,"S1","S2","S3","R1","R2","R3","HIGH","LOW","Total Trade Quanity in Lakhs"]
[1,"Nifty 50",11252.15,{"v":11284.300000000001,"d":"11284.30"},{"v":11207.200000000003,"d":"11207.20"},{"v":11162.250000000002,"d":"11162.25"},{"v":11085.150000000003,"d":"11085.15"},{"v":11329.250000000002,"d":"11329.25"},11406.35,{"v":11451.300000000001,"d":"11451.30"},11361.4,11239.35]
[2,"Nifty Bank",29043.05,{"v":29071.63333333333,"d":"29071.63"},{"v":28902.466666666664,"d":"28902.47"},{"v":28761.88333333333,"d":"28761.88"},{"v":28592.716666666664,"d":"28592.72"},{"v":29212.216666666664,"d":"29212.22"},{"v":29381.383333333335,"d":"29381.38"},{"v":29521.966666666664,"d":"29521.97"},29240.8,28931.05]
[3,"Nifty CPSE",2074.4,{"v":2081,"d":"2081.00"},{"v":2056.8,"d":"2056.80"},{"v":2039.2000000000003,"d":"2039.20"},{"v":2015.0000000000005,"d":"2015.00"},{"v":2098.6,"d":"2098.60"},{"v":2122.7999999999997,"d":"2122.80"},{"v":2140.3999999999996,"d":"2140.40"},2105.2,2063.4]
[4,"Nifty Infra",3128.4,{"v":3142.683333333333,"d":"3142.68"},{"v":3106.016666666666,"d":"3106.02"},{"v":3083.633333333333,"d":"3083.63"},{"v":3046.9666666666662,"d":"3046.97"},{"v":3165.0666666666657,"d":"3165.07"},{"v":3201.7333333333327,"d":"3201.73"},{"v":3224.1166666666654,"d":"3224.12"},3179.35,3120.3]
[5,"Nifty IT",15474.65,{"v":15442.766666666668,"d":"15442.77"},{"v":15374.933333333336,"d":"15374.93"},{"v":15275.216666666667,"d":"15275.22"},{"v":15207.383333333335,"d":"15207.38"},{"v":15542.483333333337,"d":"15542.48"},{"v":15610.31666666667,"d":"15610.32"},{"v":15710.033333333338,"d":"15710.03"},15510.6,15343.05]
[6,"Nifty PSE",3296.25,{"v":3305.9166666666665,"d":"3305.92"},{"v":3273.183333333333,"d":"3273.18"},{"v":3250.1166666666663,"d":"3250.12"},{"v":3217.3833333333328,"d":"3217.38"},{"v":3328.983333333333,"d":"3328.98"},{"v":3361.7166666666667,"d":"3361.72"},{"v":3384.7833333333333,"d":"3384.78"},3338.65,3282.85]
[7,"Nifty Midcap 50",4385.4,{"v":4387.383333333333,"d":"4387.38"},{"v":4364.916666666666,"d":"4364.92"},{"v":4344.4333333333325,"d":"4344.43"},{"v":4321.966666666665,"d":"4321.97"},{"v":4407.866666666667,"d":"4407.87"},{"v":4430.333333333334,"d":"4430.33"},{"v":4450.8166666666675,"d":"4450.82"},4409.85,4366.9]
[8,"ABB",1402.8,{"v":1394.2666666666664,"d":"1394.27"},{"v":1374.6333333333328,"d":"1374.63"},{"v":1346.4666666666662,"d":"1346.47"},{"v":1326.8333333333326,"d":"1326.83"},{"v":1422.433333333333,"d":"1422.43"},{"v":1442.0666666666666,"d":"1442.07"},{"v":1470.2333333333331,"d":"1470.23"},1413.9,1366.1,4.45967]
[9,"ACC",1585.25,{"v":1585.6666666666667,"d":"1585.67"},{"v":1569.4333333333334,"d":"1569.43"},{"v":1553.6166666666666,"d":"1553.62"},{"v":1537.3833333333332,"d":"1537.38"},{"v":1601.4833333333336,"d":"1601.48"},{"v":1617.7166666666667,"d":"1617.72"},{"v":1633.5333333333338,"d":"1633.53"},1601.9,1569.85,9.06465]
[10,"AUBANK",634.1,{"v":638.0333333333333,"d":"638.03"},{"v":624.0666666666666,"d":"624.07"},{"v":614.0333333333333,"d":"614.03"},{"v":600.0666666666666,"d":"600.07"},{"v":648.0666666666666,"d":"648.07"},{"v":662.0333333333333,"d":"662.03"},{"v":672.0666666666666,"d":"672.07"},652,628,3.28573]
[11,"ADANIPORTS",380.35,{"v":380.9666666666667,"d":"380.97"},{"v":376.3833333333334,"d":"376.38"},{"v":372.4166666666667,"d":"372.42"},{"v":367.83333333333337,"d":"367.83"},{"v":384.9333333333334,"d":"384.93"},{"v":389.51666666666665,"d":"389.52"},{"v":393.4833333333334,"d":"393.48"},385.55,377,29.9897]
{"$rows_left_out":228}
{"sheet":"MidCap Intra","index":3,"n_rows":545,"n_cols":13,"rows_kept":545,"merged":[[0,0,0,1],[8,0,9,0],[8,1,9,1],[8,2,9,2],[8,3,9,3],[8,4,8,6],[8,7,8,9]]}
[]
[]
[]
[]
[{"$nulls":11},"Back To Main Page"]
["FOR INTRA DAY TRADING",{"$nulls":9},{"$f":"Main!B10","v":"2019-07-26"}]
[null,null," "]
[]
["Sr.no","Scrip","CLOSE RATE","Pivot Point","Supports",null,null,"Resistances"]
[null,null,"Point",null,"S1","S2","S3","R1","R2","R3","HIGH","LOW","Total Trade Quanity in Lakhs"]
[1,"3MINDIA",21162.15,{"v":21317.383333333335,"d":"21317.38"},{"v":20946.76666666667,"d":"20946.77"},{"v":20731.383333333335,"d":"20731.38"},{"v":20360.76666666667,"d":"20360.77"},{"v":21532.76666666667,"d":"21532.77"},{"v":21903.38333333333,"d":"21903.38"},{"v":22118.76666666667,"d":"22118.77"},21688,21102,0.0106]
[2,"ABB",1402.8,{"v":1394.2666666666664,"d":"1394.27"},{"v":1374.6333333333328,"d":"1374.63"},{"v":1346.4666666666662,"d":"1346.47"},{"v":1326.8333333333326,"d":"1326.83"},{"v":1422.433333333333,"d":"1422.43"},{"v":1442.0666666666666,"d":"1442.07"},{"v":1470.2333333333331,"d":"1470.23"},1413.9,1366.1,4.45967]
[3,"ACC",1585.25,{"v":1585.6666666666667,"d":"1585.67"},{"v":1569.4333333333334,"d":"1569.43"},{"v":1553.6166666666666,"d":"1553.62"},{"v":1537.3833333333332,"d":"1537.38"},{"v":1601.4833333333336,"d":"1601.48"},{"v":1617.7166666666667,"d":"1617.72"},{"v":1633.5333333333338,"d":"1633.53"},1601.9,1569.85,9.06465]
[4,"AIAENG",1756.55,1742.45,{"v":1723.9,"d":"1723.90"},1691.25,{"v":1672.7,"d":"1672.70"},{"v":1775.1000000000001,"d":"1775.10"},{"v":1793.6499999999999,"d":"1793.65"},{"v":1826.3000000000002,"d":"1826.30"},1761,1709.8,0.16165]
[5,"APLAPOLLO",1466.45,{"v":1485.0333333333335,"d":"1485.03"},{"v":1440.166666666667,"d":"1440.17"},{"v":1413.8833333333334,"d":"1413.88"},{"v":1369.0166666666669,"d":"1369.02"},{"v":1511.316666666667,"d":"1511.32"},{"v":1556.1833333333334,"d":"1556.18"},{"v":1582.4666666666672,"d":"1582.47"},1529.9,1458.75,0.10773]
[6,"AUBANK",634.1,{"v":638.0333333333333,"d":"638.03"},{"v":624.0666666666666,"d":"624.07"},{"v":614.0333333333333,"d":"614.03"},{"v":600.0666666666666,"d":"600.07"},{"v":648.0666666666666,"d":"648.07"},{"v":662.0333333333333,"d":"662.03"},{"v":672.0666666666666,"d":"672.07"},652,628,3.28573]
[7,"AAVAS",1469.5,{"v":1470.8833333333332,"d":"1470.88"},{"v":1453.7666666666664,"d":"1453.77"},{"v":1438.0333333333333,"d":"1438.03"},{"v":1420.9166666666665,"d":"1420.92"},{"v":1486.6166666666663,"d":"1486.62"},{"v":1503.7333333333331,"d":"1503.73"},{"v":1519.4666666666662,"d":"1519.47"},1488,1455.15,0.53725]
[8,"ADANIGREEN",48.8,{"v":48.849999999999994,"d":"48.85"},{"v":48.29999999999999,"d":"48.30"},{"v":47.8,"d":"47.80"},{"v":47.24999999999999,"d":"47.25"},{"v":49.34999999999999,"d":"49.35"},{"v":49.9,"d":"49.90"},{"v":50.399999999999984,"d":"50.40"},49.4,48.35,6.77095]
[9,"ADANIPORTS",380.35,{"v":380.9666666666667,"d":"380.97"},{"v":376.3833333333334,"d":"376.38"},{"v":372.4166666666667,"d":"372.42"},{"v":367.83333333333337,"d":"367.83"},{"v":384.9333333333334,"d":"384.93"},{"v":389.51666666666665,"d":"389.52"},{"v":393.4833333333334,"d":"393.48"},385.55,377,29.9897]
[10,"ADANIPOWER",62.1,{"v":62.03333333333333,"d":"62.03"},{"v":60.06666666666666,"d":"60.07"},{"v":58.03333333333333,"d":"58.03"},{"v":56.06666666666666,"d":"56.07"},{"v":64.06666666666666,"d":"64.07"},{"v":66.03333333333333,"d":"66.03"},{"v":68.06666666666666,"d":"68.07"},64,60,148.90472]
{"$rows_left_out":513}
{"sheet":"Bulk Deals","index":4,"n_rows":64,"n_cols":8,"rows_kept":64,"merged":[[4,0,4,1],[4,2,4,3],[6,1,6,2]]}
[" "]
[]
[]
[]
[]
[{"$nulls":4},"Back To Main Page"]
["Subject :","BULK DEAL",null,{"$f":"Main!B10","v":"2019-07-26"}]
[]
["Date","Scrip code","Scrip Name","Client Name","Buy / Sell","Quantity Traded","Trade Price / Wt.Avg.trade price","Exchange  "]
["2019-07-25",538778,"AKASHDEEP","SIRIUS ADVISORS PRIVATE LIMITED.","SELL",{"v":43395,"d":"43,395"},34.91,"BSE"]
["2019-07-25",537766,"BCP","ACHINTYA COMMODITIES PRIVATE LIMITED","BUY",{"v":830718,"d":"830,718"},41.97,"BSE"]
["2019-07-25",537766,"BCP","ACHINTYA COMMODITIES PRIVATE LIMITED","SELL",{"v":828208,"d":"828,208"},41.39,"BSE"]
["2019-07-25",542724,"EARUM","MOHIT PRAKASH JALAN","SELL",{"v":36000,"d":"36,000"},44,"BSE"]
["2019-07-25",538765,"JSHL","JAWAHAR LAL AGARWAL","SELL",{"v":100000,"d":"100,000"},8.29,"BSE"]
["2019-07-25",540468,"KMSMEDI","NAWAL AGRAWAL HUF","BUY",{"v":20000,"d":"20,000"},30.15,"BSE"]
["2019-07-25",540468,"KMSMEDI","PRAVIN H DOSHI HUF","BUY",{"v":4000,"d":"4,000"},30.2,"BSE"]
["2019-07-25",540468,"KMSMEDI","PRAVIN H DOSHI HUF","SELL",{"v":20000,"d":"20,000"},30.07,"BSE"]
["2019-07-25",538860,"PANAFIC","TRUSHA PRANAY MEHTA","SELL",{"v":460400,"d":"460,400"},0.31,"BSE"]
["2019-07-25",531802,"PRERINFRA","VIJAY SHAH","BUY",{"v":125000,"d":"125,000"},16.97,"BSE"]
["2019-07-25",500390,"RELINFRA","TOWER RESEARCH CAPITAL MARKETS INDIA PRIVATE LIMITED","BUY",{"v":1571420,"d":"1,571,420"},47.62,"BSE"]
{"$rows_left_out":45}
{"sheet":"Call Tracker (Equity & F&O)","index":5,"n_rows":341,"n_cols":18,"rows_kept":341,"merged":[[131,0,132,0],[131,1,132,1],[131,9,132,9],[131,11,132,11],[131,12,132,12],[131,13,132,13],[131,14,132,14],[131,17,132,17],[134,0,135,0],[134,1,135,1],[134,9,135,9],[134,11,135,11],[134,12,135,12],[134,13,135,13],[134,14,135,14],[134,17,135,17],[136,0,137,0],[136,1,137,1],[136,9,137,9],[136,11,137,11],[136,12,137,12],[136,13,137,13],[136,14,137,14],[140,0,141,0],[140,1,141,1],[140,9,141,9],[140,11,141,11],[140,12,141,12],[140,13,141,13],[140,14,141,14],[142,0,143,0],[142,1,143,1],[142,9,143,9],[142,11,143,11],[142,12,143,12],[142,13,143,13],[142,14,143,14]]}
[]
[]
[]
[]
[{"$nulls":12},"Back To Main Page"]
["Retail Research Technical Calls & Fundamental Performance Report for the month of July-2019 "]
[{"$nulls":12},{"$f":"Main!B10","v":"2019-07-26"}]
[null,"Positional  Call"]
["Sr.no","Date",null,"Company","Rec","Rec Price","Stop Loss***","Call Closed At","Target","Remark","Profit / Loss per Share","Gain / Loss  %","Status","Closed Date","NSE Closed Price"]
[1,"2019-05-27",null,"TATAELXSI","Buy",874,818.7,863,"970-990","Loss of Rs.11/-",{"$f":"H10-F10","v":-11},{"$f":"K10/F10","v":{"v":-0.012585812356979404,"d":"-1.26%"}},"Unsuccessful","2019-07-16",{"$nulls":3},"R"]
[2,"2019-05-28",null,"BAJAJFINSV","Sell",8175,8625,7925,7300,"Profit of Rs.250/-",{"$f":"F11-H11","v":250},{"v":0.03058103975535168,"d":"3.06%"},"Successful","2019-07-08",{"$nulls":3},"H"]
[3,"2019-05-31",null,"ITC","Buy",286,268.3,265.5,"315-325","Loss of Rs.20.5/-",{"$f":"H12-F12","v":-20.5},{"$f":"K12/F12","v":{"v":-0.07167832167832168,"d":"-7.17%"}},"Unsuccessful","2019-07-22",{"$nulls":3},"R"]
[4,"2019-06-13",null,"GODREJCP","Buy",677.5,644,639.5,"740-750","Loss of Rs.38/-",{"$f":"H13-F13","v":-38},{"$f":"K13/F13","v":{"v":-0.05608856088560885,"d":"-5.61%"}},"Unsuccessful","2019-07-10",{"$nulls":3},"H"]
[5,"2019-06-17",null,"SUNTV","Buy",517,476,507,"575-585","Loss of Rs.10/-",{"$f":"H14-F14","v":-10},{"$f":"K14/F14","v":{"v":-0.019342359767891684,"d":"-1.93%"}},"Unsuccessful","2019-07-08",{"$nulls":3},"R"]
[6,"2019-06-21",null,"AJANTPHARM","Buy",955,897.7,894,"1060-1080","Loss of Rs.61/-",{"$f":"H15-F15","v":-61},{"$f":"K15/F15","v":{"v":-0.06387434554973823,"d":"-6.39%"}},"Unsuccessful","2019-07-11",{"$nulls":3},"R"]
[7,"2019-06-24",null,"ESCORTS","Buy",549.5,518,545.25,600,"Loss of Rs.4.25/-",-4.25,{"v":-7.7343039126478615E-3,"d":"-0.77%"},"Neutral","2019-07-08",{"$nulls":3},"H"]
[8,"2019-06-25",null,"JUBLFOOD","Buy",1262.5,1158.3,1145,"1450 -1470","Loss of Rs.117.50/-",-117.5,{"v":-0.09306930693069307,"d":"-9.31%"},"Unsuccessful","2019-07-24",{"$nulls":3},"R"]
[9,"2019-07-04",null,"TORNTPHARM","Buy",1545,1454,1610,"1730-1750","Part Profit of Rs.65/-",{"$f":"H18-F18","v":65},{"$f":"K18/F18","v":{"v":0.042071197411003236,"d":"4.21%"}},"Successful","2019-07-16",{"$f":"VLOOKUP(D18,Sheet2!A5:M1644,6,0)","v":1607},null,null,"R"]
[10,"2019-07-10",null,"TCS","Buy","2105-2115",1973,null,"2295-2345","Open",{"$nulls":4},{"$f":"VLOOKUP(D19,Sheet2!A6:M1645,6,0)","v":2096.8},null,null,"H"]
[11,"2019-07-11",null,"BAJAJ-AUTO","Buy",2670,2527,2527,"1920-1950","Loss of Rs.143/-",{"$f":"H20-F20","v":-143},{"$f":"K20/F20","v":{"v":-0.05355805243445693,"d":"-5.36%"}},"Unsuccessful","2019-07-22",{"$nulls":3},"R"]
{"$rows_left_out":314}
{"sheet":"Sheet2","index":6,"n_rows":1899,"n_cols":14,"rows_kept":1899,"hidden":true}
["SYMBOL","SERIES","OPEN","HIGH","LOW","CLOSE","LAST","PREVCLOSE","TOTTRDQTY","TOTTRDVAL","TIMESTAMP","TOTALTRADES","ISIN","ISIN"]
["20MICRONS","EQ",36.4,36.95,35.2,35.95,36,35.95,19014,686168.3,"2019-07-24",311,"INE144J01027"]
["21STCENMGM","EQ",15.95,15.95,15.65,15.95,15.95,15.95,137,2176.35,"2019-07-24",9,"INE253B01015"]
["3IINFOTECH","EQ",2.6,2.6,2.45,2.55,2.55,2.6,1297934,3261628.95,"2019-07-24",629,"INE748C01020"]
["3MINDIA","EQ",21853.75,21900,21400,21454.2,21401.5,21828.4,912,19656944.05,"2019-07-24",461,"INE470A01017"]
["3PLAND","EQ",7.9,7.9,7.6,7.85,7.85,7.9,1013,7715.35,"2019-07-24",6,"INE105C01023"]
["5PAISA","EQ",191,202.75,191,202.75,202.75,193.1,12779,2562353.45,"2019-07-24",367,"INE618L01018"]
["63MOONS","EQ",94,94,88.55,89.35,89.6,93.2,176495,15896044.85,"2019-07-24",1830,"INE111B01023"]
["8KMILES","EQ",79.85,81.15,73.45,73.45,73.45,77.3,421508,32430600.7,"2019-07-24",2063,"INE650K01021"]
["A2ZINFRA","EQ",9.95,10.6,9.7,10.25,10.5,9.95,747762,7559198.2,"2019-07-24",898,"INE619I01012"]
["AARTIDRUGS","EQ",484,485.5,478,481.3,481,486,5902,2848851.85,"2019-07-24",446,"INE767A01016"]
["AARTIIND","EQ",1616.25,1633.25,1613.65,1629.7,1625,1631.4,41540,67632382.85,"2019-07-24",2988,"INE769A01020"]
["AARVEEDEN","EQ",17.8,17.8,16.25,17.15,17.3,16.25,4540,77337.35,"2019-07-24",112,"INE273D01019"]
["AAVAS","EQ",1497,1499,1445.25,1455.2,1460,1497.85,46525,68317739.9,"2019-07-24",1687,"INE216P01012"]
["ABAN","EQ",32,32.9,31.2,31.9,31.7,32.35,85338,2720103.15,"2019-07-24",821,"INE421A01028"]
["ABB","EQ",1381.1,1391.4,1351,1361.95,1356,1374.95,62557,85593607.5,"2019-07-24",5113,"INE117A01022"]
["ABBOTINDIA","EQ",8675,8675.95,8517,8629,8650,8629.35,7720,66275562.75,"2019-07-24",543,"INE358A01014"]
["ABCAPITAL","EQ",86.5,86.55,83.3,84.2,84.05,86.4,1318168,111631383.75,"2019-07-24",25944,"INE674K01013"]
["ABFRL","EQ",202.25,204.75,200,204.05,204.05,201.85,193974,39381982.7,"2019-07-24",4499,"INE647O01011"]
["ABSLNN50ET","EQ",266,266,260.67,260.77,260.77,266,62,16208.83,"2019-07-24",10,"INF209KB1B87"]
{"$rows_left_out":1680}
{"sheet":"Sheet1","index":7,"n_rows":0,"n_cols":0,"rows_kept":0,"hidden":true}

{"sheet":"Sheet3","index":8,"n_rows":0,"n_cols":0,"rows_kept":0,"hidden":true}

{"sheet":"Sheet4","index":9,"n_rows":0,"n_cols":0,"rows_kept":0,"hidden":true}