{"text_format":"3","workbook":"xlsx","n_sheets":6,"sheets":["Main","Future Intra","Cash Intra","MidCap Intra","Bulk Deals","Call Tracker (Equity & F&O)"],"not_rendered":{"images":4,"defined_names":1},"read":"whole","date_system":"1900"}

{"sheet":"Main","index":0,"n_rows":27,"n_cols":11,"rows_kept":27}
[null,"                                                                                                 "]
[]
[]
[]
[]
[{"$nulls":6}," "]
[]
[]
[]
[null,"2024-02-28"]
[]
[null,"Sheet No.","Template Name","Summary"]
[null,1,"Future Intra","For Intraday trading in F&O segment"]
[null,2,"Cash Intra","For Intraday trading in cash market segment"]
[null,3,"Mid-cap Intra","For Intraday trading in Mid-cap stocks"]
[null,4,"Bulk Deals","Reveals Bulk Deals carried on NSE & BSE"]
[null,5,"Call Tracker"]
{"$rows_empty":9}
[{"$nulls":10},"`"]

{"sheet":"Future Intra","index":1,"n_rows":236,"n_cols":16,"rows_kept":236,"merged":[[8,0,9,0],[8,1,9,1],[8,2,9,2],[8,3,9,3],[8,6,8,8],[8,9,8,11]]}
[]
[]
[]
[]
[{"$nulls":12},"Back to Main Page"]
["FOR INTRA DAY TRADING",{"$nulls":10},{"$f":"Main!B10","v":"2024-02-28"}]
[]
[]
["Sr.no","Sector","Scrip","Expiry Date","CLOSE RATE","Pivot Point","Supports",null,null,"Resistances"]
[{"$nulls":4},"Point","Point","S1","S2","S3","R1","R2","R3","HIGH","LOW","OI","% Change in OI"]
[1,"Index","NIFTY","2024-02-29",22203.05,{"v":22175.816666666666,"d":"22175.82"},{"v":22122.333333333332,"d":"22122.33"},{"v":22041.616666666665,"d":"22041.62"},{"v":21988.13333333333,"d":"21988.13"},{"v":22256.533333333333,"d":"22256.53"},{"v":22310.01666666667,"d":"22310.02"},{"v":22390.733333333334,"d":"22390.73"},22229.3,22095.1,15224650,{"v":0.025933637919648513,"d":"2.59%"}]
[2,"Index","BANKNIFTY","2024-02-29",{"v":46587.2,"d":"46587.20"},{"v":46547.5,"d":"46547.50"},{"v":46350,"d":"46350.00"},{"v":46112.8,"d":"46112.80"},{"v":45915.3,"d":"45915.30"},{"v":46784.7,"d":"46784.70"},{"v":46982.2,"d":"46982.20"},{"v":47219.399999999994,"d":"47219.40"},46745,46310.3,3241995,{"v":0.03232632006304779,"d":"3.23%"}]
[3,"Index","FINNIFTY","2024-03-26",{"v":20682,"d":"20682.00"},{"v":20700.350000000002,"d":"20700.35"},{"v":20641.650000000005,"d":"20641.65"},{"v":20601.300000000003,"d":"20601.30"},{"v":20542.600000000006,"d":"20542.60"},{"v":20740.700000000004,"d":"20740.70"},{"v":20799.4,"d":"20799.40"},{"v":20839.750000000004,"d":"20839.75"},20759.05,20660,46240,{"v":-0.6349857909693717,"d":"-63.50%"}]
[4,"Index","MIDCPNIFTY","2024-03-22",{"v":11049.9,"d":"11049.90"},{"v":11037.700000000003,"d":"11037.70"},{"v":10980.400000000005,"d":"10980.40"},{"v":10910.900000000003,"d":"10910.90"},{"v":10853.600000000006,"d":"10853.60"},{"v":11107.200000000004,"d":"11107.20"},{"v":11164.500000000004,"d":"11164.50"},{"v":11234.000000000004,"d":"11234.00"},11095,10968.2,747225,{"v":-0.4446797837355777,"d":"-44.47%"}]
[5,"Chemical","AARTIIND","2024-02-29",670.15,{"v":672.1333333333333,"d":"672.13"},{"v":665.4666666666667,"d":"665.47"},{"v":660.7833333333334,"d":"660.78"},{"v":654.1166666666668,"d":"654.12"},{"v":676.8166666666666,"d":"676.82"},{"v":683.4833333333333,"d":"683.48"},{"v":688.1666666666665,"d":"688.17"},678.8,667.45,13885000,{"v":-0.013639269730766498,"d":"-1.36%"}]
[6,"Capital_Goods","ABB","2024-02-29",{"v":5445.5,"d":"5445.50"},{"v":5392.733333333334,"d":"5392.73"},{"v":5319.366666666667,"d":"5319.37"},{"v":5193.233333333334,"d":"5193.23"},{"v":5119.866666666667,"d":"5119.87"},{"v":5518.866666666667,"d":"5518.87"},{"v":5592.233333333334,"d":"5592.23"},{"v":5718.366666666667,"d":"5718.37"},5466.1,5266.6,1711250,{"v":-0.004363636363636364,"d":"-0.44%"}]
[7,"Pharma","ABBOTINDIA","2024-02-29",{"v":28701.3,"d":"28701.30"},{"v":28423.466666666664,"d":"28423.47"},{"v":28078.033333333326,"d":"28078.03"},{"v":27454.766666666663,"d":"27454.77"},{"v":27109.333333333325,"d":"27109.33"},{"v":29046.733333333326,"d":"29046.73"},{"v":29392.166666666668,"d":"29392.17"},{"v":30015.433333333327,"d":"30015.43"},28768.9,27800.2,198160,{"v":0.015996718621821164,"d":"1.60%"}]
[8,"Others","ABCAPITAL","2024-02-29",{"v":188,"d":"188.00"},{"v":189.48333333333335,"d":"189.48"},{"v":185.5166666666667,"d":"185.52"},{"v":183.03333333333336,"d":"183.03"},{"v":179.06666666666672,"d":"179.07"},{"v":191.9666666666667,"d":"191.97"},{"v":195.93333333333334,"d":"195.93"},{"v":198.41666666666669,"d":"198.42"},193.45,187,66673800,{"v":-0.052708301365659044,"d":"-5.27%"}]
[9,"Textile","ABFRL","2024-02-29",{"v":230.2,"d":"230.20"},{"v":228.5333333333333,"d":"228.53"},{"v":225.7166666666666,"d":"225.72"},{"v":221.23333333333332,"d":"221.23"},{"v":218.41666666666663,"d":"218.42"},{"v":233.0166666666666,"d":"233.02"},{"v":235.83333333333331,"d":"235.83"},{"v":240.31666666666658,"d":"240.32"},231.35,224.05,45370000,{"v":-0.05985668875599375,"d":"-5.99%"}]
[10,"Cement","ACC","2024-02-29",2670.15,{"v":2677.0333333333333,"d":"2677.03"},{"v":2651.5166666666664,"d":"2651.52"},{"v":2632.883333333333,"d":"2632.88"},{"v":2607.3666666666663,"d":"2607.37"},{"v":2695.6666666666665,"d":"2695.67"},{"v":2721.183333333334,"d":"2721.18"},{"v":2739.8166666666666,"d":"2739.82"},2702.55,2658.4,4997700,{"v":-0.026131182041388985,"d":"-2.61%"}]
{"$rows_left_out":195}
{"sheet":"Cash Intra","index":2,"n_rows":245,"n_cols":13,"rows_kept":245,"merged":[[7,0,8,0],[7,1,8,1],[7,2,8,2],[7,3,8,3],[7,4,7,6],[7,7,7,9]]}
[]
[]
[]
[]
[{"$nulls":12},"Back to Main Page"]
["FOR INTRA DAY TRADING",{"$nulls":9},{"$f":"Main!B10","v":"2024-02-28"}]
[]
["Sr.no",null,"CLOSE RATE","Pivot Point","Supports",null,null,"Resistances"]
[{"$nulls":4},"S1","S2","S3","R1","R2","R3","HIGH","LOW","Total Trade Quanity in Lakhs"]
[1,"Nifty 50",22198.35,{"v":22167.416666666668,"d":"22167.42"},{"v":22116.583333333336,"d":"22116.58"},{"v":22034.81666666667,"d":"22034.82"},{"v":21983.983333333337,"d":"21983.98"},{"v":22249.183333333334,"d":"22249.18"},{"v":22300.01666666667,"d":"22300.02"},{"v":22381.783333333333,"d":"22381.78"},22218.25,22085.65]
[2,"Nifty Bank",46588.05,{"v":46545.06666666667,"d":"46545.07"},{"v":46367.883333333346,"d":"46367.88"},{"v":46147.716666666674,"d":"46147.72"},{"v":45970.53333333335,"d":"45970.53"},{"v":46765.233333333344,"d":"46765.23"},{"v":46942.41666666668,"d":"46942.42"},{"v":47162.58333333334,"d":"47162.58"},46722.25,{"v":46324.9,"d":"46324.90"}]
[3,"Nifty CPSE",5868.45,{"v":5859.833333333333,"d":"5859.83"},{"v":5833.366666666666,"d":"5833.37"},{"v":5798.283333333333,"d":"5798.28"},{"v":5771.816666666666,"d":"5771.82"},{"v":5894.916666666666,"d":"5894.92"},{"v":5921.383333333333,"d":"5921.38"},{"v":5956.466666666666,"d":"5956.47"},{"v":5886.3,"d":"5886.30"},5824.75]
[4,"Nifty Infra",{"v":8200.9,"d":"8200.90"},{"v":8191.383333333332,"d":"8191.38"},{"v":8167.316666666664,"d":"8167.32"},{"v":8133.733333333332,"d":"8133.73"},{"v":8109.666666666663,"d":"8109.67"},{"v":8224.966666666664,"d":"8224.97"},{"v":8249.033333333333,"d":"8249.03"},{"v":8282.616666666665,"d":"8282.62"},8215.45,{"v":8157.8,"d":"8157.80"}]
[5,"Nifty IT",37870.25,{"v":37802.083333333336,"d":"37802.08"},{"v":37674.86666666667,"d":"37674.87"},{"v":37479.48333333333,"d":"37479.48"},{"v":37352.26666666666,"d":"37352.27"},{"v":37997.466666666674,"d":"37997.47"},{"v":38124.683333333334,"d":"38124.68"},{"v":38320.06666666668,"d":"38320.07"},{"v":37929.3,"d":"37929.30"},{"v":37606.7,"d":"37606.70"}]
[6,"Nifty PSE",9270.25,{"v":9277.533333333333,"d":"9277.53"},{"v":9198.316666666666,"d":"9198.32"},{"v":9126.383333333333,"d":"9126.38"},{"v":9047.166666666666,"d":"9047.17"},{"v":9349.466666666665,"d":"9349.47"},{"v":9428.683333333332,"d":"9428.68"},{"v":9500.616666666665,"d":"9500.62"},9356.75,{"v":9205.6,"d":"9205.60"}]
[7,"Nifty Midcap 50",13931.95,{"v":13953.966666666667,"d":"13953.97"},{"v":13844.183333333334,"d":"13844.18"},{"v":13756.416666666668,"d":"13756.42"},{"v":13646.633333333335,"d":"13646.63"},{"v":14041.733333333334,"d":"14041.73"},{"v":14151.516666666666,"d":"14151.52"},{"v":14239.283333333333,"d":"14239.28"},14063.75,{"v":13866.2,"d":"13866.20"}]
[8,"ABB",5450.5,5390.25,5305.75,{"v":5161,"d":"5161.00"},{"v":5076.5,"d":"5076.50"},{"v":5535,"d":"5535.00"},{"v":5619.5,"d":"5619.50"},5764.25,5474.75,5245.5,6.56105]
[9,"ACC",2669.4,{"v":2672.633333333333,"d":"2672.63"},{"v":2657.2666666666664,"d":"2657.27"},{"v":2645.133333333333,"d":"2645.13"},{"v":2629.7666666666664,"d":"2629.77"},{"v":2684.7666666666664,"d":"2684.77"},{"v":2700.133333333333,"d":"2700.13"},{"v":2712.2666666666664,"d":"2712.27"},2688,2660.5,1.89689]
[10,"APLAPOLLO",1474.25,{"v":1472.6833333333334,"d":"1472.68"},{"v":1452.3666666666668,"d":"1452.37"},{"v":1430.4833333333333,"d":"1430.48"},{"v":1410.1666666666667,"d":"1410.17"},{"v":1494.5666666666668,"d":"1494.57"},{"v":1514.8833333333334,"d":"1514.88"},{"v":1536.7666666666669,"d":"1536.77"},1493,1450.8,8.23615]
[11,"AUBANK",590.4,{"v":590.8,"d":"590.80"},{"v":585.8999999999999,"d":"585.90"},{"v":581.3999999999999,"d":"581.40"},{"v":576.4999999999998,"d":"576.50"},{"v":595.3,"d":"595.30"},{"v":600.2,"d":"600.20"},{"v":604.7,"d":"604.70"},595.7,586.3,16.83135]
{"$rows_left_out":226}
{"sheet":"MidCap Intra","index":3,"n_rows":530,"n_cols":13,"rows_kept":530,"merged":[[0,0,0,1],[8,0,9,0],[8,1,9,1],[8,2,9,2],[8,3,9,3],[8,4,8,6],[8,7,8,9]]}
[]
[]
[]
[]
[{"$nulls":11},"Back To Main Page"]
["FOR INTRA DAY TRADING",{"$nulls":9},{"$f":"Main!B10","v":"2024-02-28"}]
[null,null," "]
[]
["Sr.no","Scrip","CLOSE RATE","Pivot Point","Supports",null,null,"Resistances"]
[{"$nulls":4},"S1","S2","S3","R1","R2","R3","HIGH","LOW","Total Trade Quanity in Lakhs"]
[1,"360ONE",747.85,{"v":758.0833333333334,"d":"758.08"},{"v":727.2166666666667,"d":"727.22"},{"v":706.5833333333334,"d":"706.58"},{"v":675.7166666666667,"d":"675.72"},{"v":778.7166666666667,"d":"778.72"},{"v":809.5833333333333,"d":"809.58"},{"v":830.2166666666667,"d":"830.22"},788.95,737.45,8.3744]
[2,"3MINDIA",31246.15,{"v":31158.350000000002,"d":"31158.35"},{"v":30904.800000000003,"d":"30904.80"},30563.45,{"v":30309.9,"d":"30309.90"},{"v":31499.700000000004,"d":"31499.70"},31753.25,{"v":32094.600000000006,"d":"32094.60"},31411.9,30817,0.034]
[3,"ABB",5450.5,5390.25,5305.75,{"v":5161,"d":"5161.00"},{"v":5076.5,"d":"5076.50"},{"v":5535,"d":"5535.00"},{"v":5619.5,"d":"5619.50"},5764.25,5474.75,5245.5,6.56105]
[4,"ACC",2669.4,{"v":2672.633333333333,"d":"2672.63"},{"v":2657.2666666666664,"d":"2657.27"},{"v":2645.133333333333,"d":"2645.13"},{"v":2629.7666666666664,"d":"2629.77"},{"v":2684.7666666666664,"d":"2684.77"},{"v":2700.133333333333,"d":"2700.13"},{"v":2712.2666666666664,"d":"2712.27"},2688,2660.5,1.89689]
[5,"AIAENG",3791.8,{"v":3763.5,"d":"3763.50"},{"v":3708.3,"d":"3708.30"},{"v":3624.8,"d":"3624.80"},{"v":3569.6000000000004,"d":"3569.60"},{"v":3847,"d":"3847.00"},{"v":3902.2,"d":"3902.20"},{"v":3985.7,"d":"3985.70"},3818.7,3680,0.5344]
[6,"APLAPOLLO",1474.25,{"v":1472.6833333333334,"d":"1472.68"},{"v":1452.3666666666668,"d":"1452.37"},{"v":1430.4833333333333,"d":"1430.48"},{"v":1410.1666666666667,"d":"1410.17"},{"v":1494.5666666666668,"d":"1494.57"},{"v":1514.8833333333334,"d":"1514.88"},{"v":1536.7666666666669,"d":"1536.77"},1493,1450.8,8.23615]
[7,"AUBANK",590.4,{"v":590.8,"d":"590.80"},{"v":585.8999999999999,"d":"585.90"},{"v":581.3999999999999,"d":"581.40"},{"v":576.4999999999998,"d":"576.50"},{"v":595.3,"d":"595.30"},{"v":600.2,"d":"600.20"},{"v":604.7,"d":"604.70"},595.7,586.3,16.83135]
[8,"AARTIDRUGS",516.1,{"v":515.9666666666666,"d":"515.97"},{"v":513.1833333333332,"d":"513.18"},{"v":510.26666666666654,"d":"510.27"},{"v":507.4833333333331,"d":"507.48"},{"v":518.8833333333332,"d":"518.88"},{"v":521.6666666666667,"d":"521.67"},{"v":524.5833333333333,"d":"524.58"},518.75,513.05,1.28737]
[9,"AARTIIND",669.8,{"v":672.0500000000001,"d":"672.05"},{"v":664.7500000000001,"d":"664.75"},{"v":659.7,"d":"659.70"},{"v":652.4000000000001,"d":"652.40"},{"v":677.1000000000001,"d":"677.10"},{"v":684.4000000000001,"d":"684.40"},{"v":689.4500000000002,"d":"689.45"},679.35,667,9.83657]
[10,"AAVAS",1459.65,{"v":1458.4166666666667,"d":"1458.42"},{"v":1446.2333333333336,"d":"1446.23"},{"v":1432.8166666666668,"d":"1432.82"},{"v":1420.6333333333337,"d":"1420.63"},{"v":1471.8333333333335,"d":"1471.83"},{"v":1484.0166666666664,"d":"1484.02"},{"v":1497.4333333333334,"d":"1497.43"},1470.6,1445,3.67166]
{"$rows_left_out":511}
{"sheet":"Bulk Deals","index":4,"n_rows":256,"n_cols":8,"rows_kept":256,"merged":[[4,0,4,1],[4,2,4,3],[6,1,6,2]]}
[" "]
[]
[]
[]
[]
[{"$nulls":4},"Back To Main Page"]
["Subject :","BULK DEAL",null,{"$f":"Main!B10","v":"2024-02-28"}]
[]
["Date","Scrip code","Scrip Name","Client Name","Buy / Sell","Quantity Traded","Trade Price / Wt.Avg.trade price","Exchange  "]
["2024-02-27",513119,"ABCGAS","SYAMALPRASAD DWARKAPRASAD SHOREWALA","SELL",{"v":21633,"d":"21,633"},55.65,"BSE"]
["2024-02-27",543269,"ADJIA","SHRENI SHARES LTD","BUY",{"v":3200,"d":"3,200"},33,"BSE"]
["2024-02-27",543269,"ADJIA","SHRENI SHARES LTD","SELL",{"v":4800,"d":"4,800"},34.67,"BSE"]
["2024-02-27",539277,"ALSTONE","SAHASTRAA ADVISORS PRIVATE LIMITED","SELL",{"v":19361935,"d":"19,361,935"},0.93,"BSE"]
["2024-02-27",539277,"ALSTONE","MANSI SHARE & STOCK ADVISORS PRIVATE LIMITED","SELL",{"v":7000000,"d":"7,000,000"},0.94,"BSE"]
["2024-02-27",539277,"ALSTONE","SAHASTRAA ADVISORS PRIVATE LIMITED","BUY",{"v":7753780,"d":"7,753,780"},0.92,"BSE"]
["2024-02-27",531381,"ARIHANT","GLOBALWORTH SECURITIES LIMITED","BUY",{"v":23887,"d":"23,887"},131.9,"BSE"]
["2024-02-27",531381,"ARIHANT","GLOBALWORTH SECURITIES LIMITED","SELL",{"v":43036,"d":"43,036"},130.51,"BSE"]
["2024-02-27",522005,"AUSTENG","MALLIKARJUN YADAV GADDAM","BUY",{"v":26150,"d":"26,150"},223.57,"BSE"]
["2024-02-27",539662,"BFLAFL","PARUL PALIWAL","SELL",{"v":54381,"d":"54,381"},23.85,"BSE"]
["2024-02-27",539662,"BFLAFL","PARUL PALIWAL","BUY",{"v":54381,"d":"54,381"},23.67,"BSE"]
{"$rows_left_out":237}
{"sheet":"Call Tracker (Equity & F&O)","index":5,"n_rows":366,"n_cols":19,"rows_kept":366,"merged":[[49,0,50,0],[49,1,50,1],[49,6,50,6],[49,9,50,9],[49,12,50,12],[49,14,50,14],[49,15,50,15],[75,0,76,0],[75,1,76,1],[75,9,76,9],[75,14,76,14],[75,15,76,15],[79,0,80,0],[79,1,80,1],[79,9,80,9],[79,12,80,12],[79,14,80,14],[79,15,80,15],[85,0,86,0],[85,1,86,1],[85,9,86,9],[85,12,86,12],[85,14,86,14],[85,15,86,15],[90,0,91,0],[90,1,91,1],[90,9,91,9],[90,12,91,12],[90,14,91,14],[90,15,91,15],[92,0,93,0],[92,1,93,1],[92,9,93,9],[92,12,93,12],[92,14,93,14],[92,15,93,15],[94,0,95,0],[94,1,95,1],[94,9,95,9],[94,12,95,12],[94,14,95,14],[94,15,95,15],[96,0,97,0],[96,1,97,1],[96,9,97,9],[96,12,97,12],[96,14,97,14],[96,15,97,15],[98,0,99,0],[98,1,99,1],[98,9,99,9],[98,12,99,12],[98,14,99,14],[98,15,99,15],[100,0,101,0],[100,1,101,1],[100,9,101,9],[100,12,101,12],[100,14,101,14],[100,15,101,15],[102,0,103,0],[102,1,103,1],[102,9,103,9],[102,12,103,12],[102,14,103,14],[102,15,103,15],[104,0,105,0],[104,1,105,1],[104,9,105,9],[104,12,105,12],[104,14,105,14],[104,15,105,15],[107,0,108,0],[107,1,108,1],[107,9,108,9],[107,12,108,12],[107,14,108,14],[107,15,108,15],[109,0,110,0],[109,1,110,1],[109,9,110,9],[109,12,110,12],[109,14,110,14],[109,15,110,15],[112,0,113,0],[112,1,113,1],[112,9,113,9],[112,12,113,12],[112,14,113,14],[112,15,113,15],[114,0,115,0],[114,1,115,1],[114,9,115,9],[114,12,115,12],[114,14,115,14],[114,15,115,15],[119,0,120,0],[119,1,120,1],[119,9,120,9],[119,12,120,12],[119,14,120,14],[119,15,120,15],[121,0,122,0],[121,1,122,1],[121,9,122,9],[121,12,122,12],[121,14,122,14],[121,15,122,15],[125,0,126,0],[125,1,126,1],[125,9,126,9],[125,12,126,12],[125,14,126,14],[125,15,126,15],[127,0,128,0],[127,1,128,1],[127,9,128,9],[127,12,128,12],[127,14,128,14],[127,15,128,15],[131,0,132,0],[131,1,132,1],[131,9,132,9],[131,12,132,12],[131,14,132,14],[131,15,132,15],[133,0,134,0],[133,1,134,1],[133,9,134,9],[133,12,134,12],[133,14,134,14],[133,15,134,15]]}
[]
[]
[]
[]
[{"$nulls":12},"Back To Main Page"]
["Retail Research Technical Calls & Fundamental Performance Report for the month of February-2024"]
[{"$nulls":12},{"$f":"Main!B10","v":"2024-02-28"}]
[null,"Positional  Call"]
["Sr.no","Date",null,"Company","Rec","Rec Price","Stop Loss***","Call Closed At","Target","Remark","Profit / Loss per Share","All charges","Net Gain / Loss  %","Status","Closed Date","Market Closing Price","Second Buying Date"]
[1,"2023-12-18",null,"SBIN","Accu",632,593,670,"680-720","Profit of Rs.38/-",{"$f":"H10-F10","v":38},{"$f":"(F10*-0.3)/100","v":{"v":-1.896,"d":"-1.90"}},{"$f":"(K10+L10)/F10","v":{"v":0.05712658227848101,"d":"5.71%"}},"Successful","2024-02-07",{"$nulls":3},"H"]
[2,"2023-12-28",null,"VINATIORGA","Accu",1725,1645,1645,"1860-1960","Loss of Rs.80/-",-80,{"v":-5.175,"d":"-5.18"},{"v":-0.049376811594202895,"d":"-4.94%"},"Unsuccessful","2024-02-09",{"$nulls":3},"H"]
[3,"2024-01-03",null,"MARUTI","Accu",9937.5,9340,10410,"10700-11200","Profit of Rs.472.5/-",472.5,{"v":-29.8125,"d":"-29.81"},{"$f":"(K12+L12)/F12","v":{"v":0.04454716981132076,"d":"4.45%"}},"Successful","2024-02-01",{"$nulls":3},"H"]
[4,"2024-01-12",null,"JUBLFOOD","Accu",521.5,490,487,"555-575","Loss of Rs.34.5/-",-34.5,{"v":-1.5644999999999998,"d":"-1.56"},{"$f":"(K13+L13)/F13","v":{"v":-0.06915532118887824,"d":"-6.92%"}},"Unsuccessful","2024-02-05",{"$nulls":3},"K"]
[5,"2024-01-16",null,"CAPACITE ","Accu",267.5,237,282.5,"300-330","Profit of Rs.15/-",15,{"v":-0.8025,"d":"-0.80"},{"v":0.053074766355140184,"d":"5.31%"},"Successful","2024-02-08",{"$nulls":3},"H"]
[6,"2024-01-25",null,"FLUOROCHEM","Accu",3485,3280,3685,"3900-4200","Profit of Rs.200/-",200,{"v":-10.455,"d":"-10.46"},{"$f":"(K15+L15)/F15","v":{"v":0.054388809182209466,"d":"5.44%"}},"Successful","2024-02-26",{"$nulls":3},"H"]
[7,"2024-01-25",null,"VGUARD","Accu",288,267,305,"305-325","Profit of Rs.17/-",17,{"v":-0.8639999999999999,"d":"-0.86"},{"$f":"(K16+L16)/F16","v":{"v":0.056027777777777774,"d":"5.60%"}},"Successful","2024-02-01",{"$nulls":3},"H"]
[8,"2024-01-29",null,"GMMPFAUDLR","Accu",1502.5,1415,1400,"1650-1750","Loss of Rs.102.5/-",-102.5,{"v":-4.5075,"d":"-4.51"},{"v":-0.07121963394342762,"d":"-7.12%"},"Unsuccessful","2024-02-09",{"$nulls":3},"H"]
[9,"2024-01-30",null,"RELIANCE","Accu","2870-2790",2640,null,"3100-3200","Open",{"$nulls":5},{"$f":"VLOOKUP(D18,'MidCap Intra'!$B$11:$C$568,2,0)","v":{"v":2971.3,"d":"2971.30"}},null,null,"H"]
[10,"2024-01-30",null,"JAMNAAUTO","Accu",115.5,106,123,"124-130","Profit of Rs.7.5/-",{"$f":"H19-F19","v":7.5},{"$f":"(F19*-0.3)/100","v":{"v":-0.3465,"d":"-0.35"}},{"$f":"(K19+L19)/F19","v":{"v":0.06193506493506494,"d":"6.19%"}},"Successful","2024-02-05",{"$nulls":3},"H"]
[11,"2024-02-02",null,"DATAPATTNS","Accu",1880,1790,1990,"2040-2140","Profit of Rs.110/-",{"$f":"H20-F20","v":110},{"$f":"(F20*-0.3)/100","v":-5.64},{"$f":"(K20+L20)/F20","v":{"v":0.05551063829787234,"d":"5.55%"}},"Successful","2024-02-16",{"$nulls":3},"H"]
{"$rows_left_out":339}