{"text_format":"3","workbook":"xlsx","n_sheets":6,"sheets":["Main","Future Intra","Cash Intra","MidCap Intra","Bulk Deals","Call Tracker (Equity & F&O)"],"not_rendered":{"images":2,"defined_names":3},"read":"whole","date_system":"1900"}

{"sheet":"Main","index":0,"n_rows":27,"n_cols":11,"rows_kept":27}
[null,"                                                                                                 "]
{"$rows_empty":8}
[null,"2023-03-27"]
[]
[null,"Sheet No.","Template Name","Summary"]
[null,1,"Future Intra","For Intraday trading in F&O segment"]
[null,2,"Cash Intra","For Intraday trading in cash market segment"]
[null,3,"Mid-cap Intra","For Intraday trading in Mid-cap stocks"]
[null,4,"Bulk Deals","Reveals Bulk Deals carried on NSE & BSE"]
[null,5,"Call Tracker"]
{"$rows_empty":9}
[{"$nulls":10},"`"]

{"sheet":"Future Intra","index":1,"n_rows":237,"n_cols":16,"rows_kept":237,"merged":[[8,0,9,0],[8,1,9,1],[8,2,9,2],[8,3,9,3],[8,6,8,8],[8,9,8,11]]}
[]
[]
[]
[]
[{"$nulls":12},"Back to Main Page"]
["FOR INTRA DAY TRADING",{"$nulls":10},{"$f":"Main!B10","v":"2023-03-27"}]
[]
[]
["Sr.no","Sector","Scrip","Expiry Date","CLOSE RATE","Pivot Point","Supports",null,null,"Resistances"]
[{"$nulls":4},"Point","Point","S1","S2","S3","R1","R2","R3","HIGH","LOW","OI","% Change in OI"]
[1,"Index","NIFTY","2023-03-29",16955.05,{"v":17002.3,"d":"17002.30"},{"v":16884.699999999997,"d":"16884.70"},16814.35,{"v":16696.749999999996,"d":"16696.75"},{"v":17072.649999999998,"d":"17072.65"},{"v":17190.249999999996,"d":"17190.25"},{"v":17260.6,"d":"17260.60"},17119.9,16931.95,16845500,{"v":0.025510685510259368,"d":"2.55%"}]
[2,"Index","BANKNIFTY","2023-03-29",{"v":39423.8,"d":"39423.80"},{"v":39535.26666666667,"d":"39535.27"},{"v":39236.53333333334,"d":"39236.53"},{"v":39049.26666666667,"d":"39049.27"},{"v":38750.53333333334,"d":"38750.53"},{"v":39722.53333333334,"d":"39722.53"},{"v":40021.26666666666,"d":"40021.27"},{"v":40208.53333333334,"d":"40208.53"},39834,39348,5717000,{"v":-0.003954910535393836,"d":"-0.40%"}]
[3,"Index","FINNIFTY","2023-03-28",17610.85,{"v":17665.350000000002,"d":"17665.35"},{"v":17541.450000000004,"d":"17541.45"},{"v":17472.050000000003,"d":"17472.05"},{"v":17348.150000000005,"d":"17348.15"},{"v":17734.750000000004,"d":"17734.75"},{"v":17858.650000000005,"d":"17858.65"},{"v":17928.050000000003,"d":"17928.05"},17789.25,17595.95,29840,{"v":-0.19176598049837487,"d":"-19.18%"}]
[4,"Index","MIDCPNIFTY","2023-03-28",{"v":6992.1,"d":"6992.10"},{"v":2330.7000000000003,"d":"2330.70"},{"v":4661.400000000001,"d":"4661.40"},{"v":2330.7000000000003,"d":"2330.70"},{"v":4661.400000000001,"d":"4661.40"},{"v":4661.400000000001,"d":"4661.40"},{"v":2330.7000000000003,"d":"2330.70"},{"v":4661.400000000001,"d":"4661.40"},0,0,0,{"$error":"#DIV/0!"}]
[5,"Chemical","AARTIIND","2023-03-29",{"v":496.4,"d":"496.40"},{"v":504.4166666666667,"d":"504.42"},{"v":485.9333333333334,"d":"485.93"},{"v":475.4666666666667,"d":"475.47"},{"v":456.9833333333334,"d":"456.98"},{"v":514.8833333333334,"d":"514.88"},{"v":533.3666666666666,"d":"533.37"},{"v":543.8333333333334,"d":"543.83"},522.9,493.95,4593400,{"v":0.015026296018031555,"d":"1.50%"}]
[6,"Capital_Goods","ABB","2023-03-29",3340.35,3349.25,{"v":3316.8,"d":"3316.80"},3293.25,{"v":3260.8,"d":"3260.80"},{"v":3372.8,"d":"3372.80"},3405.25,{"v":3428.8,"d":"3428.80"},3381.7,3325.7,1678000,{"v":-0.01971666423251059,"d":"-1.97%"}]
[7,"Pharma","ABBOTINDIA","2023-03-29",{"v":21199.4,"d":"21199.40"},{"v":21369.766666666666,"d":"21369.77"},{"v":20967.183333333334,"d":"20967.18"},{"v":20734.966666666667,"d":"20734.97"},{"v":20332.383333333335,"d":"20332.38"},{"v":21601.983333333334,"d":"21601.98"},{"v":22004.56666666667,"d":"22004.57"},{"v":22236.783333333333,"d":"22236.78"},21772.35,21137.55,45000,{"v":-0.07937806873977087,"d":"-7.94%"}]
[8,"Others","ABCAPITAL","2023-03-29",143.75,{"v":146.46666666666667,"d":"146.47"},{"v":139.93333333333334,"d":"139.93"},{"v":136.11666666666667,"d":"136.12"},{"v":129.58333333333334,"d":"129.58"},{"v":150.28333333333333,"d":"150.28"},{"v":156.8166666666667,"d":"156.82"},{"v":160.63333333333333,"d":"160.63"},153,142.65,36444600,{"v":0.004016661707825052,"d":"0.40%"}]
[9,"Textile","ABFRL","2023-03-29",211.75,{"v":211.45000000000002,"d":"211.45"},{"v":209.30000000000004,"d":"209.30"},{"v":206.85000000000002,"d":"206.85"},{"v":204.70000000000005,"d":"204.70"},{"v":213.90000000000003,"d":"213.90"},216.05,{"v":218.50000000000003,"d":"218.50"},213.6,209,26390000,{"v":-0.03809704321455648,"d":"-3.81%"}]
[10,"Cement","ACC","2023-03-29",1702.75,{"v":1715.5666666666668,"d":"1715.57"},{"v":1684.0833333333337,"d":"1684.08"},{"v":1665.416666666667,"d":"1665.42"},{"v":1633.9333333333338,"d":"1633.93"},{"v":1734.2333333333336,"d":"1734.23"},{"v":1765.7166666666667,"d":"1765.72"},{"v":1784.3833333333334,"d":"1784.38"},1747.05,1696.9,4893750,{"v":3.6917397323488694E-3,"d":"0.37%"}]
{"$rows_left_out":203}
{"sheet":"Cash Intra","index":2,"n_rows":246,"n_cols":13,"rows_kept":246,"merged":[[7,0,8,0],[7,1,8,1],[7,2,8,2],[7,3,8,3],[7,4,7,6],[7,7,7,9]]}
[]
[]
[]
[]
[{"$nulls":12},"Back to Main Page"]
["FOR INTRA DAY TRADING",{"$nulls":9},{"$f":"Main!B10","v":"2023-03-27"}]
[]
["Sr.no",null,"CLOSE RATE","Pivot Point","Supports",null,null,"Resistances"]
[{"$nulls":4},"S1","S2","S3","R1","R2","R3","HIGH","LOW","Total Trade Quanity in Lakhs"]
[1,"Nifty 50",16945.05,{"v":16990.616666666665,"d":"16990.62"},{"v":16871.78333333333,"d":"16871.78"},{"v":16798.516666666663,"d":"16798.52"},{"v":16679.683333333327,"d":"16679.68"},{"v":17063.88333333333,"d":"17063.88"},{"v":17182.716666666667,"d":"17182.72"},{"v":17255.983333333334,"d":"17255.98"},17109.45,16917.35]
[2,"Nifty Bank",39395.35,{"v":39486.049999999996,"d":"39486.05"},{"v":39204.19999999999,"d":"39204.20"},{"v":39013.049999999996,"d":"39013.05"},{"v":38731.19999999999,"d":"38731.20"},{"v":39677.19999999999,"d":"39677.20"},{"v":39959.049999999996,"d":"39959.05"},{"v":40150.19999999999,"d":"40150.20"},{"v":39767.9,"d":"39767.90"},{"v":39294.9,"d":"39294.90"}]
[3,"Nifty CPSE",{"v":2851.5,"d":"2851.50"},{"v":2865.8666666666663,"d":"2865.87"},{"v":2830.8333333333326,"d":"2830.83"},{"v":2810.166666666666,"d":"2810.17"},{"v":2775.1333333333323,"d":"2775.13"},{"v":2886.533333333333,"d":"2886.53"},{"v":2921.5666666666666,"d":"2921.57"},{"v":2942.233333333333,"d":"2942.23"},{"v":2900.9,"d":"2900.90"},{"v":2845.2,"d":"2845.20"}]
[4,"Nifty Infra",5024.35,{"v":5043.349999999999,"d":"5043.35"},{"v":4994.799999999999,"d":"4994.80"},4965.25,{"v":4916.7,"d":"4916.70"},{"v":5072.899999999999,"d":"5072.90"},5121.45,{"v":5150.999999999998,"d":"5151.00"},{"v":5091.9,"d":"5091.90"},{"v":5013.8,"d":"5013.80"}]
[5,"Nifty IT",27935.65,{"v":28086.333333333332,"d":"28086.33"},{"v":27718.816666666666,"d":"27718.82"},{"v":27501.983333333334,"d":"27501.98"},{"v":27134.466666666667,"d":"27134.47"},{"v":28303.166666666664,"d":"28303.17"},{"v":28670.683333333334,"d":"28670.68"},{"v":28887.516666666663,"d":"28887.52"},28453.85,{"v":27869.5,"d":"27869.50"}]
[6,"Nifty PSE",4421.15,{"v":4438.166666666667,"d":"4438.17"},{"v":4394.833333333334,"d":"4394.83"},{"v":4368.516666666667,"d":"4368.52"},{"v":4325.183333333334,"d":"4325.18"},{"v":4464.483333333334,"d":"4464.48"},{"v":4507.8166666666675,"d":"4507.82"},{"v":4534.133333333333,"d":"4534.13"},{"v":4481.5,"d":"4481.50"},4411.85]
[7,"Nifty Midcap 50",8283.75,{"v":8317.666666666666,"d":"8317.67"},{"v":8232.383333333331,"d":"8232.38"},{"v":8181.016666666665,"d":"8181.02"},{"v":8095.73333333333,"d":"8095.73"},{"v":8369.033333333333,"d":"8369.03"},{"v":8454.31666666667,"d":"8454.32"},{"v":8505.683333333334,"d":"8505.68"},8402.95,{"v":8266.3,"d":"8266.30"}]
[8,"ABB",3346.7,{"v":3356.2333333333336,"d":"3356.23"},{"v":3320.466666666667,"d":"3320.47"},{"v":3294.2333333333336,"d":"3294.23"},{"v":3258.466666666667,"d":"3258.47"},{"v":3382.466666666667,"d":"3382.47"},{"v":3418.2333333333336,"d":"3418.23"},{"v":3444.466666666667,"d":"3444.47"},3392,3330,1.80779]
[9,"ACC",1700.85,{"v":1713.7833333333335,"d":"1713.78"},{"v":1681.616666666667,"d":"1681.62"},{"v":1662.3833333333334,"d":"1662.38"},{"v":1630.216666666667,"d":"1630.22"},{"v":1733.016666666667,"d":"1733.02"},{"v":1765.1833333333336,"d":"1765.18"},{"v":1784.4166666666672,"d":"1784.42"},1745.95,1694.55,5.30916]
[10,"AUBANK",559.9,{"v":559.3666666666667,"d":"559.37"},{"v":548.5333333333333,"d":"548.53"},{"v":537.1666666666666,"d":"537.17"},{"v":526.3333333333333,"d":"526.33"},{"v":570.7333333333333,"d":"570.73"},{"v":581.5666666666666,"d":"581.57"},{"v":592.9333333333334,"d":"592.93"},570.2,548,21.78563]
[11,"ABBOTINDIA",21128.9,21287.75,{"v":20897.5,"d":"20897.50"},{"v":20666.1,"d":"20666.10"},20275.85,21519.15,{"v":21909.4,"d":"21909.40"},{"v":22140.800000000003,"d":"22140.80"},21678,21056.35,0.05596]
{"$rows_left_out":227}
{"sheet":"MidCap Intra","index":3,"n_rows":532,"n_cols":13,"rows_kept":532,"merged":[[0,0,0,1],[8,0,9,0],[8,1,9,1],[8,2,9,2],[8,3,9,3],[8,4,8,6],[8,7,8,9]]}
[]
[]
[]
[]
[{"$nulls":11},"Back To Main Page"]
["FOR INTRA DAY TRADING",{"$nulls":9},{"$f":"Main!B10","v":"2023-03-27"}]
[null,null," "]
[]
["Sr.no","Scrip","CLOSE RATE","Pivot Point","Supports",null,null,"Resistances"]
[{"$nulls":4},"S1","S2","S3","R1","R2","R3","HIGH","LOW","Total Trade Quanity in Lakhs"]
[1,"360ONE",429.1,{"v":427.9666666666667,"d":"427.97"},{"v":421.08333333333337,"d":"421.08"},{"v":413.06666666666666,"d":"413.07"},{"v":406.18333333333334,"d":"406.18"},{"v":435.9833333333334,"d":"435.98"},{"v":442.86666666666673,"d":"442.87"},{"v":450.88333333333344,"d":"450.88"},434.85,419.95,1.38825]
[2,"3MINDIA",22323.05,{"v":22193.666666666668,"d":"22193.67"},{"v":21859.383333333335,"d":"21859.38"},{"v":21395.716666666667,"d":"21395.72"},{"v":21061.433333333334,"d":"21061.43"},{"v":22657.333333333336,"d":"22657.33"},{"v":22991.61666666667,"d":"22991.62"},{"v":23455.283333333336,"d":"23455.28"},22527.95,21730,0.02615]
[3,"ABB",3346.7,{"v":3356.2333333333336,"d":"3356.23"},{"v":3320.466666666667,"d":"3320.47"},{"v":3294.2333333333336,"d":"3294.23"},{"v":3258.466666666667,"d":"3258.47"},{"v":3382.466666666667,"d":"3382.47"},{"v":3418.2333333333336,"d":"3418.23"},{"v":3444.466666666667,"d":"3444.47"},3392,3330,1.80779]
[4,"ACC",1700.85,{"v":1713.7833333333335,"d":"1713.78"},{"v":1681.616666666667,"d":"1681.62"},{"v":1662.3833333333334,"d":"1662.38"},{"v":1630.216666666667,"d":"1630.22"},{"v":1733.016666666667,"d":"1733.02"},{"v":1765.1833333333336,"d":"1765.18"},{"v":1784.4166666666672,"d":"1784.42"},1745.95,1694.55,5.30916]
[5,"AIAENG",2843.05,{"v":2846.9833333333336,"d":"2846.98"},{"v":2799.966666666667,"d":"2799.97"},{"v":2756.8833333333337,"d":"2756.88"},{"v":2709.8666666666672,"d":"2709.87"},{"v":2890.066666666667,"d":"2890.07"},{"v":2937.0833333333335,"d":"2937.08"},{"v":2980.166666666667,"d":"2980.17"},2894,2803.9,0.62368]
[6,"APLAPOLLO",1208.95,{"v":1222.4833333333333,"d":"1222.48"},{"v":1191.9666666666667,"d":"1191.97"},{"v":1174.9833333333333,"d":"1174.98"},{"v":1144.4666666666667,"d":"1144.47"},{"v":1239.4666666666667,"d":"1239.47"},{"v":1269.9833333333336,"d":"1269.98"},{"v":1286.9666666666667,"d":"1286.97"},1253,1205.5,2.76927]
[7,"AUBANK",559.9,{"v":559.3666666666667,"d":"559.37"},{"v":548.5333333333333,"d":"548.53"},{"v":537.1666666666666,"d":"537.17"},{"v":526.3333333333333,"d":"526.33"},{"v":570.7333333333333,"d":"570.73"},{"v":581.5666666666666,"d":"581.57"},{"v":592.9333333333334,"d":"592.93"},570.2,548,21.78563]
[8,"AARTIDRUGS",386.6,{"v":388.5333333333333,"d":"388.53"},{"v":372.3666666666666,"d":"372.37"},{"v":358.1333333333333,"d":"358.13"},{"v":341.96666666666664,"d":"341.97"},{"v":402.7666666666666,"d":"402.77"},{"v":418.93333333333334,"d":"418.93"},{"v":433.1666666666666,"d":"433.17"},404.7,374.3,76.37327]
[9,"AAVAS",1682.9,{"v":1684.6833333333334,"d":"1684.68"},{"v":1660.3666666666668,"d":"1660.37"},{"v":1637.8333333333335,"d":"1637.83"},{"v":1613.5166666666669,"d":"1613.52"},{"v":1707.2166666666667,"d":"1707.22"},{"v":1731.5333333333333,"d":"1731.53"},{"v":1754.0666666666666,"d":"1754.07"},1709,1662.15,0.85231]
[10,"ABBOTINDIA",21128.9,21287.75,{"v":20897.5,"d":"20897.50"},{"v":20666.1,"d":"20666.10"},20275.85,21519.15,{"v":21909.4,"d":"21909.40"},{"v":22140.800000000003,"d":"22140.80"},21678,21056.35,0.05596]
{"$rows_left_out":513}
{"sheet":"Bulk Deals","index":4,"n_rows":158,"n_cols":8,"rows_kept":158,"merged":[[4,0,4,1],[4,2,4,3],[6,1,6,2]]}
[" "]
[]
[]
[]
[]
[{"$nulls":4},"Back To Main Page"]
["Subject :","BULK DEAL",null,{"$f":"Main!B10","v":"2023-03-27"}]
[]
["Date","Scrip code","Scrip Name","Client Name","Buy / Sell","Quantity Traded","Trade Price / Wt.Avg.trade price","Exchange  "]
["2023-03-24",542377,"AARSHYAM","KRORES CARDS PRIVATE LIMITED","BUY",{"v":231000,"d":"231,000"},5.41,"BSE"]
["2023-03-24",542377,"AARSHYAM","NNM SECURITIES PVT LTD","SELL",{"v":231000,"d":"231,000"},5.41,"BSE"]
["2023-03-24",539773,"ADVIKCA","BHAVYA DHIMAN","BUY",{"v":1379381,"d":"1,379,381"},3.77,"BSE"]
["2023-03-24",539773,"ADVIKCA","BHAVYA DHIMAN","SELL",{"v":1379381,"d":"1,379,381"},3.83,"BSE"]
["2023-03-24",537069,"ARNOLD","INT INFRASTRUCTURE PRIVATE LIMITED","SELL",{"v":399925,"d":"399,925"},24,"BSE"]
["2023-03-24",537069,"ARNOLD","HARIVARDHAN STEEL & ALLOYS PRIVATE LIMTED","BUY",{"v":400000,"d":"400,000"},24,"BSE"]
["2023-03-24",542285,"AXITA","WONDERLAND SUPPLIERS PRIVATE LIMITED","BUY",{"v":1995756,"d":"1,995,756"},51.1,"BSE"]
["2023-03-24",543831,"BRIGHT","KUBER EQUITY SERVICES LLP","BUY",{"v":95000,"d":"95,000"},150,"BSE"]
["2023-03-24",543831,"BRIGHT","KESAR TRACOM INDIA LLP","BUY",{"v":128000,"d":"128,000"},150,"BSE"]
["2023-03-24",543831,"BRIGHT","RISHABH RAMESHCHANDRA JAIN","SELL",{"v":81000,"d":"81,000"},150,"BSE"]
["2023-03-24",543831,"BRIGHT","SUNRISE GILTS AND SECURITIES PVT LTD","BUY",{"v":335000,"d":"335,000"},150,"BSE"]
{"$rows_left_out":139}
{"sheet":"Call Tracker (Equity & F&O)","index":5,"n_rows":329,"n_cols":18,"rows_kept":329,"merged":[[61,0,62,0],[61,1,62,1],[61,6,62,6],[61,9,62,9],[61,13,62,13],[61,14,62,14],[61,15,62,15],[75,0,76,0],[75,1,76,1],[75,9,76,9]]}
[]
[]
[]
[]
[{"$nulls":12},"Back To Main Page"]
["Retail Research Technical Calls & Fundamental Performance Report for the month of Mar-2023"]
[{"$nulls":12},{"$f":"Main!B10","v":"2023-03-27"}]
[null,"Positional  Call"]
["Sr.no","Date",null,"Company","Rec","Rec Price","Stop Loss***","Call Closed At","Target","Remark","Profit / Loss per Share","All charges","Net Gain / Loss  %","Status","Closed Date","Market Closing Price"]
[1,"2022-12-01",null,"TCS","Buy<>",3380,3140,{"$f":"(3565+3140)/2","v":3352.5},"3800-4000","Loss of Rs.27.5/-",{"$f":"H10-F10","v":-27.5},{"$f":"(F10*-0.7)/100","v":-23.66},{"$f":"(K10+L10)/F10","v":{"v":-0.015136094674556212,"d":"-1.51%"}},"Unsuccessful","2023-03-20",null,null,"H"]
[2,"2023-01-10",null,"BHARTIARTL","Buy","780-800",735,null,"870-900","Open",{"$nulls":5},{"$f":"VLOOKUP(D11,'MidCap Intra'!B11:C511,2,0)","v":762.45},null,"H"]
[3,"2023-01-24",null,"KIMS","Buy",1435,1340,{"$f":"(1512.5+1324.5)/2","v":1418.5},"1580-1650","Loss of Rs.16.5/-",{"$f":"H12-F12","v":-16.5},{"$f":"(F12*-0.7)/100","v":{"v":-10.044999999999998,"d":"-10.05"}},{"$f":"(K12+L12)/F12","v":{"v":-0.01849825783972125,"d":"-1.85%"}},"Unsuccessful","2023-03-22",null,null,"N"]
[4,"2023-02-01",null,"AXISBANK","Accu","825-850",790,null,"900-950","Open",{"$nulls":5},{"$f":"VLOOKUP(D13,'MidCap Intra'!B13:C513,2,0)","v":{"v":839.9,"d":"839.90"}},null,"H"]
[5,"2023-02-06",null,"JSWSTEEL","Accu","695-717.5",660,null,"770-800","Open",{"$nulls":5},{"$f":"VLOOKUP(D14,'MidCap Intra'!B14:C514,2,0)","v":{"v":657.8,"d":"657.80"}},null,"H"]
[6,"2023-02-16",null,"PIDILITIND","Accu",2280,2170,2395,"2450-2500","Profit of Rs.115/-",{"$f":"H15-F15","v":115},{"$f":"(F15*-0.7)/100","v":-15.96},{"$f":"(K15+L15)/F15","v":{"v":0.04343859649122807,"d":"4.34%"}},"Successful","2023-03-22",null,null,"H"]
[7,"2023-02-20",null,"SHARDACROP","Accu",462.5,425,null,"520-550","Open",{"$nulls":5},{"$f":"VLOOKUP(D16,'MidCap Intra'!B16:C516,2,0)","v":459.85},null,"H"]
[8,"2023-02-21",null,"CANBK","Accu",284.5,268,303.5,"315-335","Profit of Rs.19/-",{"$f":"H17-F17","v":19},{"$f":"(F17*-0.7)/100","v":{"v":-1.9914999999999998,"d":"-1.99"}},{"$f":"(K17+L17)/F17","v":{"v":0.05978383128295255,"d":"5.98%"}},"Successful","2023-03-03",null,null,"N"]
[9,"2023-02-21",null,"HAPPIESTMNDS","Accu",{"$f":"(865+899)/2","v":882},830,830,"960-1000","Loss of Rs.52/-",{"$f":"H18-F18","v":-52},{"$f":"(F18*-0.7)/100","v":{"v":-6.1739999999999995,"d":"-6.17"}},{"$f":"(K18+L18)/F18","v":{"v":-0.06595691609977324,"d":"-6.60%"}},"Unsuccessful","2023-03-15",null,null,"H"]
[10,"2023-02-24",null,"PIIND","Accu","3110-3010",2890,null,"3300-3400","Open",{"$nulls":5},{"$f":"VLOOKUP(D19,'MidCap Intra'!B19:C519,2,0)","v":{"v":2934.1,"d":"2934.10"}},null,"H"]
[11,"2023-02-27",null,"SBIN","Accu",522.5,478,554,"570-600","Profit of Rs.31.50/-",{"$f":"H20-F20","v":31.5},{"$f":"(F20*-0.7)/100","v":{"v":-3.6575,"d":"-3.66"}},{"$f":"(K20+L20)/F20","v":{"v":0.05328708133971292,"d":"5.33%"}},"Successful","2023-03-03",null,null,"H"]
{"$rows_left_out":309}