{"text_format":"3","workbook":"xlsx","n_sheets":6,"sheets":["Main","Future Intra","Cash Intra","MidCap Intra","Bulk Deals","Call Tracker (Equity & F&O)"],"not_rendered":{"images":2,"defined_names":3},"read":"whole","date_system":"1900"}

{"sheet":"Main","index":0,"n_rows":27,"n_cols":11,"rows_kept":27}
[null,"                                                                                                 "]
{"$rows_empty":8}
[null,"2022-07-26"]
[]
[null,"Sheet No.","Template Name","Summary"]
[null,1,"Future Intra","For Intraday trading in F&O segment"]
[null,2,"Cash Intra","For Intraday trading in cash market segment"]
[null,3,"Mid-cap Intra","For Intraday trading in Mid-cap stocks"]
[null,4,"Bulk Deals","Reveals Bulk Deals carried on NSE & BSE"]
[null,5,"Call Tracker"]
{"$rows_empty":9}
[{"$nulls":10},"`"]

{"sheet":"Future Intra","index":1,"n_rows":239,"n_cols":16,"rows_kept":239,"merged":[[8,0,9,0],[8,1,9,1],[8,2,9,2],[8,3,9,3],[8,6,8,8],[8,9,8,11]]}
[]
[]
[]
[]
[{"$nulls":12},"Back to Main Page"]
["FOR INTRA DAY TRADING",{"$nulls":10},{"$f":"Main!B10","v":"2022-07-26"}]
[]
[]
["Sr.no","Sector","Scrip","Expiry Date","CLOSE RATE","Pivot Point","Supports",null,null,"Resistances"]
[{"$nulls":4},"Point","Point","S1","S2","S3","R1","R2","R3","HIGH","LOW","OI","% Change in OI"]
[1,"Index","NIFTY","2022-07-28",{"v":16632.1,"d":"16632.10"},{"v":16632.866666666665,"d":"16632.87"},{"v":16560.73333333333,"d":"16560.73"},{"v":16489.366666666665,"d":"16489.37"},{"v":16417.23333333333,"d":"16417.23"},{"v":16704.23333333333,"d":"16704.23"},{"v":16776.36666666667,"d":"16776.37"},{"v":16847.73333333333,"d":"16847.73"},16705,16561.5,12302050,{"v":-0.03223763653598807,"d":"-3.22%"}]
[2,"Index","BANKNIFTY","2022-07-28",{"v":36713.5,"d":"36713.50"},{"v":36717.666666666664,"d":"36717.67"},{"v":36447.08333333333,"d":"36447.08"},{"v":36180.666666666664,"d":"36180.67"},{"v":35910.08333333333,"d":"35910.08"},{"v":36984.08333333333,"d":"36984.08"},{"v":37254.66666666666,"d":"37254.67"},{"v":37521.08333333333,"d":"37521.08"},36988.25,36451.25,2554150,{"v":-0.1156373079420039,"d":"-11.56%"}]
[3,"Index","FINNIFTY","2022-07-26",{"v":16840.2,"d":"16840.20"},{"v":16838.016666666666,"d":"16838.02"},{"v":16746.033333333333,"d":"16746.03"},{"v":16651.866666666665,"d":"16651.87"},{"v":16559.88333333333,"d":"16559.88"},{"v":16932.183333333334,"d":"16932.18"},{"v":17024.166666666664,"d":"17024.17"},{"v":17118.333333333336,"d":"17118.33"},16930,16743.85,10800,{"v":-0.18674698795180722,"d":"-18.67%"}]
[4,"Index","MIDCPNIFTY","2022-07-26",6994.45,{"v":6874.033333333333,"d":"6874.03"},{"v":6738.5166666666655,"d":"6738.52"},{"v":6482.583333333333,"d":"6482.58"},{"v":6347.066666666666,"d":"6347.07"},{"v":7129.966666666665,"d":"7129.97"},{"v":7265.483333333332,"d":"7265.48"},{"v":7521.416666666665,"d":"7521.42"},7009.55,6618.1,825,{"v":-0.15384615384615385,"d":"-15.38%"}]
[5,"Chemical","AARTIIND","2022-07-28",771.05,{"v":768.5500000000001,"d":"768.55"},{"v":757.6500000000001,"d":"757.65"},744.25,733.35,{"v":781.9500000000002,"d":"781.95"},792.85,{"v":806.2500000000002,"d":"806.25"},779.45,755.15,4363050,{"v":-0.009837962962962963,"d":"-0.98%"}]
[6,"Capital_Goods","ABB","2022-07-28",2660.55,{"v":2664.6000000000004,"d":"2664.60"},{"v":2629.8000000000006,"d":"2629.80"},2599.05,{"v":2564.2500000000005,"d":"2564.25"},{"v":2695.350000000001,"d":"2695.35"},2730.15,{"v":2760.900000000001,"d":"2760.90"},2699.4,2633.85,990500,{"v":0.09025866813428729,"d":"9.03%"}]
[7,"Pharma","ABBOTINDIA","2022-07-28",{"v":19764,"d":"19764.00"},{"v":19813.866666666665,"d":"19813.87"},{"v":19611.73333333333,"d":"19611.73"},{"v":19459.466666666664,"d":"19459.47"},{"v":19257.33333333333,"d":"19257.33"},{"v":19966.13333333333,"d":"19966.13"},{"v":20168.26666666667,"d":"20168.27"},{"v":20320.533333333333,"d":"20320.53"},20016,19661.6,42640,{"v":0.05440158259149357,"d":"5.44%"}]
[8,"Others","ABCAPITAL","2022-07-28",{"v":102.7,"d":"102.70"},{"v":103.18333333333332,"d":"103.18"},{"v":101.61666666666665,"d":"101.62"},{"v":100.53333333333332,"d":"100.53"},{"v":98.96666666666664,"d":"98.97"},{"v":104.26666666666665,"d":"104.27"},{"v":105.83333333333334,"d":"105.83"},{"v":106.91666666666666,"d":"106.92"},104.75,102.1,22339800,{"v":-0.018039401851412295,"d":"-1.80%"}]
[9,"Textile","ABFRL","2022-07-28",{"v":268.3,"d":"268.30"},{"v":269.3333333333333,"d":"269.33"},{"v":265.96666666666664,"d":"265.97"},{"v":263.6333333333333,"d":"263.63"},{"v":260.26666666666665,"d":"260.27"},{"v":271.66666666666663,"d":"271.67"},{"v":275.0333333333333,"d":"275.03"},{"v":277.3666666666666,"d":"277.37"},272.7,267,11837800,{"v":0.057607433217189315,"d":"5.76%"}]
[10,"Cement","ACC","2022-07-28",2205.25,{"v":2201.266666666667,"d":"2201.27"},{"v":2186.7333333333336,"d":"2186.73"},{"v":2168.2166666666667,"d":"2168.22"},{"v":2153.6833333333334,"d":"2153.68"},{"v":2219.7833333333338,"d":"2219.78"},{"v":2234.3166666666675,"d":"2234.32"},{"v":2252.833333333334,"d":"2252.83"},2215.8,2182.75,3003250,{"v":0.026225867076712796,"d":"2.62%"}]
{"$rows_left_out":208}
{"sheet":"Cash Intra","index":2,"n_rows":246,"n_cols":13,"rows_kept":246,"merged":[[7,0,8,0],[7,1,8,1],[7,2,8,2],[7,3,8,3],[7,4,7,6],[7,7,7,9]]}
[]
[]
[]
[]
[{"$nulls":12},"Back to Main Page"]
["FOR INTRA DAY TRADING",{"$nulls":9},{"$f":"Main!B10","v":"2022-07-26"}]
[]
["Sr.no",null,"CLOSE RATE","Pivot Point","Supports",null,null,"Resistances"]
[{"$nulls":4},"S1","S2","S3","R1","R2","R3","HIGH","LOW","Total Trade Quanity in Lakhs"]
[1,"Nifty 50",16631,{"v":16633.766666666666,"d":"16633.77"},{"v":16561.483333333334,"d":"16561.48"},{"v":16491.966666666667,"d":"16491.97"},{"v":16419.683333333334,"d":"16419.68"},{"v":16703.283333333333,"d":"16703.28"},{"v":16775.566666666666,"d":"16775.57"},{"v":16845.083333333332,"d":"16845.08"},16706.05,16564.25]
[2,"Nifty Bank",36726.4,{"v":36734.083333333336,"d":"36734.08"},{"v":36456.966666666674,"d":"36456.97"},{"v":36187.53333333334,"d":"36187.53"},{"v":35910.41666666668,"d":"35910.42"},{"v":37003.51666666667,"d":"37003.52"},{"v":37280.633333333324,"d":"37280.63"},{"v":37550.066666666666,"d":"37550.07"},37011.2,36464.65]
[3,"Nifty CPSE",2459.95,{"v":2455.433333333333,"d":"2455.43"},{"v":2441.416666666666,"d":"2441.42"},{"v":2422.883333333333,"d":"2422.88"},{"v":2408.8666666666663,"d":"2408.87"},{"v":2473.966666666666,"d":"2473.97"},{"v":2487.983333333333,"d":"2487.98"},{"v":2506.5166666666655,"d":"2506.52"},2469.45,2436.9]
[4,"Nifty Infra",4797.35,{"v":4797.349999999999,"d":"4797.35"},{"v":4778.499999999999,"d":"4778.50"},4759.65,{"v":4740.799999999999,"d":"4740.80"},{"v":4816.199999999999,"d":"4816.20"},{"v":4835.049999999999,"d":"4835.05"},{"v":4853.899999999999,"d":"4853.90"},4816.2,4778.5]
[5,"Nifty IT",28216,{"v":28142.5,"d":"28142.50"},27964.15,{"v":27712.300000000003,"d":"27712.30"},{"v":27533.950000000004,"d":"27533.95"},28394.35,{"v":28572.699999999997,"d":"28572.70"},{"v":28824.549999999996,"d":"28824.55"},28320.85,27890.65]
[6,"Nifty PSE",3900.3,{"v":3892.566666666667,"d":"3892.57"},{"v":3877.833333333334,"d":"3877.83"},{"v":3855.366666666667,"d":"3855.37"},{"v":3840.6333333333337,"d":"3840.63"},{"v":3915.033333333334,"d":"3915.03"},{"v":3929.766666666667,"d":"3929.77"},{"v":3952.2333333333345,"d":"3952.23"},3907.3,3870.1]
[7,"Nifty Midcap 50",8039.4,{"v":8033.099999999999,"d":"8033.10"},{"v":8005.999999999999,"d":"8006.00"},{"v":7972.599999999999,"d":"7972.60"},{"v":7945.499999999999,"d":"7945.50"},{"v":8066.499999999999,"d":"8066.50"},{"v":8093.599999999999,"d":"8093.60"},{"v":8126.999999999999,"d":"8127.00"},8060.2,7999.7]
[8,"ABB",2662.9,{"v":2670.7999999999997,"d":"2670.80"},{"v":2628.5999999999995,"d":"2628.60"},{"v":2594.2999999999997,"d":"2594.30"},{"v":2552.0999999999995,"d":"2552.10"},{"v":2705.0999999999995,"d":"2705.10"},{"v":2747.2999999999993,"d":"2747.30"},{"v":2781.5999999999995,"d":"2781.60"},2713,2636.5,2.92148]
[9,"ACC",2204.45,{"v":2198.116666666667,"d":"2198.12"},{"v":2183.2333333333336,"d":"2183.23"},{"v":2162.016666666667,"d":"2162.02"},{"v":2147.1333333333337,"d":"2147.13"},{"v":2219.3333333333335,"d":"2219.33"},{"v":2234.2166666666667,"d":"2234.22"},{"v":2255.4333333333334,"d":"2255.43"},2213,2176.9,3.79605]
[10,"AUBANK",581.7,{"v":578.9166666666666,"d":"578.92"},{"v":572.8833333333332,"d":"572.88"},{"v":564.0666666666666,"d":"564.07"},{"v":558.0333333333332,"d":"558.03"},{"v":587.7333333333332,"d":"587.73"},{"v":593.7666666666668,"d":"593.77"},{"v":602.5833333333333,"d":"602.58"},584.95,570.1,10.98397]
[11,"ABBOTINDIA",19737.45,{"v":19788.833333333332,"d":"19788.83"},{"v":19578.666666666664,"d":"19578.67"},{"v":19419.88333333333,"d":"19419.88"},{"v":19209.716666666664,"d":"19209.72"},{"v":19947.616666666665,"d":"19947.62"},{"v":20157.78333333333,"d":"20157.78"},{"v":20316.566666666666,"d":"20316.57"},19999,19630.05,0.1147]
{"$rows_left_out":227}
{"sheet":"MidCap Intra","index":3,"n_rows":530,"n_cols":13,"rows_kept":530,"merged":[[0,0,0,1],[8,0,9,0],[8,1,9,1],[8,2,9,2],[8,3,9,3],[8,4,8,6],[8,7,8,9]]}
[]
[]
[]
[]
[{"$nulls":11},"Back To Main Page"]
["FOR INTRA DAY TRADING",{"$nulls":9},{"$f":"Main!B10","v":"2022-07-26"}]
[null,null," "]
[]
["Sr.no","Scrip","CLOSE RATE","Pivot Point","Supports",null,null,"Resistances"]
[{"$nulls":4},"S1","S2","S3","R1","R2","R3","HIGH","LOW","Total Trade Quanity in Lakhs"]
[1,"3MINDIA",22872.2,{"v":22874.033333333336,"d":"22874.03"},{"v":22648.16666666667,"d":"22648.17"},{"v":22424.133333333335,"d":"22424.13"},{"v":22198.26666666667,"d":"22198.27"},{"v":23098.066666666673,"d":"23098.07"},{"v":23323.933333333334,"d":"23323.93"},{"v":23547.966666666674,"d":"23547.97"},23099.9,22650,0.01227]
[2,"ABB",2662.9,{"v":2670.7999999999997,"d":"2670.80"},{"v":2628.5999999999995,"d":"2628.60"},{"v":2594.2999999999997,"d":"2594.30"},{"v":2552.0999999999995,"d":"2552.10"},{"v":2705.0999999999995,"d":"2705.10"},{"v":2747.2999999999993,"d":"2747.30"},{"v":2781.5999999999995,"d":"2781.60"},2713,2636.5,2.92148]
[3,"ACC",2204.45,{"v":2198.116666666667,"d":"2198.12"},{"v":2183.2333333333336,"d":"2183.23"},{"v":2162.016666666667,"d":"2162.02"},{"v":2147.1333333333337,"d":"2147.13"},{"v":2219.3333333333335,"d":"2219.33"},{"v":2234.2166666666667,"d":"2234.22"},{"v":2255.4333333333334,"d":"2255.43"},2213,2176.9,3.79605]
[4,"AIAENG",2360.05,{"v":2375.0333333333333,"d":"2375.03"},{"v":2335.0166666666664,"d":"2335.02"},{"v":2309.983333333333,"d":"2309.98"},{"v":2269.9666666666662,"d":"2269.97"},{"v":2400.0666666666666,"d":"2400.07"},{"v":2440.083333333334,"d":"2440.08"},{"v":2465.116666666667,"d":"2465.12"},2415.05,2350,0.32289]
[5,"APLAPOLLO",927.5,{"v":924.1666666666666,"d":"924.17"},{"v":911.2833333333333,"d":"911.28"},{"v":895.0666666666667,"d":"895.07"},{"v":882.1833333333334,"d":"882.18"},{"v":940.3833333333332,"d":"940.38"},{"v":953.2666666666667,"d":"953.27"},{"v":969.4833333333331,"d":"969.48"},937.05,907.95,2.91777]
[6,"AUBANK",581.7,{"v":578.9166666666666,"d":"578.92"},{"v":572.8833333333332,"d":"572.88"},{"v":564.0666666666666,"d":"564.07"},{"v":558.0333333333332,"d":"558.03"},{"v":587.7333333333332,"d":"587.73"},{"v":593.7666666666668,"d":"593.77"},{"v":602.5833333333333,"d":"602.58"},584.95,570.1,10.98397]
[7,"AARTIDRUGS",433.25,{"v":433.3666666666666,"d":"433.37"},{"v":424.8833333333332,"d":"424.88"},{"v":416.5166666666666,"d":"416.52"},{"v":408.0333333333332,"d":"408.03"},{"v":441.73333333333323,"d":"441.73"},{"v":450.2166666666667,"d":"450.22"},{"v":458.58333333333326,"d":"458.58"},441.85,425,0.77541]
[8,"AAVAS",2216.45,2216.65,{"v":2181,"d":"2181.00"},{"v":2145.5499999999997,"d":"2145.55"},{"v":2109.8999999999996,"d":"2109.90"},{"v":2252.1000000000004,"d":"2252.10"},{"v":2287.750000000001,"d":"2287.75"},{"v":2323.2000000000007,"d":"2323.20"},2252.3,2181.2,0.68212]
[9,"ABBOTINDIA",19737.45,{"v":19788.833333333332,"d":"19788.83"},{"v":19578.666666666664,"d":"19578.67"},{"v":19419.88333333333,"d":"19419.88"},{"v":19209.716666666664,"d":"19209.72"},{"v":19947.616666666665,"d":"19947.62"},{"v":20157.78333333333,"d":"20157.78"},{"v":20316.566666666666,"d":"20316.57"},19999,19630.05,0.1147]
[10,"ADANIENT",2550.6,{"v":2537.5833333333335,"d":"2537.58"},{"v":2513.016666666667,"d":"2513.02"},{"v":2475.4333333333334,"d":"2475.43"},{"v":2450.866666666667,"d":"2450.87"},{"v":2575.166666666667,"d":"2575.17"},{"v":2599.7333333333336,"d":"2599.73"},{"v":2637.316666666667,"d":"2637.32"},2562.15,2500,12.20351]
{"$rows_left_out":511}
{"sheet":"Bulk Deals","index":4,"n_rows":145,"n_cols":8,"rows_kept":145,"merged":[[4,0,4,1],[4,2,4,3],[6,1,6,2]]}
[" "]
[]
[]
[]
[]
[{"$nulls":4},"Back To Main Page"]
["Subject :","BULK DEAL",null,{"$f":"Main!B10","v":"2022-07-26"}]
[]
["Date","Scrip code","Scrip Name","Client Name","Buy / Sell","Quantity Traded","Trade Price / Wt.Avg.trade price","Exchange  "]
["2022-07-25",531156,"ALFAVIO","ANKIT GUPTA","SELL",{"v":35034,"d":"35,034"},205.76,"BSE"]
["2022-07-25",540135,"ARCFIN","ALPHA LEON ENTERPRISES LLP","SELL",{"v":2341639,"d":"2,341,639"},1.28,"BSE"]
["2022-07-25",540135,"ARCFIN","ALPHA LEON ENTERPRISES LLP","BUY",{"v":3000000,"d":"3,000,000"},1.28,"BSE"]
["2022-07-25",540135,"ARCFIN","YASHKUMAR POONAMCHAND GOLECHHA","BUY",{"v":3000000,"d":"3,000,000"},1.28,"BSE"]
["2022-07-25",539559,"DDIL","DINESH RIKHABCHAND SOLANKI","SELL",{"v":202100,"d":"202,100"},44.25,"BSE"]
["2022-07-25",539559,"DDIL","SHAIBAL GHOSH","BUY",{"v":26043,"d":"26,043"},43.28,"BSE"]
["2022-07-25",539559,"DDIL","SANJAY SHAH","BUY",{"v":41500,"d":"41,500"},40.05,"BSE"]
["2022-07-25",539559,"DDIL","BHAVISHYA ECOMMERCE PRIVATE LIMITED","BUY",{"v":515979,"d":"515,979"},43.6,"BSE"]
["2022-07-25",539559,"DDIL","HITESH DASANI","SELL",{"v":39123,"d":"39,123"},40.33,"BSE"]
["2022-07-25",539559,"DDIL","SWAPAN KARMAKAR","SELL",{"v":42146,"d":"42,146"},44.25,"BSE"]
["2022-07-25",539559,"DDIL","JAI KUMAR BAID","SELL",{"v":55495,"d":"55,495"},44.25,"BSE"]
{"$rows_left_out":126}
{"sheet":"Call Tracker (Equity & F&O)","index":5,"n_rows":316,"n_cols":18,"rows_kept":316}
[]
[]
[]
[]
[{"$nulls":12},"Back To Main Page"]
["Retail Research Technical Calls & Fundamental Performance Report for the month of July-2022"]
[{"$nulls":12},{"$f":"Main!B10","v":"2022-07-26"}]
[null,"Positional  Call"]
["Sr.no","Date",null,"Company","Rec","Rec Price","Stop Loss***","Call Closed At","Target","Remark","Profit / Loss per Share","All charges","Net Gain / Loss  %","Status","Closed Date","Market Closing Price"]
[1,"2022-05-19",null,"BHARTIARTL","Buy",681,635,null,"750-780","Open",{"$nulls":5},{"$f":"VLOOKUP(D10,'MidCap Intra'!B37:C588,2,0)","v":678.4},null,"H"]
[2,"2022-06-07",null,"HINDUNILVR","Buy<>",2201,2069,2332,"2350-2450","Profit of Rs.131/-",{"$f":"H11-F11","v":131},{"$f":"(F11*-0.7)/100","v":{"v":-15.406999999999998,"d":"-15.41"}},{"$f":"(K11+L11)/F11","v":{"v":0.0525184007269423,"d":"5.25%"}},"Successful","2022-07-04",null,null,"H"]
[3,"2022-06-10",null,"AARTIIND","Buy",705,670,746,"750-780","Profit of Rs.41/-",{"$f":"H12-F12","v":41},{"$f":"(F12*-0.7)/100","v":{"v":-4.935,"d":"-4.94"}},{"$f":"(K12+L12)/F12","v":{"v":0.05115602836879432,"d":"5.12%"}},"Successful","2022-07-11",null,null,"H"]
[4,"2022-06-21",null,"TECHM","Buy",980,898,1036,"1150-1200","Part profit of Rs.56/-",{"$f":"H13-F13","v":56},{"$f":"(F13*-0.7)/100","v":-6.86},{"$f":"(K13+L13)/F13","v":{"v":0.05014285714285714,"d":"5.01%"}},"Successful","2022-07-20",null,null,"H"]
[5,"2022-06-23",null,"BALKRISIND","Buy",2070,1940,2195,"2200-2300","Profit of Rs.125/-",{"$f":"H14-F14","v":125},{"$f":"(F14*-0.7)/100","v":-14.49},{"$f":"(K14+L14)/F14","v":{"v":0.053386473429951696,"d":"5.34%"}},"Successful","2022-07-04",null,null,"H"]
[6,"2022-06-28",null,"HCLTECH","Buy",985,920,920,"1100-1150","Profit of Rs.65/-",-65,{"v":-6.895,"d":"-6.90"},{"v":-0.07298984771573604,"d":"-7.30%"},"Unsuccessful","2022-07-14",null,null,"H"]
[7,"2022-07-01",null,"MCDOWELL-N","Buy",775,730,821.5,"830-850","Profit of Rs.46.5/-",{"$f":"H16-F16","v":46.5},{"$f":"(F16*-0.7)/100","v":{"v":-5.425,"d":"-5.43"}},{"$f":"(K16+L16)/F16","v":{"v":0.053000000000000005,"d":"5.30%"}},"Successful","2022-07-11",null,null,"H"]
[8,"2022-07-01",null,"BAJAJFINSV","Buy",11250,10500,11900,"12000-12500","Profit of Rs.650/-",{"$f":"H17-F17","v":650},{"$f":"(F17*-0.7)/100","v":{"v":-78.74999999999999,"d":"-78.75"}},{"$f":"(K17+L17)/F17","v":{"v":0.050777777777777776,"d":"5.08%"}},"Successful","2022-07-06",null,null,"H"]
[9,"2022-07-05",null,"HDFC","Buy",2230,2120,2319,"2350-2450","Part Profit of Rs.89/-",{"$f":"H18-F18","v":89},{"$f":"(F18*-0.7)/100","v":-15.61},{"$f":"(K18+L18)/F18","v":{"v":0.032910313901345294,"d":"3.29%"}},"Successful","2022-07-25",{"$f":"VLOOKUP(D18,'MidCap Intra'!B50:C601,2,0)","v":2308.65},null,"H"]
[10,"2022-07-06",null,"REDINGTON","Buy<>",121.4,113.4,126.9,"135-140","Part profit of Rs.5.5/-",{"$f":"H19-F19","v":5.5},{"$f":"(F19*-0.7)/100","v":{"v":-0.8498,"d":"-0.85"}},{"$f":"(K19+L19)/F19","v":{"v":0.03830477759472817,"d":"3.83%"}},"Successful","2022-07-08",null,null,"H"]
[11,"2022-07-06",null,"JKLAKSHMI","Buy",418.5,384,444,"460-490","Profit of Rs.25.5/-",{"$f":"H20-F20","v":25.5},{"$f":"(F20*-0.7)/100","v":{"v":-2.9295,"d":"-2.93"}},{"$f":"(K20+L20)/F20","v":{"v":0.05393189964157706,"d":"5.39%"}},"Successful","2022-07-19",null,null,"H"]
{"$rows_left_out":296}