{"text_format":"3","workbook":"xlsx","n_sheets":11,"sheets":["Main","Future Intra","Cash Intra","MidCap Intra","Bulk Deals","Call Tracker (Equity & F&O)","Sheet2","Sheet1","Sheet3","Sheet4","Sheet5"],"not_rendered":{"images":4,"defined_names":5},"read":"whole","date_system":"1900"}

{"sheet":"Main","index":0,"n_rows":27,"n_cols":11,"rows_kept":27}
[null,"                                                                                                 "]
{"$rows_empty":8}
[null,"2020-01-24"]
[]
[null,"Sheet No.","Template Name","Summary"]
[null,1,"Future Intra","For Intraday trading in F&O segment"]
[null,2,"Cash Intra","For Intraday trading in cash market segment"]
[null,3,"Mid-cap Intra","For Intraday trading in Mid-cap stocks"]
[null,4,"Bulk Deals","Reveals Bulk Deals carried on NSE & BSE"]
[null,5,"Call Tracker"]
{"$rows_empty":9}
[{"$nulls":10},"`"]

{"sheet":"Future Intra","index":1,"n_rows":190,"n_cols":15,"rows_kept":190,"merged":[[8,0,9,0],[8,1,9,1],[8,2,9,2],[8,5,8,7],[8,8,8,10]]}
[]
[]
[]
[]
[{"$nulls":12},"Back to Main Page"]
["FOR INTRA DAY TRADING",{"$nulls":10},{"$f":"Main!B10","v":"2020-01-24"}]
[]
[]
["Sr.no","Sector","Scrip","CLOSE RATE","Pivot Point","Supports",null,null,"Resistances"]
[null,"Sector",null,"Point","Point","S1","S2","S3","R1","R2","R3","HIGH","LOW","OI","% Change in OI"]
[1,"Index","BANKNIFTY",{"v":31090.1,"d":"31090.10"},{"v":30980.033333333336,"d":"30980.03"},{"v":30790.066666666673,"d":"30790.07"},{"v":30490.033333333336,"d":"30490.03"},{"v":30300.066666666673,"d":"30300.07"},{"v":31280.066666666673,"d":"31280.07"},{"v":31470.03333333334,"d":"31470.03"},{"v":31770.066666666673,"d":"31770.07"},31170,30680,1585540,{"v":-0.10204335908298032,"d":"-10.20%"}]
[2,"Index","NIFTY",{"v":12201,"d":"12201.00"},{"v":12177.050000000001,"d":"12177.05"},{"v":12134.100000000002,"d":"12134.10"},{"v":12067.2,"d":"12067.20"},{"v":12024.250000000002,"d":"12024.25"},{"v":12243.950000000003,"d":"12243.95"},{"v":12286.900000000003,"d":"12286.90"},{"v":12353.800000000003,"d":"12353.80"},12220,12110.15,14802825,{"v":-0.002345388834129451,"d":"-0.23%"}]
[3,"Index","NIFTYIT",{"v":16403,"d":"16403.00"},{"v":16378,"d":"16378.00"},{"v":16337,"d":"16337.00"},{"v":16271,"d":"16271.00"},{"v":16230,"d":"16230.00"},{"v":16444,"d":"16444.00"},{"v":16485,"d":"16485.00"},{"v":16551,"d":"16551.00"},16419,16312,7850,{"v":0.17164179104477612,"d":"17.16%"}]
[4,"Cement","ACC",{"v":1553.3,"d":"1553.30"},{"v":1546.4166666666667,"d":"1546.42"},{"v":1533.1333333333334,"d":"1533.13"},{"v":1512.9666666666667,"d":"1512.97"},{"v":1499.6833333333334,"d":"1499.68"},{"v":1566.5833333333335,"d":"1566.58"},{"v":1579.8666666666668,"d":"1579.87"},{"v":1600.0333333333335,"d":"1600.03"},1559.7,1526.25,4248400,{"v":0.02846906168296698,"d":"2.85%"}]
[5,"Others","ADANIENT",230.15,{"v":229.26666666666665,"d":"229.27"},{"v":226.8833333333333,"d":"226.88"},{"v":223.61666666666665,"d":"223.62"},{"v":221.2333333333333,"d":"221.23"},{"v":232.5333333333333,"d":"232.53"},{"v":234.91666666666663,"d":"234.92"},{"v":238.1833333333333,"d":"238.18"},231.65,226,29872000,{"v":0.006604663701307454,"d":"0.66%"}]
[6,"Others","ADANIPORTS",386.15,{"v":385.2166666666667,"d":"385.22"},{"v":382.9333333333334,"d":"382.93"},{"v":379.7166666666667,"d":"379.72"},{"v":377.4333333333334,"d":"377.43"},{"v":388.4333333333334,"d":"388.43"},{"v":390.7166666666667,"d":"390.72"},{"v":393.9333333333334,"d":"393.93"},387.5,382,29270000,{"v":-3.4153005464480874E-4,"d":"-0.03%"}]
[7,"Power","ADANIPOWER",{"v":63.5,"d":"63.50"},{"v":63.28333333333334,"d":"63.28"},{"v":62.66666666666668,"d":"62.67"},{"v":61.83333333333334,"d":"61.83"},{"v":61.21666666666668,"d":"61.22"},{"v":64.11666666666667,"d":"64.12"},{"v":64.73333333333333,"d":"64.73"},{"v":65.56666666666666,"d":"65.57"},63.9,62.45,85470000,{"v":0.1190102120974077,"d":"11.90%"}]
[8,"Automobile","AMARAJABAT",792.45,{"v":794.7000000000002,"d":"794.70"},{"v":785.2000000000003,"d":"785.20"},{"v":777.9500000000002,"d":"777.95"},{"v":768.4500000000003,"d":"768.45"},{"v":801.9500000000003,"d":"801.95"},811.45,{"v":818.7000000000003,"d":"818.70"},804.2,787.45,1586400,{"v":0.006598984771573604,"d":"0.66%"}]
[9,"Cement","AMBUJACEM",214.45,{"v":213.38333333333333,"d":"213.38"},{"v":211.21666666666664,"d":"211.22"},{"v":207.98333333333332,"d":"207.98"},{"v":205.81666666666663,"d":"205.82"},{"v":216.61666666666665,"d":"216.62"},{"v":218.78333333333333,"d":"218.78"},{"v":222.01666666666665,"d":"222.02"},215.55,210.15,19757500,{"v":0.014766307139188495,"d":"1.48%"}]
[10,"Others","APOLLOHOSP",{"v":1685.2,"d":"1685.20"},1671.75,{"v":1650.5,"d":"1650.50"},{"v":1615.8,"d":"1615.80"},1594.55,1706.45,{"v":1727.7,"d":"1727.70"},{"v":1762.4,"d":"1762.40"},1693,1637.05,1935000,{"v":0.0350361059106713,"d":"3.50%"}]
{"$rows_left_out":155}
{"sheet":"Cash Intra","index":2,"n_rows":247,"n_cols":13,"rows_kept":247,"merged":[[7,0,8,0],[7,1,8,1],[7,2,8,2],[7,3,8,3],[7,4,7,6],[7,7,7,9]]}
[]
[]
[]
[]
[{"$nulls":12},"Back to Main Page"]
["FOR INTRA DAY TRADING",{"$nulls":9},{"$f":"Main!B10","v":"2020-01-24"}]
[]
["Sr.no","Scrip","CLOSE RATE","Pivot Point","Supports",null,null,"Resistances"]
[null,null,"Point",null,"S1","S2","S3","R1","R2","R3","HIGH","LOW","Total Trade Quanity in Lakhs"]
[1,"Nifty 50",12180.35,{"v":12154.483333333332,"d":"12154.48"},{"v":12119.966666666664,"d":"12119.97"},{"v":12059.583333333332,"d":"12059.58"},{"v":12025.066666666664,"d":"12025.07"},{"v":12214.866666666663,"d":"12214.87"},{"v":12249.38333333333,"d":"12249.38"},{"v":12309.766666666663,"d":"12309.77"},12189,12094.1]
[2,"Nifty Bank",31004.05,{"v":30904.216666666664,"d":"30904.22"},{"v":30721.183333333327,"d":"30721.18"},{"v":30438.316666666662,"d":"30438.32"},{"v":30255.283333333326,"d":"30255.28"},{"v":31187.08333333333,"d":"31187.08"},{"v":31370.11666666666,"d":"31370.12"},{"v":31652.98333333333,"d":"31652.98"},31087.25,30621.35]
[3,"Nifty CPSE",1814.3,1815.25,{"v":1795.8,"d":"1795.80"},{"v":1777.3,"d":"1777.30"},1757.85,1833.75,{"v":1853.1999999999998,"d":"1853.20"},{"v":1871.7,"d":"1871.70"},1834.7,1796.75]
[4,"Nifty Infra",3366.9,{"v":3355.5,"d":"3355.50"},{"v":3338.3,"d":"3338.30"},{"v":3309.7000000000003,"d":"3309.70"},{"v":3292.5000000000005,"d":"3292.50"},{"v":3384.1,"d":"3384.10"},{"v":3401.2999999999997,"d":"3401.30"},{"v":3429.8999999999996,"d":"3429.90"},3372.7,3326.9]
[5,"Nifty IT",16474.4,{"v":16447.783333333336,"d":"16447.78"},{"v":16394.366666666672,"d":"16394.37"},{"v":16314.333333333336,"d":"16314.33"},{"v":16260.916666666672,"d":"16260.92"},{"v":16527.816666666673,"d":"16527.82"},{"v":16581.233333333337,"d":"16581.23"},{"v":16661.266666666674,"d":"16661.27"},16501.2,16367.75]
[6,"Nifty PSE",3151.85,{"v":3141.8333333333335,"d":"3141.83"},{"v":3117.016666666667,"d":"3117.02"},{"v":3082.1833333333334,"d":"3082.18"},{"v":3057.366666666667,"d":"3057.37"},{"v":3176.666666666667,"d":"3176.67"},{"v":3201.4833333333336,"d":"3201.48"},{"v":3236.316666666667,"d":"3236.32"},3166.65,3107]
[7,"Nifty Midcap 50",4994.3,4972.45,4938.75,{"v":4883.2,"d":"4883.20"},{"v":4849.5,"d":"4849.50"},{"v":5028,"d":"5028.00"},{"v":5061.699999999999,"d":"5061.70"},5117.25,5006.15,4916.9]
[8,"ACC",1548.35,1542.75,{"v":1530.6,"d":"1530.60"},1512.85,{"v":1500.6999999999998,"d":"1500.70"},{"v":1560.5,"d":"1560.50"},1572.65,{"v":1590.4,"d":"1590.40"},1554.9,1525,11.00769]
[9,"AUBANK",974.55,{"v":964.5166666666668,"d":"964.52"},{"v":921.0333333333335,"d":"921.03"},{"v":867.5166666666668,"d":"867.52"},{"v":824.0333333333335,"d":"824.03"},{"v":1018.0333333333335,"d":"1018.03"},{"v":1061.5166666666669,"d":"1061.52"},{"v":1115.0333333333335,"d":"1115.03"},1008,911,49.78519]
[10,"ADANIPORTS",385.85,384.45,382.15,378.45,376.15,388.15,{"v":390.45000000000005,"d":"390.45"},394.15,386.75,380.75,12.02104]
[11,"ADANIPOWER",63.35,{"v":63.116666666666674,"d":"63.12"},{"v":62.533333333333346,"d":"62.53"},{"v":61.71666666666667,"d":"61.72"},{"v":61.13333333333334,"d":"61.13"},{"v":63.93333333333335,"d":"63.93"},{"v":64.51666666666668,"d":"64.52"},{"v":65.33333333333336,"d":"65.33"},63.7,62.3,44.73067]
{"$rows_left_out":228}
{"sheet":"MidCap Intra","index":3,"n_rows":545,"n_cols":13,"rows_kept":545,"merged":[[0,0,0,1],[8,0,9,0],[8,1,9,1],[8,2,9,2],[8,3,9,3],[8,4,8,6],[8,7,8,9]]}
[]
[]
[]
[]
[{"$nulls":11},"Back To Main Page"]
["FOR INTRA DAY TRADING",{"$nulls":9},{"$f":"Main!B10","v":"2020-01-24"}]
[null,null," "]
[]
["Sr.no","Scrip","CLOSE RATE","Pivot Point","Supports",null,null,"Resistances"]
[null,null,"Point",null,"S1","S2","S3","R1","R2","R3","HIGH","LOW","Total Trade Quanity in Lakhs"]
[1,"3MINDIA",22409.7,{"v":22372.816666666666,"d":"22372.82"},{"v":22286.88333333333,"d":"22286.88"},{"v":22164.066666666666,"d":"22164.07"},{"v":22078.13333333333,"d":"22078.13"},{"v":22495.63333333333,"d":"22495.63"},{"v":22581.566666666666,"d":"22581.57"},{"v":22704.38333333333,"d":"22704.38"},22458.75,22250,0.00671]
[2,"ACC",1548.35,1542.75,{"v":1530.6,"d":"1530.60"},1512.85,{"v":1500.6999999999998,"d":"1500.70"},{"v":1560.5,"d":"1560.50"},1572.65,{"v":1590.4,"d":"1590.40"},1554.9,1525,11.00769]
[3,"AIAENG",1768.1,{"v":1759.2,"d":"1759.20"},{"v":1727.4,"d":"1727.40"},{"v":1686.7,"d":"1686.70"},{"v":1654.9,"d":"1654.90"},{"v":1799.9,"d":"1799.90"},{"v":1831.6999999999998,"d":"1831.70"},{"v":1872.4,"d":"1872.40"},1791,1718.5,1.05004]
[4,"APLAPOLLO",2009,{"v":2006.3333333333333,"d":"2006.33"},{"v":1992.6666666666665,"d":"1992.67"},{"v":1976.3333333333333,"d":"1976.33"},{"v":1962.6666666666665,"d":"1962.67"},{"v":2022.6666666666665,"d":"2022.67"},{"v":2036.333333333333,"d":"2036.33"},{"v":2052.6666666666665,"d":"2052.67"},2020,1990,0.2255]
[5,"AUBANK",974.55,{"v":964.5166666666668,"d":"964.52"},{"v":921.0333333333335,"d":"921.03"},{"v":867.5166666666668,"d":"867.52"},{"v":824.0333333333335,"d":"824.03"},{"v":1018.0333333333335,"d":"1018.03"},{"v":1061.5166666666669,"d":"1061.52"},{"v":1115.0333333333335,"d":"1115.03"},1008,911,49.78519]
[6,"AARTIIND",868.05,{"v":863.8666666666667,"d":"863.87"},{"v":857.7333333333333,"d":"857.73"},{"v":847.4166666666666,"d":"847.42"},{"v":841.2833333333333,"d":"841.28"},{"v":874.1833333333334,"d":"874.18"},{"v":880.3166666666668,"d":"880.32"},{"v":890.6333333333334,"d":"890.63"},870,853.55,0.75059]
[7,"AAVAS",1999.85,{"v":1984.6333333333332,"d":"1984.63"},{"v":1959.3166666666664,"d":"1959.32"},{"v":1918.783333333333,"d":"1918.78"},{"v":1893.4666666666662,"d":"1893.47"},{"v":2025.1666666666665,"d":"2025.17"},{"v":2050.483333333333,"d":"2050.48"},{"v":2091.0166666666664,"d":"2091.02"},2009.95,1944.1,0.43685]
[8,"ABBOTINDIA",12707.9,{"v":12703.316666666666,"d":"12703.32"},{"v":12656.633333333331,"d":"12656.63"},{"v":12605.366666666665,"d":"12605.37"},{"v":12558.68333333333,"d":"12558.68"},{"v":12754.583333333332,"d":"12754.58"},{"v":12801.266666666666,"d":"12801.27"},{"v":12852.533333333333,"d":"12852.53"},12750,12652.05,0.10901]
[9,"ADANIGAS",172.9,{"v":171.41666666666666,"d":"171.42"},{"v":168.0333333333333,"d":"168.03"},{"v":163.16666666666666,"d":"163.17"},{"v":159.7833333333333,"d":"159.78"},{"v":176.2833333333333,"d":"176.28"},{"v":179.66666666666669,"d":"179.67"},{"v":184.5333333333333,"d":"184.53"},174.8,166.55,19.42737]
[10,"ADANIGREEN",192.2,{"v":194.03333333333333,"d":"194.03"},{"v":188.16666666666666,"d":"188.17"},{"v":184.13333333333333,"d":"184.13"},{"v":178.26666666666665,"d":"178.27"},{"v":198.06666666666666,"d":"198.07"},{"v":203.93333333333334,"d":"203.93"},{"v":207.96666666666667,"d":"207.97"},199.9,190,13.36193]
{"$rows_left_out":513}
{"sheet":"Bulk Deals","index":4,"n_rows":68,"n_cols":8,"rows_kept":68,"merged":[[4,0,4,1],[4,2,4,3],[6,1,6,2]]}
[" "]
[]
[]
[]
[]
[{"$nulls":4},"Back To Main Page"]
["Subject :","BULK DEAL",null,{"$f":"Main!B10","v":"2020-01-24"}]
[]
["Date","Scrip code","Scrip Name","Client Name","Buy / Sell","Quantity Traded","Trade Price / Wt.Avg.trade price","Exchange  "]
["2020-01-23",511463,"ALEXANDER","KAHAR NIKLESH KANAIYABHAI","BUY",{"v":24678,"d":"24,678"},16.52,"BSE"]
["2020-01-23",511463,"ALEXANDER","KAHAR NIKLESH KANAIYABHAI","SELL",{"v":111609,"d":"111,609"},16.35,"BSE"]
["2020-01-23",511463,"ALEXANDER","PATIL ULHAS BHASKARRAO PATIL ULHAS BHASKARRAO","BUY",{"v":60000,"d":"60,000"},16.5,"BSE"]
["2020-01-23",540545,"BGJL","KETANBHAI RAGHURAMBHAI THAKKAR","BUY",{"v":103500,"d":"103,500"},37.94,"BSE"]
["2020-01-23",539198,"CAPFIN","PRATIK TOSHNIVAL","SELL",{"v":19000,"d":"19,000"},2.69,"BSE"]
["2020-01-23",539198,"CAPFIN","AMAR JEE JHA","BUY",{"v":19000,"d":"19,000"},2.69,"BSE"]
["2020-01-23",538432,"DIVINUS","BRIJESH UMESHBHAI JOSHI","BUY",{"v":14500,"d":"14,500"},31,"BSE"]
["2020-01-23",538432,"DIVINUS","BRIJESH UMESHBHAI JOSHI","SELL",{"v":26978,"d":"26,978"},30.78,"BSE"]
["2020-01-23",538432,"DIVINUS","SONALBEN TRIVEDI","SELL",{"v":25108,"d":"25,108"},30.87,"BSE"]
["2020-01-23",538432,"DIVINUS","ISHWARIBAI GANGARAM KHILNANI","BUY",{"v":46000,"d":"46,000"},30.73,"BSE"]
["2020-01-23",530643,"ECORECO","FORBES EMF","BUY",{"v":165014,"d":"165,014"},33,"BSE"]
{"$rows_left_out":49}
{"sheet":"Call Tracker (Equity & F&O)","index":5,"n_rows":342,"n_cols":18,"rows_kept":342,"merged":[[140,0,141,0],[140,1,141,1],[140,9,141,9],[140,11,141,11],[140,12,141,12],[140,13,141,13],[140,14,141,14],[142,0,143,0],[142,1,143,1],[142,9,143,9],[142,11,143,11],[142,12,143,12],[142,13,143,13],[142,14,143,14],[150,0,151,0],[150,1,151,1],[150,9,151,9],[150,11,151,11],[150,12,151,12],[150,13,151,13],[150,14,151,14],[154,0,155,0],[154,1,155,1],[154,9,155,9],[154,11,155,11],[154,12,155,12],[154,13,155,13],[154,14,155,14],[163,0,164,0],[163,1,164,1],[163,9,164,9],[163,11,164,11],[163,12,164,12],[163,13,164,13],[163,14,164,14],[165,0,166,0],[165,1,166,1],[165,9,166,9],[165,11,166,11],[165,12,166,12],[165,13,166,13],[165,14,166,14]]}
[]
[]
[]
[]
[{"$nulls":12},"Back To Main Page"]
["Retail Research Technical Calls & Fundamental Performance Report for the month of January-2020 "]
[{"$nulls":12},{"$f":"Main!B10","v":"2020-01-24"}]
[null,"Positional  Call"]
["Sr.no","Date",null,"Company","Rec","Rec Price","Stop Loss***","Call Closed At","Target","Remark","Profit / Loss per Share","Gain / Loss  %","Status","Closed Date","NSE Closed Price"]
[1,"2019-10-07",null,"PIDILITIND","Buy{}",1367.5,1297,1399.25,"1500-1520","Profit of Rs.31.75/-",{"$f":"H10-F10","v":31.75},{"$f":"K10/F10","v":{"v":0.023217550274223033,"d":"2.32%"}},"Successful","2020-01-06",{"$nulls":3},"R"]
[2,"2019-11-14",null,"HEIDELBERG","Buy{}",186.5,174,193,"205-210","Profit of Rs.6.50/-",{"$f":"H11-F11","v":6.5},{"$f":"K11/F11","v":{"v":0.03485254691689008,"d":"3.49%"}},"Successful","2020-01-07",{"$nulls":3},"H"]
[3,"2019-11-18",null,"BAJAJ-AUTO","Sell",3190,3356.7,3030,"2900-2850","Profit of Rs.160/-",{"$f":"F12-H12","v":160},{"v":0.050156739811912224,"d":"5.02%"},"Successful","2020-01-06",{"$nulls":3},"R"]
[4,"2019-11-20",null,"BRITANNIA","Buy","3075-3100",2930,null,"3380-3420","Open",{"$nulls":4},{"$f":"VLOOKUP(D13,Sheet2!A76:M1715,6,0)","v":3112.95},null,null,"H"]
[5,"2019-11-21",null,"HINDUNILVR","Buy{}",2020,1917,1999.75,"2200-2250","Loss of Rs.20.25/-",{"$f":"H14-F14","v":-20.25},{"$f":"K14/F14","v":{"v":-0.010024752475247525,"d":"-1.00%"}},"Unsuccessful","2020-01-06",{"$nulls":3},"H"]
[6,"2019-11-27",null,"LT","Buy","1330-1340",1270,null,"1450-1500","Open",{"$nulls":4},{"$f":"VLOOKUP(D15,Sheet2!A80:M1719,6,0)","v":1332.3},null,null,"H"]
[7,"2019-12-02",null,"HAVELLS","Buy",664.5,632.7,627.5,"725-735","Loss of Rs.37/-",{"$f":"H16-F16","v":-37},{"$f":"K16/F16","v":{"v":-0.05568096313017306,"d":"-5.57%"}},"Unsuccessful","2020-01-20",{"$nulls":3},"R"]
[8,"2019-12-06",null,"ONGC","Buy",127.5,122,125.5,140,"Loss of Rs.2/-",{"$f":"H17-F17","v":-2},{"$f":"K17/F17","v":{"v":-0.01568627450980392,"d":"-1.57%"}},"Unsuccessful","2020-01-22",{"$nulls":3},"H"]
[9,"2019-12-23",null,"CANBK","Sell",227,238.3,216,"216-213","Profit of Rs.11/-",{"$f":"F18-H18","v":11},{"$f":"K18/F18","v":{"v":0.048458149779735685,"d":"4.85%"}},"Successful","2020-01-06",{"$nulls":3},"R"]
[10,"2019-12-24",null,"SBIN","Sell",334,351.3,317,"305-300","Profit of Rs.17/-",{"$f":"F19-H19","v":17},{"v":0.05089820359281437,"d":"5.09%"},"Successful","2020-01-07",{"$nulls":3},"R"]
[11,"2019-12-30",null,"EIHOTEL","Buy",140,132,147.5,"152-156","Profit of Rs.7.50/-",{"$f":"H20-F20","v":7.5},{"$f":"K20/F20","v":{"v":0.05357142857142857,"d":"5.36%"}},"Successful","2020-01-09",{"$nulls":3},"H"]
{"$rows_left_out":323}
{"sheet":"Sheet2","index":6,"n_rows":1899,"n_cols":14,"rows_kept":1899,"hidden":true}
["SYMBOL","SERIES","OPEN","HIGH","LOW","CLOSE","LAST","PREVCLOSE","TOTTRDQTY","TOTTRDVAL","TIMESTAMP","TOTALTRADES","ISIN","ISIN"]
["20MICRONS","EQ",33.85,34.2,33.4,33.7,33.7,33.5,10578,356525.05,"2020-01-23",222,"INE144J01027"]
["21STCENMGM","EQ",15.45,15.45,14.9,14.9,14.9,15.2,1754,26322.4,"2020-01-23",20,"INE253B01015"]
["3IINFOTECH","EQ",2.4,2.6,2.4,2.45,2.5,2.4,1781577,4417964.5,"2020-01-23",753,"INE748C01020"]
["3MINDIA","EQ",22399.85,22458.75,22250,22409.7,22427,22258.95,671,15021145.7,"2020-01-23",385,"INE470A01017"]
["5PAISA","EQ",189,199.9,189,192.1,191.35,191.05,34476,6698783.45,"2020-01-23",873,"INE618L01018"]
["63MOONS","EQ",110.75,112.45,109.5,110.5,110.2,110.5,152937,16902394.4,"2020-01-23",2996,"INE111B01023"]
["A2ZINFRA","EQ",7.7,7.75,7.55,7.6,7.65,7.6,91075,696388.2,"2020-01-23",214,"INE619I01012"]
["AARTIDRUGS","EQ",608.05,615,593.55,599.75,600,607.4,10319,6214412,"2020-01-23",488,"INE767A01016"]
["AARTIIND","EQ",862.2,870,853.55,868.05,869,860.7,75059,64762149.05,"2020-01-23",5139,"INE769A01020"]
["AARVEEDEN","EQ",14.45,14.85,14.1,14.3,14.6,14.5,8201,118774.2,"2020-01-23",209,"INE273D01019"]
["AAVAS","EQ",1944.6,2009.95,1944.1,1999.85,2000,1944.6,43685,86921510.85,"2020-01-23",5846,"INE216P01012"]
["ABAN","EQ",26,26.45,25.5,26.05,26.3,26.2,35395,921289.75,"2020-01-23",444,"INE421A01028"]
["ABB","EQ",1309,1320,1302,1316.4,1319,1303.3,13495,17708723.05,"2020-01-23",1082,"INE117A01022"]
["ABBOTINDIA","EQ",12680,12750,12652.05,12707.9,12710,12702.2,10901,138757187.5,"2020-01-23",1620,"INE358A01014"]
["ABCAPITAL","EQ",107.4,108.4,105.6,106,106,107,1677550,179017559.3,"2020-01-23",19573,"INE674K01013"]
["ABFRL","EQ",235.8,241,231.95,233.8,233.1,234.7,344297,81722244.5,"2020-01-23",7976,"INE647O01011"]
["ABSLBANETF","EQ",308.33,308.33,308.33,308.33,308.33,305.13,1,308.33,"2020-01-23",1,"INF209KB1O58"]
["ABSLNN50ET","EQ",290.34,290.34,288.2,289.34,289.34,289.5,174,50327.02,"2020-01-23",5,"INF209KB1B87"]
["ACC","EQ",1526.25,1554.9,1525,1548.35,1550,1524.4,1100769,1698575182.35,"2020-01-23",41698,"INE012A01025"]
{"$rows_left_out":1695}
{"sheet":"Sheet1","index":7,"n_rows":0,"n_cols":0,"rows_kept":0,"hidden":true}

{"sheet":"Sheet3","index":8,"n_rows":0,"n_cols":0,"rows_kept":0,"hidden":true}

{"sheet":"Sheet4","index":9,"n_rows":0,"n_cols":0,"rows_kept":0,"hidden":true}

{"sheet":"Sheet5","index":10,"n_rows":0,"n_cols":0,"rows_kept":0,"hidden":true}