{"text_format":"3","workbook":"xlsx","n_sheets":11,"sheets":["Main","Future Intra","Cash Intra","MidCap Intra","Bulk Deals","Call Tracker (Equity & F&O)","Sheet2","Sheet1","Sheet3","Sheet4","Sheet5"],"not_rendered":{"images":4,"defined_names":5},"read":"whole","date_system":"1900"}

{"sheet":"Main","index":0,"n_rows":27,"n_cols":11,"rows_kept":27}
[null,"                                                                                                 "]
{"$rows_empty":8}
[null,"2019-11-25"]
[]
[null,"Sheet No.","Template Name","Summary"]
[null,1,"Future Intra","For Intraday trading in F&O segment"]
[null,2,"Cash Intra","For Intraday trading in cash market segment"]
[null,3,"Mid-cap Intra","For Intraday trading in Mid-cap stocks"]
[null,4,"Bulk Deals","Reveals Bulk Deals carried on NSE & BSE"]
[null,5,"Call Tracker"]
{"$rows_empty":9}
[{"$nulls":10},"`"]

{"sheet":"Future Intra","index":1,"n_rows":193,"n_cols":15,"rows_kept":193,"merged":[[8,0,9,0],[8,1,9,1],[8,2,9,2],[8,5,8,7],[8,8,8,10]]}
[]
[]
[]
[]
[{"$nulls":12},"Back to Main Page"]
["FOR INTRA DAY TRADING",{"$nulls":10},{"$f":"Main!B10","v":"2019-11-25"}]
[]
[]
["Sr.no","Sector","Scrip","CLOSE RATE","Pivot Point","Supports",null,null,"Resistances"]
[null,"Sector",null,"Point","Point","S1","S2","S3","R1","R2","R3","HIGH","LOW","OI","% Change in OI"]
[1,"Index","BANKNIFTY",{"v":31114.7,"d":"31114.70"},{"v":31155.916666666668,"d":"31155.92"},{"v":30982.133333333335,"d":"30982.13"},{"v":30849.566666666666,"d":"30849.57"},{"v":30675.783333333333,"d":"30675.78"},{"v":31288.483333333337,"d":"31288.48"},{"v":31462.26666666667,"d":"31462.27"},{"v":31594.83333333334,"d":"31594.83"},31329.7,31023.35,1989500,{"v":-0.028725699834988332,"d":"-2.87%"}]
[2,"Index","NIFTY",{"v":11914.5,"d":"11914.50"},{"v":11925.333333333334,"d":"11925.33"},{"v":11873.266666666668,"d":"11873.27"},{"v":11832.033333333335,"d":"11832.03"},{"v":11779.966666666669,"d":"11779.97"},{"v":11966.566666666668,"d":"11966.57"},{"v":12018.633333333333,"d":"12018.63"},{"v":12059.866666666667,"d":"12059.87"},11977.4,11884.1,15151200,{"v":-0.06252291300251984,"d":"-6.25%"}]
[3,"Index","NIFTYIT",{"v":15116,"d":"15116.00"},{"v":15175.333333333334,"d":"15175.33"},{"v":14990.666666666668,"d":"14990.67"},{"v":14865.333333333334,"d":"14865.33"},{"v":14680.666666666668,"d":"14680.67"},{"v":15300.666666666668,"d":"15300.67"},{"v":15485.333333333336,"d":"15485.33"},{"v":15610.666666666668,"d":"15610.67"},15360,15050,11450,{"v":0.3160919540229885,"d":"31.61%"}]
[4,"Cement","ACC",{"v":1472.6,"d":"1472.60"},{"v":1473.5666666666668,"d":"1473.57"},{"v":1463.1833333333336,"d":"1463.18"},{"v":1453.7666666666669,"d":"1453.77"},{"v":1443.3833333333337,"d":"1443.38"},{"v":1482.9833333333336,"d":"1482.98"},{"v":1493.3666666666668,"d":"1493.37"},{"v":1502.7833333333335,"d":"1502.78"},1483.95,1464.15,2958400,{"v":-0.006448146157979581,"d":"-0.64%"}]
[5,"Others","ADANIENT",{"v":203.3,"d":"203.30"},{"v":203.28333333333333,"d":"203.28"},{"v":200.06666666666666,"d":"200.07"},{"v":196.83333333333334,"d":"196.83"},{"v":193.61666666666667,"d":"193.62"},{"v":206.51666666666665,"d":"206.52"},{"v":209.7333333333333,"d":"209.73"},{"v":212.96666666666664,"d":"212.97"},206.5,200.05,31304000,{"v":0.013468013468013467,"d":"1.35%"}]
[6,"Others","ADANIPORTS",{"v":372,"d":"372.00"},{"v":373.09999999999997,"d":"373.10"},{"v":369.8999999999999,"d":"369.90"},{"v":367.79999999999995,"d":"367.80"},{"v":364.5999999999999,"d":"364.60"},{"v":375.19999999999993,"d":"375.20"},{"v":378.4,"d":"378.40"},{"v":380.49999999999994,"d":"380.50"},376.3,371,22432500,{"v":0.05465444287729196,"d":"5.47%"}]
[7,"Power","ADANIPOWER",{"v":60.4,"d":"60.40"},{"v":60.73333333333333,"d":"60.73"},{"v":59.26666666666665,"d":"59.27"},{"v":58.133333333333326,"d":"58.13"},{"v":56.66666666666665,"d":"56.67"},{"v":61.86666666666665,"d":"61.87"},{"v":63.333333333333336,"d":"63.33"},{"v":64.46666666666665,"d":"64.47"},62.2,59.6,90030000,{"v":0.05212107046862218,"d":"5.21%"}]
[8,"Automobile","AMARAJABAT",{"v":742.6,"d":"742.60"},{"v":744.9333333333334,"d":"744.93"},{"v":734.3166666666668,"d":"734.32"},{"v":726.0333333333334,"d":"726.03"},{"v":715.4166666666669,"d":"715.42"},{"v":753.2166666666668,"d":"753.22"},{"v":763.8333333333334,"d":"763.83"},{"v":772.1166666666668,"d":"772.12"},755.55,736.65,1496100,{"v":-0.021965091194351832,"d":"-2.20%"}]
[9,"Cement","AMBUJACEM",{"v":200.6,"d":"200.60"},{"v":200.26666666666665,"d":"200.27"},{"v":198.33333333333331,"d":"198.33"},{"v":196.06666666666666,"d":"196.07"},{"v":194.13333333333333,"d":"194.13"},{"v":202.5333333333333,"d":"202.53"},{"v":204.46666666666664,"d":"204.47"},{"v":206.7333333333333,"d":"206.73"},202.2,198,18022500,{"v":-0.007844756399669695,"d":"-0.78%"}]
[10,"Others","APOLLOHOSP",{"v":1449.7,"d":"1449.70"},1454.45,1436.25,{"v":1422.8,"d":"1422.80"},{"v":1404.6,"d":"1404.60"},{"v":1467.9,"d":"1467.90"},{"v":1486.1000000000004,"d":"1486.10"},{"v":1499.5500000000002,"d":"1499.55"},1472.65,1441,1616500,{"v":-0.054125219426565244,"d":"-5.41%"}]
{"$rows_left_out":159}
{"sheet":"Cash Intra","index":2,"n_rows":247,"n_cols":13,"rows_kept":247,"merged":[[7,0,8,0],[7,1,8,1],[7,2,8,2],[7,3,8,3],[7,4,7,6],[7,7,7,9]]}
[]
[]
[]
[]
[{"$nulls":12},"Back to Main Page"]
["FOR INTRA DAY TRADING",{"$nulls":9},{"$f":"Main!B10","v":"2019-11-25"}]
[]
["Sr.no","Scrip","CLOSE RATE","Pivot Point","Supports",null,null,"Resistances"]
[null,null,"Point",null,"S1","S2","S3","R1","R2","R3","HIGH","LOW","Total Trade Quanity in Lakhs"]
[1,"Nifty 50",11914.4,{"v":11922,"d":"11922.00"},{"v":11875.9,"d":"11875.90"},{"v":11837.4,"d":"11837.40"},{"v":11791.3,"d":"11791.30"},{"v":11960.5,"d":"11960.50"},{"v":12006.599999999999,"d":"12006.60"},{"v":12045.1,"d":"12045.10"},11968.1,11883.5]
[2,"Nifty Bank",31111.6,{"v":31187,"d":"31187.00"},{"v":30979.8,"d":"30979.80"},{"v":30848,"d":"30848.00"},{"v":30640.8,"d":"30640.80"},{"v":31318.8,"d":"31318.80"},{"v":31525.999999999996,"d":"31526.00"},{"v":31657.8,"d":"31657.80"},31394.2,31055.2]
[3,"Nifty CPSE",1948.4,{"v":1942.1166666666668,"d":"1942.12"},{"v":1931.6833333333336,"d":"1931.68"},{"v":1914.966666666667,"d":"1914.97"},{"v":1904.5333333333338,"d":"1904.53"},{"v":1958.8333333333335,"d":"1958.83"},{"v":1969.2666666666669,"d":"1969.27"},{"v":1985.9833333333333,"d":"1985.98"},1952.55,1925.4]
[4,"Nifty Infra",3301.3,{"v":3300.566666666667,"d":"3300.57"},{"v":3289.033333333334,"d":"3289.03"},{"v":3276.7666666666673,"d":"3276.77"},{"v":3265.2333333333345,"d":"3265.23"},{"v":3312.833333333334,"d":"3312.83"},{"v":3324.366666666667,"d":"3324.37"},{"v":3336.6333333333337,"d":"3336.63"},3312.1,3288.3]
[5,"Nifty IT",14995.9,{"v":15049.099999999999,"d":"15049.10"},{"v":14878.149999999998,"d":"14878.15"},{"v":14760.4,"d":"14760.40"},{"v":14589.449999999999,"d":"14589.45"},{"v":15166.849999999997,"d":"15166.85"},{"v":15337.799999999997,"d":"15337.80"},{"v":15455.549999999996,"d":"15455.55"},15220.05,14931.35]
[6,"Nifty PSE",3271.75,{"v":3265.7166666666667,"d":"3265.72"},{"v":3252.133333333333,"d":"3252.13"},{"v":3232.5166666666664,"d":"3232.52"},{"v":3218.933333333333,"d":"3218.93"},{"v":3285.3333333333335,"d":"3285.33"},{"v":3298.9166666666665,"d":"3298.92"},{"v":3318.5333333333338,"d":"3318.53"},3279.3,3246.1]
[7,"Nifty Midcap 50",4618.85,{"v":4609.849999999999,"d":"4609.85"},{"v":4598.199999999999,"d":"4598.20"},{"v":4577.549999999999,"d":"4577.55"},{"v":4565.899999999999,"d":"4565.90"},{"v":4630.499999999999,"d":"4630.50"},{"v":4642.149999999999,"d":"4642.15"},{"v":4662.799999999999,"d":"4662.80"},4621.5,4589.2]
[8,"ACC",1469.9,{"v":1471.5833333333333,"d":"1471.58"},{"v":1460.5166666666664,"d":"1460.52"},{"v":1451.1333333333332,"d":"1451.13"},{"v":1440.0666666666664,"d":"1440.07"},{"v":1480.9666666666665,"d":"1480.97"},{"v":1492.0333333333335,"d":"1492.03"},{"v":1501.4166666666665,"d":"1501.42"},1482.65,1462.2,5.01614]
[9,"AUBANK",802.3,{"v":806.7666666666668,"d":"806.77"},{"v":791.5333333333335,"d":"791.53"},{"v":780.7666666666668,"d":"780.77"},{"v":765.5333333333335,"d":"765.53"},{"v":817.5333333333335,"d":"817.53"},{"v":832.7666666666669,"d":"832.77"},{"v":843.5333333333335,"d":"843.53"},822,796,3.73463]
[10,"ADANIPORTS",371.45,{"v":372.48333333333335,"d":"372.48"},{"v":369.4166666666667,"d":"369.42"},{"v":367.3833333333333,"d":"367.38"},{"v":364.31666666666666,"d":"364.32"},{"v":374.5166666666667,"d":"374.52"},{"v":377.5833333333333,"d":"377.58"},{"v":379.61666666666673,"d":"379.62"},375.55,370.45,36.79373]
[11,"ADANIPOWER",60.5,{"v":60.833333333333336,"d":"60.83"},{"v":59.366666666666674,"d":"59.37"},{"v":58.23333333333334,"d":"58.23"},{"v":56.76666666666668,"d":"56.77"},{"v":61.96666666666667,"d":"61.97"},{"v":63.43333333333332,"d":"63.43"},{"v":64.56666666666666,"d":"64.57"},62.3,59.7,86.90224]
{"$rows_left_out":228}
{"sheet":"MidCap Intra","index":3,"n_rows":545,"n_cols":13,"rows_kept":545,"merged":[[0,0,0,1],[8,0,9,0],[8,1,9,1],[8,2,9,2],[8,3,9,3],[8,4,8,6],[8,7,8,9]]}
[]
[]
[]
[]
[{"$nulls":11},"Back To Main Page"]
["FOR INTRA DAY TRADING",{"$nulls":9},{"$f":"Main!B10","v":"2019-11-25"}]
[null,null," "]
[]
["Sr.no","Scrip","CLOSE RATE","Pivot Point","Supports",null,null,"Resistances"]
[null,null,"Point",null,"S1","S2","S3","R1","R2","R3","HIGH","LOW","Total Trade Quanity in Lakhs"]
[1,"3MINDIA",22415.3,{"v":22525.016666666666,"d":"22525.02"},{"v":22250.033333333333,"d":"22250.03"},{"v":22084.766666666666,"d":"22084.77"},{"v":21809.783333333333,"d":"21809.78"},{"v":22690.283333333333,"d":"22690.28"},{"v":22965.266666666663,"d":"22965.27"},{"v":23130.533333333333,"d":"23130.53"},22800,22359.75,0.01335]
[2,"ACC",1469.9,{"v":1471.5833333333333,"d":"1471.58"},{"v":1460.5166666666664,"d":"1460.52"},{"v":1451.1333333333332,"d":"1451.13"},{"v":1440.0666666666664,"d":"1440.07"},{"v":1480.9666666666665,"d":"1480.97"},{"v":1492.0333333333335,"d":"1492.03"},{"v":1501.4166666666665,"d":"1501.42"},1482.65,1462.2,5.01614]
[3,"AIAENG",1635.6,{"v":1631.8666666666668,"d":"1631.87"},{"v":1619.7333333333336,"d":"1619.73"},{"v":1603.8666666666668,"d":"1603.87"},{"v":1591.7333333333336,"d":"1591.73"},{"v":1647.7333333333336,"d":"1647.73"},{"v":1659.8666666666668,"d":"1659.87"},{"v":1675.7333333333336,"d":"1675.73"},1644,1616,0.10024]
[4,"APLAPOLLO",1555.2,{"v":1558.0666666666666,"d":"1558.07"},{"v":1541.1333333333332,"d":"1541.13"},{"v":1527.0666666666666,"d":"1527.07"},{"v":1510.1333333333332,"d":"1510.13"},{"v":1572.1333333333332,"d":"1572.13"},{"v":1589.0666666666666,"d":"1589.07"},{"v":1603.1333333333332,"d":"1603.13"},1575,1544,0.14278]
[5,"AUBANK",802.3,{"v":806.7666666666668,"d":"806.77"},{"v":791.5333333333335,"d":"791.53"},{"v":780.7666666666668,"d":"780.77"},{"v":765.5333333333335,"d":"765.53"},{"v":817.5333333333335,"d":"817.53"},{"v":832.7666666666669,"d":"832.77"},{"v":843.5333333333335,"d":"843.53"},822,796,3.73463]
[6,"AAVAS",1723.25,{"v":1684.6833333333334,"d":"1684.68"},{"v":1639.5666666666668,"d":"1639.57"},{"v":1555.8833333333334,"d":"1555.88"},{"v":1510.7666666666669,"d":"1510.77"},{"v":1768.3666666666668,"d":"1768.37"},{"v":1813.4833333333336,"d":"1813.48"},{"v":1897.1666666666667,"d":"1897.17"},1729.8,1601,1.75115]
[7,"ABBOTINDIA",12573.4,{"v":12487.483333333332,"d":"12487.48"},{"v":12355.966666666664,"d":"12355.97"},{"v":12138.533333333331,"d":"12138.53"},{"v":12007.016666666663,"d":"12007.02"},{"v":12704.916666666664,"d":"12704.92"},{"v":12836.43333333333,"d":"12836.43"},{"v":13053.866666666665,"d":"13053.87"},12619,12270.05,0.07693]
[8,"ADANIGAS",146.25,{"v":146.53333333333333,"d":"146.53"},{"v":145.66666666666666,"d":"145.67"},{"v":145.08333333333331,"d":"145.08"},{"v":144.21666666666664,"d":"144.22"},{"v":147.11666666666667,"d":"147.12"},{"v":147.98333333333335,"d":"147.98"},{"v":148.5666666666667,"d":"148.57"},147.4,145.95,7.09471]
[9,"ADANIGREEN",106.7,{"v":102.89999999999999,"d":"102.90"},{"v":99.09999999999998,"d":"99.10"},{"v":91.49999999999999,"d":"91.50"},{"v":87.69999999999997,"d":"87.70"},{"v":110.49999999999999,"d":"110.50"},{"v":114.3,"d":"114.30"},{"v":121.89999999999999,"d":"121.90"},106.7,95.3,42.28833]
[10,"ADANIPORTS",371.45,{"v":372.48333333333335,"d":"372.48"},{"v":369.4166666666667,"d":"369.42"},{"v":367.3833333333333,"d":"367.38"},{"v":364.31666666666666,"d":"364.32"},{"v":374.5166666666667,"d":"374.52"},{"v":377.5833333333333,"d":"377.58"},{"v":379.61666666666673,"d":"379.62"},375.55,370.45,36.79373]
{"$rows_left_out":513}
{"sheet":"Bulk Deals","index":4,"n_rows":67,"n_cols":8,"rows_kept":67,"merged":[[4,0,4,1],[4,2,4,3],[6,1,6,2]]}
[" "]
[]
[]
[]
[]
[{"$nulls":4},"Back To Main Page"]
["Subject :","BULK DEAL",null,{"$f":"Main!B10","v":"2019-11-25"}]
[]
["Date","Scrip code","Scrip Name","Client Name","Buy / Sell","Quantity Traded","Trade Price / Wt.Avg.trade price","Exchange  "]
["2019-11-22",542579,"AGOL","NEWEDGE VINIMAY PRIVATE LIMITED","BUY",{"v":120000,"d":"120,000"},{"v":30.7,"d":"30.70"},"BSE"]
["2019-11-22",542579,"AGOL","AJAY KUMAR AGARWAL HUF","SELL",{"v":150000,"d":"150,000"},{"v":30.7,"d":"30.70"},"BSE"]
["2019-11-22",541401,"ARIHANTINS","ARUN DASHRATHBHAI PRAJAPATI","BUY",{"v":120000,"d":"120,000"},6.25,"BSE"]
["2019-11-22",541401,"ARIHANTINS","MANISHABEN KALPESHBHAI MALVI","BUY",{"v":208000,"d":"208,000"},6.26,"BSE"]
["2019-11-22",541401,"ARIHANTINS","MANISHABEN KALPESHBHAI MALVI","SELL",{"v":112000,"d":"112,000"},6.28,"BSE"]
["2019-11-22",541401,"ARIHANTINS","MADHUBEN VINODBHAI KAMDAR","SELL",{"v":204000,"d":"204,000"},6.25,"BSE"]
["2019-11-22",541401,"ARIHANTINS","ASHISH HASAMUKHLAL SHAH","BUY",{"v":56000,"d":"56,000"},6.29,"BSE"]
["2019-11-22",508918,"GREYCELLS","LTS INVESTMENT FUND LTD","SELL",{"v":105252,"d":"105,252"},{"v":28.2,"d":"28.20"},"BSE"]
["2019-11-22",508918,"GREYCELLS","KRISMA INVESTMENTS PRIVATE LIMITED","BUY",{"v":105300,"d":"105,300"},{"v":28.2,"d":"28.20"},"BSE"]
["2019-11-22",540938,"GUJHYSPIN","KEDAR DILIP KOTHARI","BUY",{"v":160000,"d":"160,000"},4.94,"BSE"]
["2019-11-22",536709,"INDRENEW","HARIT SHAH","SELL",{"v":20499,"d":"20,499"},8.12,"BSE"]
{"$rows_left_out":48}
{"sheet":"Call Tracker (Equity & F&O)","index":5,"n_rows":376,"n_cols":18,"rows_kept":376,"merged":[[125,0,126,0],[125,1,126,1],[125,9,126,9],[125,11,126,11],[125,12,126,12],[125,13,126,13],[125,14,126,14],[127,0,128,0],[127,1,128,1],[127,9,128,9],[127,11,128,11],[127,12,128,12],[127,13,128,13],[127,14,128,14],[129,0,130,0],[129,1,130,1],[129,9,130,9],[129,11,130,11],[129,12,130,12],[129,13,130,13],[129,14,130,14],[131,0,132,0],[131,1,132,1],[131,9,132,9],[131,11,132,11],[131,12,132,12],[131,13,132,13],[131,14,132,14],[133,0,134,0],[133,1,134,1],[133,9,134,9],[133,11,134,11],[133,12,134,12],[133,13,134,13],[133,14,134,14],[135,0,136,0],[135,1,136,1],[135,9,136,9],[135,11,136,11],[135,12,136,12],[135,13,136,13],[135,14,136,14],[137,0,138,0],[137,1,138,1],[137,9,138,9],[137,11,138,11],[137,12,138,12],[137,13,138,13],[137,14,138,14],[139,0,140,0],[139,1,140,1],[139,9,140,9],[139,11,140,11],[139,12,140,12],[139,13,140,13],[139,14,140,14],[141,0,142,0],[141,1,142,1],[141,9,142,9],[141,11,142,11],[141,12,142,12],[141,13,142,13],[141,14,142,14],[143,0,144,0],[143,1,144,1],[143,9,144,9],[143,11,144,11],[143,12,144,12],[143,13,144,13],[143,14,144,14],[145,0,146,0],[145,1,146,1],[145,9,146,9],[145,11,146,11],[145,12,146,12],[145,13,146,13],[145,14,146,14],[147,0,148,0],[147,1,148,1],[147,9,148,9],[147,11,148,11],[147,12,148,12],[147,13,148,13],[147,14,148,14],[149,0,150,0],[149,1,150,1],[149,9,150,9],[149,11,150,11],[149,12,150,12],[149,13,150,13],[149,14,150,14],[151,0,152,0],[151,1,152,1],[151,9,152,9],[151,11,152,11],[151,12,152,12],[151,13,152,13],[151,14,152,14],[153,0,154,0],[153,1,154,1],[153,9,154,9],[153,11,154,11],[153,12,154,12],[153,13,154,13],[153,14,154,14],[155,0,156,0],[155,1,156,1],[155,9,156,9],[155,11,156,11],[155,12,156,12],[155,13,156,13],[155,14,156,14],[157,0,158,0],[157,1,158,1],[157,9,158,9],[157,11,158,11],[157,12,158,12],[157,13,158,13],[157,14,158,14],[160,0,161,0],[160,1,161,1],[160,9,161,9],[160,11,161,11],[160,12,161,12],[160,13,161,13],[160,14,161,14],[162,0,163,0],[162,1,163,1],[162,9,163,9],[162,11,163,11],[162,12,163,12],[162,13,163,13],[162,14,163,14],[173,0,174,0],[173,1,174,1],[173,9,174,9],[173,11,174,11],[173,12,174,12],[173,13,174,13],[173,14,174,14],[175,0,176,0],[175,1,176,1],[175,9,176,9],[175,11,176,11],[175,12,176,12],[175,13,176,13],[175,14,176,14],[178,0,179,0],[178,1,179,1],[178,9,179,9],[178,11,179,11],[178,12,179,12],[178,13,179,13],[178,14,179,14],[180,0,181,0],[180,1,181,1],[180,9,181,9],[180,11,181,11],[180,12,181,12],[180,13,181,13],[180,14,181,14],[182,0,183,0],[182,1,183,1],[182,9,183,9],[182,11,183,11],[182,12,183,12],[182,13,183,13],[182,14,183,14],[184,0,185,0],[184,1,185,1],[184,9,185,9],[184,11,185,11],[184,12,185,12],[184,13,185,13],[184,14,185,14],[186,0,187,0],[186,1,187,1],[186,9,187,9],[186,11,187,11],[186,12,187,12],[186,13,187,13],[186,14,187,14],[189,0,190,0],[189,1,190,1],[189,9,190,9],[189,11,190,11],[189,12,190,12],[189,13,190,13],[189,14,190,14],[191,0,192,0],[191,1,192,1],[191,9,192,9],[191,11,192,11],[191,12,192,12],[191,13,192,13],[191,14,192,14],[193,0,194,0],[193,1,194,1],[193,9,194,9],[193,11,194,11],[193,12,194,12],[193,13,194,13],[193,14,194,14],[197,0,198,0],[197,1,198,1],[197,9,198,9],[197,11,198,11],[197,12,198,12],[197,13,198,13],[197,14,198,14],[199,0,200,0],[199,1,200,1],[199,9,200,9],[199,11,200,11],[199,12,200,12],[199,13,200,13],[199,14,200,14],[201,0,202,0],[201,1,202,1],[201,9,202,9],[201,11,202,11],[201,12,202,12],[201,13,202,13],[201,14,202,14]]}
[]
[]
[]
[]
[{"$nulls":12},"Back To Main Page"]
["Retail Research Technical Calls & Fundamental Performance Report for the month of November-2019 "]
[{"$nulls":12},{"$f":"Main!B10","v":"2019-11-25"}]
[null,"Positional  Call"]
["Sr.no","Date",null,"Company","Rec","Rec Price","Stop Loss***","Call Closed At","Target","Remark","Profit / Loss per Share","Gain / Loss  %","Status","Closed Date","NSE Closed Price"]
[1,"2019-09-26",null,"HDFC","Buy",2070,1940,2165,"2250-2300","Profit of Rs.95/-",{"$f":"H10-F10","v":95},{"$f":"K10/F10","v":{"v":0.04589371980676329,"d":"4.59%"}},"Successful","2019-11-01",{"$nulls":3},"H"]
[2,"2019-10-01",null,"UPL","Buy{}",595,564,599.5,"650-660","Profit of Rs.4.50/-",4.5,{"v":0.007563025210084034,"d":"0.76%"},"Neutral","2019-11-07",{"$nulls":3},"R"]
[3,"2019-10-07",null,"PIDILITIND","Buy{}",1367.5,1297,1413.5,"1500-1520","Part Profit of Rs.46/-",{"$f":"H12-F12","v":46},{"$f":"K12/F12","v":{"v":0.03363802559414991,"d":"3.36%"}},"Successful","2019-10-31",{"$f":"VLOOKUP(D12,Sheet2!A51:M1690,6,0)","v":1297.9},null,null,"R"]
[4,"2019-10-22",null,"HEIDELBERG","Buy",188.5,178,199,"205-210","Profit of Rs.10.50/-",10.5,{"v":0.05570291777188329,"d":"5.57%"},"Successful","2019-11-05",{"$nulls":3},"H"]
[5,"2019-10-27",null,"AMBUJACEM","Buy{}",197,185.4,203.5,"216-220","Part Profit of Rs.6.5/-",{"$f":"H14-F14","v":6.5},{"$f":"K14/F14","v":{"v":0.03299492385786802,"d":"3.30%"}},"Successful","2019-10-30",{"$f":"VLOOKUP(D14,Sheet2!A60:M1699,6,0)","v":200.8},null,null,"R"]
[6,"2019-11-04",null,"UBL","Buy{}",1240,1178,1292.5,"1340-1360","Profit of Rs.52.5/-",{"$f":"H15-F15","v":52.5},{"$f":"K15/F15","v":{"v":0.04233870967741935,"d":"4.23%"}},"Successful","2019-11-08",{"$nulls":3},"H"]
[7,"2019-11-05",null,"TATAMOTORS","Sell",173,183.3,163,"158-155","Profit of Rs.10/-",{"$f":"F16-H16","v":10},{"v":0.057803468208092484,"d":"5.78%"},"Successful","2019-11-21",{"$nulls":3},"R"]
[8,"2019-11-06",null,"BANDHANBNK","Buy",572.5,538,547,"630-650","Loss of Rs.25.5/-",-25.5,{"$f":"K17/F17","v":{"v":-0.0445414847161572,"d":"-4.45%"}},"Unsuccessful","2019-11-11",{"$nulls":3},"H"]
[9,"2019-11-07",null,"PRESTIGE","Buy",312,288,288.5,"340-360","Loss of Rs.23.5/-",{"$f":"H18-F18","v":-23.5},{"$f":"K18/F18","v":{"v":-0.07532051282051282,"d":"-7.53%"}},"Unsuccessful","2019-11-15",{"$nulls":3},"H"]
[10,"2019-11-07",null,"JINDALSTEL","Sell",138,148.3,143,"120-117","Loss of Rs.5/-",{"$f":"F19-H19","v":-5},{"$f":"K19/F19","v":{"v":-0.036231884057971016,"d":"-3.62%"}},"Unsuccessful","2019-11-07",{"$nulls":3},"R"]
[11,"2019-11-08",null,"CIPLA","Sell{}",465,491.3,440,"425-418","Profit of Rs.25/-",{"$f":"F20-H20","v":25},{"v":0.053763440860215055,"d":"5.38%"},"Successful","2019-11-15",{"$nulls":3},"R"]
{"$rows_left_out":341}
{"sheet":"Sheet2","index":6,"n_rows":1899,"n_cols":14,"rows_kept":1899,"hidden":true}
["SYMBOL","SERIES","OPEN","HIGH","LOW","CLOSE","LAST","PREVCLOSE","TOTTRDQTY","TOTTRDVAL","TIMESTAMP","TOTALTRADES","ISIN","ISIN"]
["20MICRONS","EQ",34.75,34.75,32.85,33.1,33,34,48791,1628632.75,"2019-11-22",535,"INE144J01027"]
["21STCENMGM","EQ",13.85,13.85,13.6,13.6,13.6,13.85,502,6827.7,"2019-11-22",3,"INE253B01015"]
["3IINFOTECH","EQ",1.95,2,1.9,1.95,2,1.95,495766,973299.45,"2019-11-22",521,"INE748C01020"]
["3MINDIA","EQ",22645,22800,22359.75,22415.3,22401,22598.55,1335,30126468.25,"2019-11-22",668,"INE470A01017"]
["3PLAND","EQ",6.2,6.5,6.2,6.5,6.5,6.2,1854,11750.4,"2019-11-22",10,"INE105C01023"]
["5PAISA","EQ",152.7,156,151.95,153.45,153.5,151.85,5672,870763.3,"2019-11-22",247,"INE618L01018"]
["63MOONS","EQ",115,120.4,113.05,115.5,113.65,109.5,532261,62469280.3,"2019-11-22",8349,"INE111B01023"]
["A2ZINFRA","EQ",8.85,9.55,8.75,9.15,9.2,8.9,185823,1675218.4,"2019-11-22",319,"INE619I01012"]
["AARTIDRUGS","EQ",527,527,518.15,520.1,520.55,524.45,12212,6367079.25,"2019-11-22",1710,"INE767A01016"]
["AARTIIND","EQ",848.9,851,823,825.55,824,843.5,46056,38322140.8,"2019-11-22",3229,"INE769A01020"]
["AARVEEDEN","EQ",13.25,13.25,12.5,12.85,13,12.7,4484,56882.95,"2019-11-22",67,"INE273D01019"]
["AAVAS","EQ",1601,1729.8,1601,1723.25,1725,1696.65,175115,297202295.65,"2019-11-22",16317,"INE216P01012"]
["ABAN","BE",28.6,28.65,26.7,27.5,27.7,27.6,18601,512284.2,"2019-11-22",235,"INE421A01028"]
["ABB","EQ",1439.95,1439.95,1404,1410.05,1408.5,1439.2,38441,54453843,"2019-11-22",4469,"INE117A01022"]
["ABBOTINDIA","EQ",12460,12619,12270.05,12573.4,12600,12392.3,7693,95707436.25,"2019-11-22",2705,"INE358A01014"]
["ABCAPITAL","EQ",95.1,101.3,92.5,100.15,100.7,95.75,14051512,1369230078.5,"2019-11-22",81598,"INE674K01013"]
["ABFRL","EQ",210,224.9,207,219.45,217.55,210.05,769914,166833081.8,"2019-11-22",19784,"INE647O01011"]
["ABSLBANETF","EQ",310.66,314.14,310.66,314.06,314.14,315.75,116,36377.36,"2019-11-22",3,"INF209KB1O58"]
["ABSLNN50ET","EQ",284.38,284.38,284.38,284.38,284.38,284.01,1,284.38,"2019-11-22",1,"INF209KB1B87"]
{"$rows_left_out":1701}
{"sheet":"Sheet1","index":7,"n_rows":0,"n_cols":0,"rows_kept":0,"hidden":true}

{"sheet":"Sheet3","index":8,"n_rows":0,"n_cols":0,"rows_kept":0,"hidden":true}

{"sheet":"Sheet4","index":9,"n_rows":0,"n_cols":0,"rows_kept":0,"hidden":true}

{"sheet":"Sheet5","index":10,"n_rows":0,"n_cols":0,"rows_kept":0,"hidden":true}