{"text_format":"3","workbook":"xlsx","n_sheets":11,"sheets":["Main","Future Intra","Cash Intra","MidCap Intra","Bulk Deals","Call Tracker (Equity & F&O)","Sheet2","Sheet1","Sheet3","Sheet4","Sheet5"],"not_rendered":{"images":4,"defined_names":5},"read":"whole","date_system":"1900"}

{"sheet":"Main","index":0,"n_rows":27,"n_cols":11,"rows_kept":27}
[null,"                                                                                                 "]
{"$rows_empty":8}
[null,"2019-09-25"]
[]
[null,"Sheet No.","Template Name","Summary"]
[null,1,"Future Intra","For Intraday trading in F&O segment"]
[null,2,"Cash Intra","For Intraday trading in cash market segment"]
[null,3,"Mid-cap Intra","For Intraday trading in Mid-cap stocks"]
[null,4,"Bulk Deals","Reveals Bulk Deals carried on NSE & BSE"]
[null,5,"Call Tracker"]
{"$rows_empty":9}
[{"$nulls":10},"`"]

{"sheet":"Future Intra","index":1,"n_rows":205,"n_cols":15,"rows_kept":205,"merged":[[8,0,9,0],[8,1,9,1],[8,2,9,2],[8,5,8,7],[8,8,8,10]]}
[]
[]
[]
[]
[{"$nulls":12},"Back to Main Page"]
["FOR INTRA DAY TRADING",{"$nulls":10},{"$f":"Main!B10","v":"2019-09-25"}]
[]
[]
["Sr.no","Sector","Scrip","CLOSE RATE","Pivot Point","Supports",null,null,"Resistances"]
[null,"Sector",null,"Point","Point","S1","S2","S3","R1","R2","R3","HIGH","LOW","OI","% Change in OI"]
[1,"Index","BANKNIFTY",30250.15,{"v":30282.783333333336,"d":"30282.78"},{"v":29890.616666666672,"d":"29890.62"},{"v":29531.083333333336,"d":"29531.08"},{"v":29138.91666666667,"d":"29138.92"},{"v":30642.316666666673,"d":"30642.32"},{"v":31034.483333333337,"d":"31034.48"},{"v":31394.016666666674,"d":"31394.02"},30674.95,29923.25,1632160,{"v":-0.04051543725162838,"d":"-4.05%"}]
[2,"Index","NIFTY",11613.85,{"v":11610.483333333332,"d":"11610.48"},{"v":11560.966666666664,"d":"11560.97"},{"v":11508.083333333332,"d":"11508.08"},{"v":11458.566666666664,"d":"11458.57"},{"v":11663.366666666663,"d":"11663.37"},{"v":11712.88333333333,"d":"11712.88"},{"v":11765.766666666663,"d":"11765.77"},11660,11557.6,22118850,{"v":-0.024574331564951646,"d":"-2.46%"}]
[3,"Index","NIFTYIT",{"v":15424,"d":"15424.00"},{"v":15370.666666666666,"d":"15370.67"},{"v":15281.333333333332,"d":"15281.33"},{"v":15138.666666666666,"d":"15138.67"},{"v":15049.333333333332,"d":"15049.33"},{"v":15513.333333333332,"d":"15513.33"},{"v":15602.666666666664,"d":"15602.67"},{"v":15745.333333333332,"d":"15745.33"},15460,15228,14700,{"v":-0.09259259259259259,"d":"-9.26%"}]
[4,"Cement","ACC",{"v":1656.1,"d":"1656.10"},{"v":1649.3999999999999,"d":"1649.40"},{"v":1630.6999999999998,"d":"1630.70"},{"v":1605.3,"d":"1605.30"},{"v":1586.6,"d":"1586.60"},{"v":1674.7999999999997,"d":"1674.80"},{"v":1693.5,"d":"1693.50"},{"v":1718.8999999999996,"d":"1718.90"},1668.1,1624,1902000,{"v":-0.044413183279742766,"d":"-4.44%"}]
[5,"Others","ADANIENT",{"v":148.1,"d":"148.10"},{"v":148.81666666666666,"d":"148.82"},{"v":144.33333333333331,"d":"144.33"},{"v":140.56666666666666,"d":"140.57"},{"v":136.08333333333331,"d":"136.08"},{"v":152.58333333333331,"d":"152.58"},{"v":157.06666666666666,"d":"157.07"},{"v":160.83333333333331,"d":"160.83"},153.3,145.05,26340000,{"v":-0.02110896387691393,"d":"-2.11%"}]
[6,"Others","ADANIPORTS",{"v":413.8,"d":"413.80"},411.45,{"v":406.34999999999997,"d":"406.35"},{"v":398.9,"d":"398.90"},{"v":393.79999999999995,"d":"393.80"},{"v":418.9,"d":"418.90"},{"v":424,"d":"424.00"},431.45,416.55,404,15822500,{"v":-0.015707620528771383,"d":"-1.57%"}]
[7,"Power","ADANIPOWER",{"v":67.7,"d":"67.70"},{"v":67.2,"d":"67.20"},66.15,{"v":64.60000000000001,"d":"64.60"},{"v":63.55000000000001,"d":"63.55"},68.75,{"v":69.79999999999998,"d":"69.80"},71.35,68.25,65.65,118900000,{"v":0.0930318073175216,"d":"9.30%"}]
[8,"Automobile","AMARAJABAT",727.85,{"v":729.1999999999999,"d":"729.20"},{"v":716.0499999999998,"d":"716.05"},{"v":704.2499999999999,"d":"704.25"},{"v":691.0999999999998,"d":"691.10"},{"v":740.9999999999999,"d":"741.00"},754.15,{"v":765.9499999999999,"d":"765.95"},742.35,717.4,1893500,{"v":-0.01886108088501995,"d":"-1.89%"}]
[9,"Cement","AMBUJACEM",216.25,215.85,{"v":212.89999999999998,"d":"212.90"},{"v":209.54999999999998,"d":"209.55"},{"v":206.59999999999997,"d":"206.60"},{"v":219.2,"d":"219.20"},{"v":222.14999999999998,"d":"222.15"},{"v":225.5,"d":"225.50"},218.8,212.5,23680000,{"v":-0.03700691337942253,"d":"-3.70%"}]
[10,"Others","APOLLOHOSP",1455.55,{"v":1460.2,"d":"1460.20"},{"v":1431.8500000000001,"d":"1431.85"},1408.15,{"v":1379.8000000000002,"d":"1379.80"},{"v":1483.9,"d":"1483.90"},1512.25,1535.95,1488.55,1436.5,2129000,{"v":0.14616419919246298,"d":"14.62%"}]
{"$rows_left_out":172}
{"sheet":"Cash Intra","index":2,"n_rows":247,"n_cols":13,"rows_kept":247,"merged":[[7,0,8,0],[7,1,8,1],[7,2,8,2],[7,3,8,3],[7,4,7,6],[7,7,7,9]]}
[]
[]
[]
[]
[{"$nulls":12},"Back to Main Page"]
["FOR INTRA DAY TRADING",{"$nulls":9},{"$f":"Main!B10","v":"2019-09-25"}]
[]
["Sr.no","Scrip","CLOSE RATE","Pivot Point","Supports",null,null,"Resistances"]
[null,null,"Point",null,"S1","S2","S3","R1","R2","R3","HIGH","LOW","Total Trade Quanity in Lakhs"]
[1,"Nifty 50",11588.2,11594.15,11533.25,{"v":11478.300000000001,"d":"11478.30"},{"v":11417.400000000001,"d":"11417.40"},{"v":11649.099999999999,"d":"11649.10"},{"v":11709.999999999996,"d":"11710.00"},{"v":11764.949999999997,"d":"11764.95"},11655.05,11539.2]
[2,"Nifty Bank",30183.1,{"v":30246.916666666668,"d":"30246.92"},{"v":29825.733333333337,"d":"29825.73"},{"v":29468.36666666667,"d":"29468.37"},{"v":29047.183333333338,"d":"29047.18"},{"v":30604.283333333336,"d":"30604.28"},{"v":31025.466666666664,"d":"31025.47"},{"v":31382.833333333336,"d":"31382.83"},30668.1,29889.55]
[3,"Nifty CPSE",1947.4,{"v":1961.7833333333335,"d":"1961.78"},{"v":1926.566666666667,"d":"1926.57"},{"v":1905.7333333333336,"d":"1905.73"},{"v":1870.516666666667,"d":"1870.52"},{"v":1982.616666666667,"d":"1982.62"},{"v":2017.8333333333337,"d":"2017.83"},{"v":2038.666666666667,"d":"2038.67"},1997,1940.95]
[4,"Nifty Infra",3175.25,{"v":3183.9833333333336,"d":"3183.98"},{"v":3158.3666666666672,"d":"3158.37"},{"v":3141.4833333333336,"d":"3141.48"},{"v":3115.8666666666672,"d":"3115.87"},{"v":3200.8666666666672,"d":"3200.87"},{"v":3226.483333333334,"d":"3226.48"},{"v":3243.3666666666672,"d":"3243.37"},3209.6,3167.1]
[5,"Nifty IT",15338.65,{"v":15258.016666666668,"d":"15258.02"},{"v":15135.683333333336,"d":"15135.68"},{"v":14932.716666666667,"d":"14932.72"},{"v":14810.383333333335,"d":"14810.38"},{"v":15460.983333333337,"d":"15460.98"},{"v":15583.31666666667,"d":"15583.32"},{"v":15786.283333333338,"d":"15786.28"},15380.35,15055.05]
[6,"Nifty PSE",3200.4,{"v":3210.133333333333,"d":"3210.13"},{"v":3173.7666666666664,"d":"3173.77"},{"v":3147.133333333333,"d":"3147.13"},{"v":3110.7666666666664,"d":"3110.77"},{"v":3236.7666666666664,"d":"3236.77"},{"v":3273.133333333333,"d":"3273.13"},{"v":3299.7666666666664,"d":"3299.77"},3246.5,3183.5]
[7,"Nifty Midcap 50",4554.95,{"v":4568.166666666667,"d":"4568.17"},{"v":4512.833333333334,"d":"4512.83"},{"v":4470.716666666667,"d":"4470.72"},{"v":4415.383333333334,"d":"4415.38"},{"v":4610.283333333334,"d":"4610.28"},{"v":4665.616666666668,"d":"4665.62"},{"v":4707.733333333334,"d":"4707.73"},4623.5,4526.05]
[8,"ABB",1573.35,1566.45,{"v":1551.9,"d":"1551.90"},1530.45,{"v":1515.9,"d":"1515.90"},{"v":1587.9,"d":"1587.90"},{"v":1602.4499999999998,"d":"1602.45"},{"v":1623.9,"d":"1623.90"},1581,1545,1.37947]
[9,"ACC",1650.8,{"v":1648.2666666666667,"d":"1648.27"},{"v":1624.5333333333333,"d":"1624.53"},{"v":1598.2666666666667,"d":"1598.27"},{"v":1574.5333333333333,"d":"1574.53"},{"v":1674.5333333333333,"d":"1674.53"},{"v":1698.2666666666664,"d":"1698.27"},{"v":1724.5333333333333,"d":"1724.53"},1672,1622,6.09163]
[10,"AUBANK",669.95,673.25,{"v":656.7,"d":"656.70"},643.45,{"v":626.9000000000001,"d":"626.90"},{"v":686.5,"d":"686.50"},703.05,{"v":716.3,"d":"716.30"},689.8,660,1.74218]
[11,"ADANIPORTS",413.85,{"v":411.76666666666665,"d":"411.77"},{"v":406.0333333333333,"d":"406.03"},{"v":398.21666666666664,"d":"398.22"},{"v":392.4833333333333,"d":"392.48"},{"v":419.5833333333333,"d":"419.58"},{"v":425.31666666666666,"d":"425.32"},{"v":433.1333333333333,"d":"433.13"},417.5,403.95,31.12368]
{"$rows_left_out":228}
{"sheet":"MidCap Intra","index":3,"n_rows":545,"n_cols":13,"rows_kept":545,"merged":[[0,0,0,1],[8,0,9,0],[8,1,9,1],[8,2,9,2],[8,3,9,3],[8,4,8,6],[8,7,8,9]]}
[]
[]
[]
[]
[{"$nulls":11},"Back To Main Page"]
["FOR INTRA DAY TRADING",{"$nulls":9},{"$f":"Main!B10","v":"2019-09-25"}]
[null,null," "]
[]
["Sr.no","Scrip","CLOSE RATE","Pivot Point","Supports",null,null,"Resistances"]
[null,null,"Point",null,"S1","S2","S3","R1","R2","R3","HIGH","LOW","Total Trade Quanity in Lakhs"]
[1,"3MINDIA",19722.3,{"v":20007.416666666668,"d":"20007.42"},{"v":19314.883333333335,"d":"19314.88"},{"v":18907.466666666667,"d":"18907.47"},{"v":18214.933333333334,"d":"18214.93"},{"v":20414.833333333336,"d":"20414.83"},{"v":21107.36666666667,"d":"21107.37"},{"v":21514.783333333336,"d":"21514.78"},20699.95,19600,0.02556]
[2,"ABB",1573.35,1566.45,{"v":1551.9,"d":"1551.90"},1530.45,{"v":1515.9,"d":"1515.90"},{"v":1587.9,"d":"1587.90"},{"v":1602.4499999999998,"d":"1602.45"},{"v":1623.9,"d":"1623.90"},1581,1545,1.37947]
[3,"ACC",1650.8,{"v":1648.2666666666667,"d":"1648.27"},{"v":1624.5333333333333,"d":"1624.53"},{"v":1598.2666666666667,"d":"1598.27"},{"v":1574.5333333333333,"d":"1574.53"},{"v":1674.5333333333333,"d":"1674.53"},{"v":1698.2666666666664,"d":"1698.27"},{"v":1724.5333333333333,"d":"1724.53"},1672,1622,6.09163]
[4,"AIAENG",1759.65,{"v":1752.5666666666666,"d":"1752.57"},{"v":1725.3333333333333,"d":"1725.33"},{"v":1691.0166666666667,"d":"1691.02"},{"v":1663.7833333333333,"d":"1663.78"},{"v":1786.8833333333332,"d":"1786.88"},{"v":1814.1166666666668,"d":"1814.12"},{"v":1848.4333333333332,"d":"1848.43"},1779.8,1718.25,0.22519]
[5,"APLAPOLLO",1417.45,{"v":1421.3166666666666,"d":"1421.32"},{"v":1392.6333333333332,"d":"1392.63"},{"v":1367.8166666666666,"d":"1367.82"},{"v":1339.1333333333332,"d":"1339.13"},{"v":1446.1333333333332,"d":"1446.13"},{"v":1474.8166666666666,"d":"1474.82"},{"v":1499.6333333333332,"d":"1499.63"},1450,1396.5,0.15771]
[6,"AUBANK",669.95,673.25,{"v":656.7,"d":"656.70"},643.45,{"v":626.9000000000001,"d":"626.90"},{"v":686.5,"d":"686.50"},703.05,{"v":716.3,"d":"716.30"},689.8,660,1.74218]
[7,"AAVAS",1585.25,{"v":1595.0333333333335,"d":"1595.03"},{"v":1550.316666666667,"d":"1550.32"},{"v":1515.3833333333334,"d":"1515.38"},{"v":1470.666666666667,"d":"1470.67"},{"v":1629.9666666666672,"d":"1629.97"},{"v":1674.6833333333338,"d":"1674.68"},{"v":1709.6166666666672,"d":"1709.62"},1639.75,1560.1,0.16189]
[8,"ADANIGREEN",52.7,{"v":52.5,"d":"52.50"},{"v":51.5,"d":"51.50"},{"v":50.3,"d":"50.30"},{"v":49.3,"d":"49.30"},{"v":53.7,"d":"53.70"},{"v":54.7,"d":"54.70"},{"v":55.900000000000006,"d":"55.90"},53.5,51.3,7.63788]
[9,"ADANIPORTS",413.85,{"v":411.76666666666665,"d":"411.77"},{"v":406.0333333333333,"d":"406.03"},{"v":398.21666666666664,"d":"398.22"},{"v":392.4833333333333,"d":"392.48"},{"v":419.5833333333333,"d":"419.58"},{"v":425.31666666666666,"d":"425.32"},{"v":433.1333333333333,"d":"433.13"},417.5,403.95,31.12368]
[10,"ADANIPOWER",67.6,{"v":67.16666666666667,"d":"67.17"},{"v":66.13333333333334,"d":"66.13"},{"v":64.66666666666667,"d":"64.67"},{"v":63.63333333333334,"d":"63.63"},{"v":68.63333333333334,"d":"68.63"},{"v":69.66666666666667,"d":"69.67"},{"v":71.13333333333334,"d":"71.13"},68.2,65.7,204.51509]
{"$rows_left_out":513}
{"sheet":"Bulk Deals","index":4,"n_rows":76,"n_cols":8,"rows_kept":76,"merged":[[4,0,4,1],[4,2,4,3],[6,1,6,2]]}
[" "]
[]
[]
[]
[]
[{"$nulls":4},"Back To Main Page"]
["Subject :","BULK DEAL",null,{"$f":"Main!B10","v":"2019-09-25"}]
[]
["Date","Scrip code","Scrip Name","Client Name","Buy / Sell","Quantity Traded","Trade Price / Wt.Avg.trade price","Exchange  "]
["2019-09-24",540697,"AMFL","TEJAS HARSHADBHAI PATEL","SELL",{"v":56000,"d":"56,000"},8.97,"BSE"]
["2019-09-24",541401,"ARIHANTINS","ASHISH HASMUKHLAL SHAH","BUY",{"v":64000,"d":"64,000"},7.37,"BSE"]
["2019-09-24",541401,"ARIHANTINS","ASHISH HASMUKHLAL SHAH","SELL",{"v":80000,"d":"80,000"},7.01,"BSE"]
["2019-09-24",539770,"DARJEELING","HIMANSHU SHAH","SELL",{"v":21600,"d":"21,600"},80.27,"BSE"]
["2019-09-24",539032,"FRASER","SHASHI GUPTA","SELL",{"v":166000,"d":"166,000"},14.05,"BSE"]
["2019-09-24",501848,"GLOBOFFS","CLEARWELL ENTERPRISES LTD","SELL",{"v":180000,"d":"180,000"},6.97,"BSE"]
["2019-09-24",538765,"JSHL","SHASHI GUPTA","BUY",{"v":190000,"d":"190,000"},12.85,"BSE"]
["2019-09-24",539679,"KAPILRAJ","SURAJ JHUNJHUNWALA","BUY",{"v":40000,"d":"40,000"},{"v":6.9,"d":"6.90"},"BSE"]
["2019-09-24",539679,"KAPILRAJ","SURAJ JHUNJHUNWALA","SELL",{"v":40000,"d":"40,000"},{"v":7,"d":"7.00"},"BSE"]
["2019-09-24",539679,"KAPILRAJ","NAVIN SHANKARLAL TANK","BUY",{"v":50000,"d":"50,000"},6.86,"BSE"]
["2019-09-24",539679,"KAPILRAJ","NAVIN SHANKARLAL TANK","SELL",{"v":50000,"d":"50,000"},7,"BSE"]
{"$rows_left_out":57}
{"sheet":"Call Tracker (Equity & F&O)","index":5,"n_rows":326,"n_cols":18,"rows_kept":326,"merged":[[120,0,121,0],[120,1,121,1],[120,9,121,9],[120,11,121,11],[120,12,121,12],[120,13,121,13],[120,14,121,14],[122,0,123,0],[122,1,123,1],[122,9,123,9],[122,11,123,11],[122,12,123,12],[122,13,123,13],[122,14,123,14],[124,0,125,0],[124,1,125,1],[124,9,125,9],[124,11,125,11],[124,12,125,12],[124,13,125,13],[124,14,125,14],[137,0,138,0],[137,1,138,1],[137,9,138,9],[137,11,138,11],[137,12,138,12],[137,13,138,13],[137,14,138,14],[141,0,142,0],[141,1,142,1],[141,9,142,9],[141,11,142,11],[141,12,142,12],[141,13,142,13],[141,14,142,14],[154,0,155,0],[154,1,155,1],[154,9,155,9],[154,11,155,11],[154,12,155,12],[154,13,155,13],[154,14,155,14]]}
[]
[]
[]
[]
[{"$nulls":12},"Back To Main Page"]
["Retail Research Technical Calls & Fundamental Performance Report for the month of September-2019 "]
[{"$nulls":12},{"$f":"Main!B10","v":"2019-09-25"}]
[null,"Positional  Call"]
["Sr.no","Date",null,"Company","Rec","Rec Price","Stop Loss***","Call Closed At","Target","Remark","Profit / Loss per Share","Gain / Loss  %","Status","Closed Date","NSE Closed Price"]
[1,"2019-08-01",null,"HDFCBANK","Buy{}",1105,{"$f":"2130/2","v":1065},1155,{"$f":"2350/2","v":1175},"Profit of Rs.50/-",{"$f":"H10-F10","v":50},{"$f":"K10/F10","v":{"v":0.04524886877828054,"d":"4.52%"}},"Successful","2019-09-20",{"$nulls":3},"H"]
[2,"2019-08-02",null,"LT","Buy{}",1350,1270,1485,1500,"Profit of Rs.135/-",135,{"v":0.1,"d":"10.00%"},"Successful","2019-09-23",{"$nulls":3},"H"]
[3,"2019-08-09",null,"TATACHEM","Buy",566,534,583.5,"620-640","Profit of Rs.17.50/-",{"$f":"H12-F12","v":17.5},{"$f":"K12/F12","v":{"v":0.030918727915194347,"d":"3.09%"}},"Successful","2019-09-05",{"$nulls":3},"H"]
[4,"2019-08-19",null,"TATAELXSI","Buy{}",635,597,681.5,"700-720","Profit of Rs.46.50/-",{"$f":"H13-F13","v":46.5},{"$f":"K13/F13","v":{"v":0.07322834645669292,"d":"7.32%"}},"Successful","2019-09-24",{"$nulls":3},"R"]
[5,"2019-08-23",null,"IOC","Buy{}",122.5,114.4,122.75,135,"Neutral",{"$f":"H14-F14","v":0.25},{"$f":"K14/F14","v":{"v":2.0408163265306124E-3,"d":"0.20%"}},"Neutral","2019-09-03",{"$nulls":3},"H"]
[6,"2019-08-30",null,"BIOCON","Buy{}",229.5,214.3,237,"255-260","Part Profit of Rs.7.5/-",{"$f":"H15-F15","v":7.5},{"$f":"K15/F15","v":{"v":0.032679738562091505,"d":"3.27%"}},"Successful","2019-08-30",{"$f":"VLOOKUP(D15,Sheet2!A38:M1677,6,0)","v":224.4},null,null,"R"]
[7,"2019-09-03",null,"POWERGRID","Buy{}",198,186,208.5,"220-224","Profit of Rs.10.5/-",10.5,{"v":0.05303030303030303,"d":"5.30%"},"Successful","2019-09-20",{"$nulls":3},"R"]
[8,"2019-09-04",null,"JUSTDIAL","Buy{}",709.5,673,703.75,"775-785","Neutral",{"$f":"H17-F17","v":-5.75},{"$f":"K17/F17","v":{"v":-0.00810429880197322,"d":"-0.81%"}},"Neutral","2019-09-20",{"$nulls":3},"R"]
[9,"2019-09-09",null,"TATAGLOBAL","Buy",266,256,255,"281-285","Loss of Rs.11/-",-11,{"v":-0.041353383458646614,"d":"-4.14%"},"Unsuccessful","2019-09-18",{"$nulls":3},"R"]
[10,"2019-09-09",null,"TORNTPHARM","Sell","1710-1720",1808,null,"1560-1540","Open",{"$nulls":4},{"$f":"VLOOKUP(D19,Sheet2!A34:M1673,6,0)","v":1697.95},null,null,"R"]
[11,"2019-09-11",null,"LICHSGFIN","Buy{}",400.5,379,431,"440-450","Profit of Rs.30.50/-",{"$f":"H20-F20","v":30.5},{"$f":"K20/F20","v":{"v":0.07615480649188515,"d":"7.62%"}},"Successful","2019-09-23",{"$nulls":3},"H"]
{"$rows_left_out":307}
{"sheet":"Sheet2","index":6,"n_rows":1899,"n_cols":14,"rows_kept":1899,"hidden":true}
["SYMBOL","SERIES","OPEN","HIGH","LOW","CLOSE","LAST","PREVCLOSE","TOTTRDQTY","TOTTRDVAL","TIMESTAMP","TOTALTRADES","ISIN","ISIN"]
["20MICRONS","EQ",38.45,38.45,37.5,37.55,37.6,37.55,20502,771359.65,"2019-09-24",180,"INE144J01027"]
["21STCENMGM","EQ",12.5,12.5,12.1,12.2,12.2,12.3,300,3686,"2019-09-24",4,"INE253B01015"]
["3IINFOTECH","EQ",2.15,2.2,2.1,2.2,2.2,2.15,557084,1210609.25,"2019-09-24",339,"INE748C01020"]
["3MINDIA","EQ",20450,20699.95,19600,19722.3,19686.55,20379.15,2556,50951993.6,"2019-09-24",1309,"INE470A01017"]
["5PAISA","EQ",156.5,156.65,155,156.65,156.65,149.2,2380,372701.45,"2019-09-24",45,"INE618L01018"]
["63MOONS","EQ",146.35,146.95,135.35,137.55,135.35,142.45,383130,54332289,"2019-09-24",5057,"INE111B01023"]
["A2ZINFRA","EQ",11,11.1,10.35,11,10.95,10.65,312758,3374926.45,"2019-09-24",542,"INE619I01012"]
["AARTIDRUGS","EQ",480,487.95,466,482.9,482,478.95,9392,4494658.2,"2019-09-24",954,"INE767A01016"]
["AARTIIND","EQ",1687,1687,1632.65,1637.8,1642,1674.15,60505,100112782.4,"2019-09-24",7389,"INE769A01020"]
["AARVEEDEN","EQ",17.8,18.4,16.65,17.45,17.8,18.3,2831,49342.6,"2019-09-24",82,"INE273D01019"]
["AAVAS","EQ",1609,1639.75,1560.1,1585.25,1580,1601.35,16189,25719667.25,"2019-09-24",3387,"INE216P01012"]
["ABAN","EQ",31,31.65,30.6,30.6,30.6,32.2,70356,2164839.55,"2019-09-24",551,"INE421A01028"]
["ABB","EQ",1570,1581,1545,1573.35,1567,1553.25,137947,216160390.25,"2019-09-24",9512,"INE117A01022"]
["ABBOTINDIA","EQ",10750,10988.8,10750,10807.45,10850,10716.3,6799,73582140.7,"2019-09-24",1806,"INE358A01014"]
["ABCAPITAL","EQ",93.35,95,90.65,90.85,90.95,93.2,1394289,128197980.25,"2019-09-24",9720,"INE674K01013"]
["ABFRL","EQ",216,216,206.55,211.45,210.6,213.55,371500,78459253.4,"2019-09-24",6905,"INE647O01011"]
["ABMINTLTD","BE",13.9,13.9,13.9,13.9,13.9,14.6,50,695,"2019-09-24",2,"INE251C01017"]
["ABSLNN50ET","EQ",279.6,279.6,277.92,278.52,278.52,280.78,571,159079.07,"2019-09-24",6,"INF209KB1B87"]
["ACC","EQ",1670,1672,1622,1650.8,1652,1675.75,609163,1002447504.1,"2019-09-24",27704,"INE012A01025"]
{"$rows_left_out":1701}
{"sheet":"Sheet1","index":7,"n_rows":0,"n_cols":0,"rows_kept":0,"hidden":true}

{"sheet":"Sheet3","index":8,"n_rows":0,"n_cols":0,"rows_kept":0,"hidden":true}

{"sheet":"Sheet4","index":9,"n_rows":0,"n_cols":0,"rows_kept":0,"hidden":true}

{"sheet":"Sheet5","index":10,"n_rows":0,"n_cols":0,"rows_kept":0,"hidden":true}