{"text_format":"3","workbook":"xlsx","n_sheets":10,"sheets":["Main","Future Intra","Cash Intra","MidCap Intra","Bulk Deals","Call Tracker (Equity & F&O)","Sheet2","Sheet1","Sheet3","Sheet4"],"not_rendered":{"images":4,"external_links":1,"defined_names":4},"read":"whole","date_system":"1900"}

{"sheet":"Main","index":0,"n_rows":27,"n_cols":11,"rows_kept":27}
[null,"                                                                                                 "]
{"$rows_empty":8}
[null,"2019-06-25"]
[]
[null,"Sheet No.","Template Name","Summary"]
[null,1,"Future Intra","For Intraday trading in F&O segment"]
[null,2,"Cash Intra","For Intraday trading in cash market segment"]
[null,3,"Mid-cap Intra","For Intraday trading in Mid-cap stocks"]
[null,4,"Bulk Deals","Reveals Bulk Deals carried on NSE & BSE"]
[null,5,"Call Tracker"]
{"$rows_empty":9}
[{"$nulls":10},"`"]

{"sheet":"Future Intra","index":1,"n_rows":236,"n_cols":15,"rows_kept":236,"merged":[[8,0,9,0],[8,1,9,1],[8,2,9,2],[8,5,8,7],[8,8,8,10]]}
[]
[]
[]
[]
[{"$nulls":12},"Back to Main Page"]
["FOR INTRA DAY TRADING",{"$nulls":10},{"$f":"Main!B10","v":"2019-06-25"}]
[]
[]
["Sr.no","Sector","Scrip","CLOSE RATE","Pivot Point","Supports",null,null,"Resistances"]
[null,"Sector",null,"Point","Point","S1","S2","S3","R1","R2","R3","HIGH","LOW","OI","% Change in OI"]
[1,"Index","BANKNIFTY",30631.25,{"v":30644.3,"d":"30644.30"},{"v":30520.6,"d":"30520.60"},30409.95,30286.25,{"v":30754.949999999997,"d":"30754.95"},30878.65,{"v":30989.299999999996,"d":"30989.30"},30768,30533.65,2230620,{"v":0.016218531038441564,"d":"1.62%"}]
[2,"Index","NIFTY",11717.15,{"v":11726.716666666667,"d":"11726.72"},{"v":11671.433333333334,"d":"11671.43"},{"v":11625.716666666667,"d":"11625.72"},{"v":11570.433333333334,"d":"11570.43"},{"v":11772.433333333334,"d":"11772.43"},{"v":11827.716666666667,"d":"11827.72"},{"v":11873.433333333334,"d":"11873.43"},11782,11681,22070175,{"v":0.026808706636053403,"d":"2.68%"}]
[3,"Index","NIFTYIT",{"v":16186,"d":"16186.00"},{"v":16275.333333333334,"d":"16275.33"},{"v":16062.666666666668,"d":"16062.67"},{"v":15939.333333333334,"d":"15939.33"},{"v":15726.666666666668,"d":"15726.67"},{"v":16398.666666666668,"d":"16398.67"},{"v":16611.333333333336,"d":"16611.33"},{"v":16734.666666666668,"d":"16734.67"},16488,16152,12800,{"v":-0.03759398496240601,"d":"-3.76%"}]
[4,"Cement","ACC",{"v":1539.8,"d":"1539.80"},1537.05,{"v":1522.8999999999999,"d":"1522.90"},{"v":1506,"d":"1506.00"},1491.85,{"v":1553.9499999999998,"d":"1553.95"},{"v":1568.1,"d":"1568.10"},{"v":1584.9999999999998,"d":"1585.00"},1551.2,1520.15,2766400,{"v":-0.04554236820314656,"d":"-4.55%"}]
[5,"Others","ADANIENT",147.95,147.15,{"v":145.35000000000002,"d":"145.35"},{"v":142.75000000000003,"d":"142.75"},{"v":140.95000000000005,"d":"140.95"},149.75,151.55,{"v":154.14999999999998,"d":"154.15"},148.95,144.55,32380000,{"v":0.01593875502008032,"d":"1.59%"}]
[6,"Others","ADANIPORTS",{"v":407.1,"d":"407.10"},{"v":405.6333333333334,"d":"405.63"},{"v":402.51666666666677,"d":"402.52"},{"v":397.9333333333334,"d":"397.93"},{"v":394.8166666666668,"d":"394.82"},{"v":410.21666666666675,"d":"410.22"},{"v":413.3333333333334,"d":"413.33"},{"v":417.91666666666674,"d":"417.92"},408.75,401.05,22372500,{"v":0.028975508796136598,"d":"2.90%"}]
[7,"Power","ADANIPOWER",{"v":50.1,"d":"50.10"},{"v":49.23333333333333,"d":"49.23"},{"v":48.066666666666656,"d":"48.07"},{"v":46.03333333333333,"d":"46.03"},{"v":44.86666666666666,"d":"44.87"},{"v":51.26666666666665,"d":"51.27"},{"v":52.43333333333332,"d":"52.43"},{"v":54.46666666666665,"d":"54.47"},50.4,47.2,172880000,{"v":0.2267953448765257,"d":"22.68%"}]
[8,"Pharma","AJANTPHARM",958.95,{"v":952.0500000000001,"d":"952.05"},{"v":940.0000000000001,"d":"940.00"},{"v":921.0500000000001,"d":"921.05"},{"v":909.0000000000001,"d":"909.00"},{"v":971.0000000000001,"d":"971.00"},{"v":983.0500000000001,"d":"983.05"},{"v":1002.0000000000001,"d":"1002.00"},964.1,933.1,283500,{"v":-0.16371681415929204,"d":"-16.37%"}]
[9,"Banking","ALBK",40.65,{"v":40.666666666666664,"d":"40.67"},{"v":40.23333333333333,"d":"40.23"},{"v":39.81666666666666,"d":"39.82"},{"v":39.383333333333326,"d":"39.38"},{"v":41.08333333333333,"d":"41.08"},{"v":41.516666666666666,"d":"41.52"},{"v":41.93333333333333,"d":"41.93"},41.1,40.25,11882000,{"v":-0.043933054393305436,"d":"-4.39%"}]
[10,"Automobile","AMARAJABAT",600.95,{"v":601.3833333333333,"d":"601.38"},{"v":595.6166666666667,"d":"595.62"},{"v":590.2833333333333,"d":"590.28"},{"v":584.5166666666667,"d":"584.52"},{"v":606.7166666666667,"d":"606.72"},{"v":612.4833333333333,"d":"612.48"},{"v":617.8166666666667,"d":"617.82"},607.15,596.05,1447600,{"v":0.07989556135770234,"d":"7.99%"}]
{"$rows_left_out":207}
{"sheet":"Cash Intra","index":2,"n_rows":247,"n_cols":13,"rows_kept":247,"merged":[[7,0,8,0],[7,1,8,1],[7,2,8,2],[7,3,8,3],[7,4,7,6],[7,7,7,9]]}
[]
[]
[]
[]
[{"$nulls":12},"Back to Main Page"]
["FOR INTRA DAY TRADING",{"$nulls":9},{"$f":"Main!B10","v":"2019-06-25"}]
[]
["Sr.no","Scrip","CLOSE RATE","Pivot Point","Supports",null,null,"Resistances"]
[null,null,"Point",null,"S1","S2","S3","R1","R2","R3","HIGH","LOW","Total Trade Quanity in Lakhs"]
[1,"Nifty 50",11699.65,{"v":11707.950000000003,"d":"11707.95"},{"v":11661.900000000005,"d":"11661.90"},{"v":11624.150000000003,"d":"11624.15"},{"v":11578.100000000006,"d":"11578.10"},{"v":11745.700000000004,"d":"11745.70"},{"v":11791.750000000004,"d":"11791.75"},{"v":11829.500000000004,"d":"11829.50"},11754,11670.2]
[2,"Nifty Bank",30602.05,{"v":30637.899999999998,"d":"30637.90"},{"v":30492.149999999994,"d":"30492.15"},{"v":30382.249999999996,"d":"30382.25"},{"v":30236.499999999993,"d":"30236.50"},{"v":30747.799999999996,"d":"30747.80"},{"v":30893.550000000003,"d":"30893.55"},{"v":31003.449999999997,"d":"31003.45"},30783.65,30528]
[3,"Nifty CPSE",2324.25,{"v":2326.9,"d":"2326.90"},{"v":2314.4,"d":"2314.40"},2304.55,2292.05,2336.75,2349.25,{"v":2359.1,"d":"2359.10"},2339.4,2317.05]
[4,"Nifty Infra",3315.25,{"v":3318.0833333333335,"d":"3318.08"},{"v":3303.716666666667,"d":"3303.72"},{"v":3292.183333333334,"d":"3292.18"},{"v":3277.8166666666675,"d":"3277.82"},{"v":3329.616666666667,"d":"3329.62"},{"v":3343.9833333333327,"d":"3343.98"},{"v":3355.5166666666664,"d":"3355.52"},3332.45,3306.55]
[5,"Nifty IT",16187.4,{"v":16187.133333333333,"d":"16187.13"},{"v":16142.666666666666,"d":"16142.67"},{"v":16097.933333333332,"d":"16097.93"},{"v":16053.466666666665,"d":"16053.47"},{"v":16231.866666666667,"d":"16231.87"},{"v":16276.333333333334,"d":"16276.33"},{"v":16321.066666666668,"d":"16321.07"},16231.6,16142.4]
[6,"Nifty PSE",3580.15,{"v":3583.7333333333336,"d":"3583.73"},{"v":3563.666666666667,"d":"3563.67"},{"v":3547.1833333333334,"d":"3547.18"},{"v":3527.116666666667,"d":"3527.12"},{"v":3600.216666666667,"d":"3600.22"},{"v":3620.2833333333338,"d":"3620.28"},{"v":3636.7666666666673,"d":"3636.77"},3603.8,3567.25]
[7,"Nifty Midcap 50",4802.95,{"v":4804.5,"d":"4804.50"},4784.95,4766.95,{"v":4747.4,"d":"4747.40"},{"v":4822.5,"d":"4822.50"},{"v":4842.049999999999,"d":"4842.05"},4860.05,4824.05,4786.5]
[8,"ABB",1560.9,{"v":1561.3,"d":"1561.30"},{"v":1549.6,"d":"1549.60"},{"v":1538.3,"d":"1538.30"},{"v":1526.6,"d":"1526.60"},{"v":1572.6,"d":"1572.60"},{"v":1584.3000000000002,"d":"1584.30"},{"v":1595.6,"d":"1595.60"},1573,1550,0.73029]
[9,"ACC",1537.6,{"v":1535.9666666666665,"d":"1535.97"},{"v":1519.083333333333,"d":"1519.08"},{"v":1500.5666666666666,"d":"1500.57"},{"v":1483.6833333333332,"d":"1483.68"},{"v":1554.483333333333,"d":"1554.48"},{"v":1571.3666666666666,"d":"1571.37"},{"v":1589.8833333333328,"d":"1589.88"},1552.85,1517.45,5.36701]
[10,"AUBANK",692.7,{"v":697.5333333333333,"d":"697.53"},{"v":681.1666666666666,"d":"681.17"},{"v":669.6333333333333,"d":"669.63"},{"v":653.2666666666667,"d":"653.27"},{"v":709.0666666666666,"d":"709.07"},{"v":725.4333333333334,"d":"725.43"},{"v":736.9666666666666,"d":"736.97"},713.9,686,2.39944]
[11,"ADANIPORTS",406,{"v":404.40000000000003,"d":"404.40"},{"v":401.4000000000001,"d":"401.40"},{"v":396.80000000000007,"d":"396.80"},{"v":393.8000000000001,"d":"393.80"},{"v":409.00000000000006,"d":"409.00"},{"v":411.99999999999994,"d":"412.00"},{"v":416.6,"d":"416.60"},407.4,399.8,25.8274]
{"$rows_left_out":228}
{"sheet":"MidCap Intra","index":3,"n_rows":545,"n_cols":13,"rows_kept":545,"merged":[[0,0,0,1],[8,0,9,0],[8,1,9,1],[8,2,9,2],[8,3,9,3],[8,4,8,6],[8,7,8,9]]}
[]
[]
[]
[]
[{"$nulls":11},"Back To Main Page"]
["FOR INTRA DAY TRADING",{"$nulls":9},{"$f":"Main!B10","v":"2019-06-25"}]
[null,null," "]
[]
["Sr.no","Scrip","CLOSE RATE","Pivot Point","Supports",null,null,"Resistances"]
[null,null,"Point",null,"S1","S2","S3","R1","R2","R3","HIGH","LOW","Total Trade Quanity in Lakhs"]
[1,"3MINDIA",23779.1,{"v":23626.316666666666,"d":"23626.32"},{"v":23272.783333333333,"d":"23272.78"},{"v":22766.466666666667,"d":"22766.47"},{"v":22412.933333333334,"d":"22412.93"},{"v":24132.63333333333,"d":"24132.63"},{"v":24486.166666666664,"d":"24486.17"},{"v":24992.48333333333,"d":"24992.48"},23979.85,23120,0.02765]
[2,"ABB",1560.9,{"v":1561.3,"d":"1561.30"},{"v":1549.6,"d":"1549.60"},{"v":1538.3,"d":"1538.30"},{"v":1526.6,"d":"1526.60"},{"v":1572.6,"d":"1572.60"},{"v":1584.3000000000002,"d":"1584.30"},{"v":1595.6,"d":"1595.60"},1573,1550,0.73029]
[3,"ACC",1537.6,{"v":1535.9666666666665,"d":"1535.97"},{"v":1519.083333333333,"d":"1519.08"},{"v":1500.5666666666666,"d":"1500.57"},{"v":1483.6833333333332,"d":"1483.68"},{"v":1554.483333333333,"d":"1554.48"},{"v":1571.3666666666666,"d":"1571.37"},{"v":1589.8833333333328,"d":"1589.88"},1552.85,1517.45,5.36701]
[4,"AIAENG",1748.55,{"v":1743.5166666666667,"d":"1743.52"},{"v":1730.0333333333333,"d":"1730.03"},{"v":1711.5166666666667,"d":"1711.52"},{"v":1698.0333333333333,"d":"1698.03"},{"v":1762.0333333333333,"d":"1762.03"},{"v":1775.5166666666664,"d":"1775.52"},{"v":1794.0333333333333,"d":"1794.03"},1757,1725,0.07702]
[5,"APLAPOLLO",1513.65,{"v":1524.2166666666665,"d":"1524.22"},{"v":1499.433333333333,"d":"1499.43"},{"v":1485.2166666666665,"d":"1485.22"},{"v":1460.433333333333,"d":"1460.43"},{"v":1538.433333333333,"d":"1538.43"},{"v":1563.2166666666662,"d":"1563.22"},{"v":1577.433333333333,"d":"1577.43"},1549,1510,0.08229]
[6,"AUBANK",692.7,{"v":697.5333333333333,"d":"697.53"},{"v":681.1666666666666,"d":"681.17"},{"v":669.6333333333333,"d":"669.63"},{"v":653.2666666666667,"d":"653.27"},{"v":709.0666666666666,"d":"709.07"},{"v":725.4333333333334,"d":"725.43"},{"v":736.9666666666666,"d":"736.97"},713.9,686,2.39944]
[7,"AAVAS",1473.25,{"v":1463.0833333333333,"d":"1463.08"},{"v":1436.1666666666665,"d":"1436.17"},{"v":1399.0833333333333,"d":"1399.08"},{"v":1372.1666666666665,"d":"1372.17"},{"v":1500.1666666666665,"d":"1500.17"},{"v":1527.083333333333,"d":"1527.08"},{"v":1564.1666666666665,"d":"1564.17"},1490,1426,0.09466]
[8,"ADANIGREEN",41.15,{"v":41.083333333333336,"d":"41.08"},{"v":40.51666666666667,"d":"40.52"},{"v":39.88333333333334,"d":"39.88"},{"v":39.31666666666668,"d":"39.32"},{"v":41.71666666666667,"d":"41.72"},{"v":42.28333333333333,"d":"42.28"},{"v":42.916666666666664,"d":"42.92"},41.65,40.45,3.29432]
[9,"ADANIPORTS",406,{"v":404.40000000000003,"d":"404.40"},{"v":401.4000000000001,"d":"401.40"},{"v":396.80000000000007,"d":"396.80"},{"v":393.8000000000001,"d":"393.80"},{"v":409.00000000000006,"d":"409.00"},{"v":411.99999999999994,"d":"412.00"},{"v":416.6,"d":"416.60"},407.4,399.8,25.8274]
[10,"ADANIPOWER",50.15,{"v":49.26666666666667,"d":"49.27"},{"v":48.033333333333346,"d":"48.03"},{"v":45.91666666666667,"d":"45.92"},{"v":44.683333333333344,"d":"44.68"},{"v":51.38333333333335,"d":"51.38"},{"v":52.61666666666668,"d":"52.62"},{"v":54.73333333333335,"d":"54.73"},50.5,47.15,153.02455]
{"$rows_left_out":513}
{"sheet":"Bulk Deals","index":4,"n_rows":98,"n_cols":8,"rows_kept":98,"merged":[[4,0,4,1],[4,2,4,3],[6,1,6,2]]}
[" "]
[]
[]
[]
[]
[{"$nulls":4},"Back To Main Page"]
["Subject :","BULK DEAL",null,{"$f":"Main!B10","v":"2019-06-25"}]
[]
["Date","Scrip code","Scrip Name","Client Name","Buy / Sell","Quantity Traded","Trade Price / Wt.Avg.trade price","Exchange  "]
["2019-06-24",530245,"ARYAMAN","VIPUL HARIDAS THAKKAR","SELL",{"v":70000,"d":"70,000"},{"v":48,"d":"48.00"},"BSE"]
["2019-06-24",537766,"BCP","KAMALESH SHANTILALJI JAIN","BUY",{"v":366872,"d":"366,872"},39.41,"BSE"]
["2019-06-24",537766,"BCP","BON LON SECURITIES LTD","SELL",{"v":1000000,"d":"1,000,000"},40.29,"BSE"]
["2019-06-24",540789,"DNAMEDIA","FINDSTONE INTERNET P LTD","BUY",{"v":1000000,"d":"1,000,000"},0.59,"BSE"]
["2019-06-24",540789,"DNAMEDIA","VINAY R SOMANI","SELL",{"v":1000000,"d":"1,000,000"},0.59,"BSE"]
["2019-06-24",531162,"EMAMILTD","AMITABH GOENKA","SELL",{"v":3000000,"d":"3,000,000"},274.77,"BSE"]
["2019-06-24",531162,"EMAMILTD","RAVIRAJ VINIYOG PRIVATE LIMITED","SELL",{"v":3640000,"d":"3,640,000"},270,"BSE"]
["2019-06-24",531162,"EMAMILTD","SURAJ VINIYOG PVT LTD","SELL",{"v":3640000,"d":"3,640,000"},{"v":270,"d":"270.00"},"BSE"]
["2019-06-24",531162,"EMAMILTD","PRABHAKAR VINIYOG PRIVATE LIMITED","SELL",{"v":3640000,"d":"3,640,000"},{"v":272,"d":"272.00"},"BSE"]
["2019-06-24",531162,"EMAMILTD","TMT VINIYOGAN LIMITED","SELL",{"v":6000000,"d":"6,000,000"},271.68,"BSE"]
["2019-06-24",531162,"EMAMILTD","BHANU VYAPAAR PRIVATE LIMITED","SELL",{"v":7280000,"d":"7,280,000"},270.15,"BSE"]
{"$rows_left_out":79}
{"sheet":"Call Tracker (Equity & F&O)","index":5,"n_rows":327,"n_cols":20,"rows_kept":327,"merged":[[116,0,117,0],[116,1,117,1],[116,9,117,9],[116,11,117,11],[116,12,117,12],[116,13,117,13],[116,14,117,14]]}
[]
[]
[]
[]
[{"$nulls":12},"Back To Main Page"]
["Retail Research Technical Calls & Fundamental Performance Report for the month of June-2019 "]
[{"$nulls":12},{"$f":"Main!B10","v":"2019-06-25"}]
[null,"Positional  Call"]
["Sr.no","Date",null,"Company","Rec","Rec Price","Stop Loss***","Call Closed At","Target","Remark","Profit / Loss per Share","Gain / Loss  %","Status","Closed Date","NSE Closed Price"]
[1,"2019-04-23",null,"DMART","Buy",1305,1265,1350,"1470-1500","Part Profit of Rs.45/-",{"$f":"H10-F10","v":45},{"$f":"K10/F10","v":{"v":0.034482758620689655,"d":"3.45%"}},"Successful","2019-05-24",{"$f":"VLOOKUP(D10,Sheet2!A45:M1840,6,0)","v":1329.2},null,null,"R"]
[2,"2019-05-08",null,"COLPAL","Buy",1137,1081,1185,1242," Profit of Rs.48/-",{"$f":"H11-F11","v":48},{"$f":"K11/F11","v":{"v":0.04221635883905013,"d":"4.22%"}},"Successful","2019-06-14",{"$nulls":3},"H"]
[3,"2019-05-20",null,"TCS","Buy",2112,2195,2221,2405,"  Profit of Rs.109/-",{"$f":"H12-F12","v":109},{"$f":"K12/F12","v":{"v":0.05160984848484849,"d":"5.16%"}},"Successful","2019-06-10",{"$nulls":3},"H"]
[4,"2019-05-24",null,"SBIN","Sell",351,372,336.5,"320-310","  Profit of Rs.14.5/-",{"$f":"F13-H13","v":14.5},{"v":0.04131054131054131,"d":"4.13%"},"Successful","2019-06-06",{"$nulls":3},"H"]
[5,"2019-05-27",null,"GRASIM","Sell",927.5,972.6,862.5,"840-820","  Profit of Rs.65/-",{"$f":"F14-H14","v":65},{"$f":"K14/F14","v":{"v":0.07008086253369272,"d":"7.01%"}},"Successful","2019-06-06",{"$nulls":3},"R"]
[6,"2019-05-27",null,"TATAELXSI","Buy","870-878",818.7,null,"970-990","Open",{"$nulls":4},{"$f":"VLOOKUP(D15,Sheet2!A50:M1845,6,0)","v":851.6},null,null,"R"]
[7,"2019-05-28",null,"ASTRAZEN","Buy",2030,1883.3,1883.3,"2310-2330","Loss of Rs. 146.7/-",{"$f":"H16-F16","v":-146.70000000000005},{"$f":"K16/F16","v":{"v":-0.07226600985221678,"d":"-7.23%"}},"UnSuccessful","2019-06-06",{"$nulls":3},"R"]
[8,"2019-05-28",null,"BAJAJFINSV","Sell","8150-8200",8625,null,7300,"Open",{"$nulls":4},{"$f":"VLOOKUP(D17,Sheet2!A54:M1849,6,0)","v":8354.65},null,null,"H"]
[9,"2019-05-28",null,"CEATLTD","Buy",1000,945,960,"1100-1120","Loss of Rs. 40/-",-40,{"v":-0.04,"d":"-4.00%"},"UnSuccessful","2019-06-11",{"$nulls":3},"H"]
[10,"2019-05-30",null,"ENDURANCE","Buy",1205,1128,1127.5,1350,"Loss of Rs. 77.5/-",-77.5,{"v":-0.06431535269709543,"d":"-6.43%"},"UnSuccessful","2019-06-24",{"$nulls":3},"H"]
[11,"2019-05-31",null,"BALKRISIND","Buy",802.5,748,760,900,"Loss of Rs. 42.5/-",{"$f":"H20-F20","v":-42.5},{"$f":"K20/F20","v":{"v":-0.0529595015576324,"d":"-5.30%"}},"UnSuccessful","2019-06-17",{"$nulls":3},"H"]
{"$rows_left_out":283}
{"sheet":"Sheet2","index":6,"n_rows":1641,"n_cols":14,"rows_kept":1641,"hidden":true}
["SYMBOL","SERIES","OPEN","HIGH","LOW","CLOSE","LAST","PREVCLOSE","TOTTRDQTY","TOTTRDVAL","TIMESTAMP","TOTALTRADES","ISIN","ISIN"]
["20MICRONS","EQ",35.2,36.5,35,35.85,35.6,35.2,11223,400147,"2019-06-24",160,"INE144J01027"]
["21STCENMGM","EQ",17.65,18.25,17.65,18.25,18.25,18,1313,23631.5,"2019-06-24",22,"INE253B01015"]
["3IINFOTECH","EQ",3.25,3.3,3.15,3.2,3.2,3.3,1471211,4743511.1,"2019-06-24",504,"INE748C01020"]
["3MINDIA","EQ",23700,23979.85,23120,23779.1,23511,23529.6,2765,65940300.25,"2019-06-24",820,"INE470A01017"]
["3PLAND","BE",8.4,8.8,8.4,8.8,8.8,8.4,93,806.4,"2019-06-24",3,"INE105C01023"]
["5PAISA","EQ",207.1,207.1,198.3,203.4,203.2,206.8,2951,604461.3,"2019-06-24",222,"INE618L01018"]
["63MOONS","EQ",117,120.8,113.55,115.7,114.8,116.7,128950,15237180.35,"2019-06-24",2457,"INE111B01023"]
["8KMILES","EQ",80.65,80.65,80.65,80.65,80.65,76.85,14089,1136277.85,"2019-06-24",88,"INE650K01021"]
["A2ZINFRA","EQ",13.45,13.65,13,13.35,13.45,13.05,128186,1715272.5,"2019-06-24",505,"INE619I01012"]
["AARTIDRUGS","EQ",515.2,539.35,515.2,530,531,516.35,12170,6434856,"2019-06-24",1850,"INE767A01016"]
["AARTIIND","EQ",1774.6,1812.35,1766,1803.2,1805,1764.4,130258,233313522.5,"2019-06-24",14743,"INE769A01020"]
["AARVEEDEN","EQ",21.65,21.65,20.25,21.5,21.65,21.05,3473,73145.8,"2019-06-24",82,"INE273D01019"]
["AAVAS","EQ",1426,1490,1426,1473.25,1468,1451.05,9466,13864345.9,"2019-06-24",1826,"INE216P01012"]
["ABAN","BE",36.85,37.05,35,37,36.95,35.3,68392,2496948,"2019-06-24",785,"INE421A01028"]
["ABB","EQ",1560.15,1573,1550,1560.9,1551.3,1559.05,73029,113931886.5,"2019-06-24",5020,"INE117A01022"]
["ABBOTINDIA","EQ",8545,8764.9,8504.15,8541.85,8539.95,8504.15,6256,53883405.25,"2019-06-24",1386,"INE358A01014"]
["ABCAPITAL","EQ",93.45,94,91.8,92.15,91.95,93.45,693298,64218019.9,"2019-06-24",8459,"INE674K01013"]
["ABFRL","EQ",210.1,211.6,206,207.7,207,210.35,165305,34382570.65,"2019-06-24",9356,"INE647O01011"]
["ABSLNN50ET","EQ",272,272,268.05,268.05,268.05,270.78,5,1352.05,"2019-06-24",3,"INF209KB1B87"]
{"$rows_left_out":1622}
{"sheet":"Sheet1","index":7,"n_rows":0,"n_cols":0,"rows_kept":0,"hidden":true}

{"sheet":"Sheet3","index":8,"n_rows":0,"n_cols":0,"rows_kept":0,"hidden":true}

{"sheet":"Sheet4","index":9,"n_rows":0,"n_cols":0,"rows_kept":0,"hidden":true}