{"text_format":"3","workbook":"xlsx","n_sheets":11,"sheets":["Main","Future Intra","Cash Intra","MidCap Intra","Bulk Deals","Call Tracker (Equity & F&O)","Sheet2","Sheet1","Sheet3","Sheet4","Sheet5"],"not_rendered":{"images":4,"defined_names":5},"read":"whole","date_system":"1900"}

{"sheet":"Main","index":0,"n_rows":27,"n_cols":11,"rows_kept":27}
[null,"                                                                                                 "]
{"$rows_empty":8}
[null,"2019-10-23"]
[]
[null,"Sheet No.","Template Name","Summary"]
[null,1,"Future Intra","For Intraday trading in F&O segment"]
[null,2,"Cash Intra","For Intraday trading in cash market segment"]
[null,3,"Mid-cap Intra","For Intraday trading in Mid-cap stocks"]
[null,4,"Bulk Deals","Reveals Bulk Deals carried on NSE & BSE"]
[null,5,"Call Tracker"]
{"$rows_empty":9}
[{"$nulls":10},"`"]

{"sheet":"Future Intra","index":1,"n_rows":193,"n_cols":15,"rows_kept":193,"merged":[[8,0,9,0],[8,1,9,1],[8,2,9,2],[8,5,8,7],[8,8,8,10]]}
[]
[]
[]
[]
[{"$nulls":12},"Back to Main Page"]
["FOR INTRA DAY TRADING",{"$nulls":10},{"$f":"Main!B10","v":"2019-10-23"}]
[]
[]
["Sr.no","Sector","Scrip","CLOSE RATE","Pivot Point","Supports",null,null,"Resistances"]
[null,"Sector",null,"Point","Point","S1","S2","S3","R1","R2","R3","HIGH","LOW","OI","% Change in OI"]
[1,"Index","BANKNIFTY",{"v":29492.5,"d":"29492.50"},{"v":29363.63333333333,"d":"29363.63"},{"v":28980.266666666663,"d":"28980.27"},{"v":28468.033333333333,"d":"28468.03"},{"v":28084.666666666664,"d":"28084.67"},{"v":29875.86666666666,"d":"29875.87"},{"v":30259.23333333333,"d":"30259.23"},{"v":30771.46666666666,"d":"30771.47"},29747,28851.4,1454920,{"v":-4.515846515955991E-3,"d":"-0.45%"}]
[2,"Index","NIFTY",11624.35,{"v":11647.866666666667,"d":"11647.87"},{"v":11580.733333333334,"d":"11580.73"},{"v":11537.116666666667,"d":"11537.12"},{"v":11469.983333333334,"d":"11469.98"},{"v":11691.483333333334,"d":"11691.48"},{"v":11758.616666666669,"d":"11758.62"},{"v":11802.233333333334,"d":"11802.23"},11715,11604.25,16724550,{"v":0.0927810801672049,"d":"9.28%"}]
[3,"Index","NIFTYIT",{"v":14740,"d":"14740.00"},{"v":14886.333333333334,"d":"14886.33"},{"v":14573.666666666668,"d":"14573.67"},{"v":14407.333333333334,"d":"14407.33"},{"v":14094.666666666668,"d":"14094.67"},{"v":15052.666666666668,"d":"15052.67"},{"v":15365.333333333336,"d":"15365.33"},{"v":15531.666666666668,"d":"15531.67"},15199,14720,24700,{"v":1.008130081300813,"d":"100.81%"}]
[4,"Cement","ACC",{"v":1539.3,"d":"1539.30"},{"v":1543.1333333333332,"d":"1543.13"},{"v":1523.9666666666665,"d":"1523.97"},{"v":1508.6333333333332,"d":"1508.63"},{"v":1489.4666666666665,"d":"1489.47"},{"v":1558.4666666666665,"d":"1558.47"},{"v":1577.6333333333334,"d":"1577.63"},{"v":1592.9666666666665,"d":"1592.97"},1562.3,1527.8,2156400,{"v":-0.030918569117382708,"d":"-3.09%"}]
[5,"Others","ADANIENT",179.25,{"v":177.98333333333335,"d":"177.98"},{"v":175.3666666666667,"d":"175.37"},{"v":171.48333333333335,"d":"171.48"},{"v":168.8666666666667,"d":"168.87"},{"v":181.8666666666667,"d":"181.87"},{"v":184.48333333333338,"d":"184.48"},{"v":188.3666666666667,"d":"188.37"},180.6,174.1,32300000,{"v":0.007611679560768655,"d":"0.76%"}]
[6,"Others","ADANIPORTS",421.85,422.95,{"v":416.9,"d":"416.90"},411.95,{"v":405.9,"d":"405.90"},{"v":427.9,"d":"427.90"},{"v":433.95000000000005,"d":"433.95"},{"v":438.9,"d":"438.90"},429,418,11990000,{"v":-0.01600328272466147,"d":"-1.60%"}]
[7,"Power","ADANIPOWER",63.25,63.75,62.45,{"v":61.650000000000006,"d":"61.65"},{"v":60.35000000000001,"d":"60.35"},64.55,{"v":65.85000000000001,"d":"65.85"},{"v":66.64999999999999,"d":"66.65"},65.05,62.95,87600000,{"v":0.01014760147601476,"d":"1.01%"}]
[8,"Automobile","AMARAJABAT",{"v":676.7,"d":"676.70"},{"v":674.5333333333333,"d":"674.53"},{"v":666.4166666666666,"d":"666.42"},{"v":656.1333333333333,"d":"656.13"},{"v":648.0166666666667,"d":"648.02"},{"v":684.8166666666666,"d":"684.82"},{"v":692.9333333333334,"d":"692.93"},{"v":703.2166666666666,"d":"703.22"},682.65,664.25,1570100,{"v":0.00990544799639802,"d":"0.99%"}]
[9,"Cement","AMBUJACEM",{"v":196.1,"d":"196.10"},{"v":198.19999999999996,"d":"198.20"},{"v":190.3499999999999,"d":"190.35"},{"v":184.59999999999994,"d":"184.60"},{"v":176.7499999999999,"d":"176.75"},{"v":203.94999999999993,"d":"203.95"},{"v":211.8,"d":"211.80"},{"v":217.54999999999995,"d":"217.55"},206.05,192.45,22842500,{"v":-0.05443444064990169,"d":"-5.44%"}]
[10,"Others","APOLLOHOSP",1525.15,1524.05,{"v":1504.3,"d":"1504.30"},1483.45,{"v":1463.7,"d":"1463.70"},{"v":1544.8999999999999,"d":"1544.90"},{"v":1564.6499999999999,"d":"1564.65"},{"v":1585.4999999999998,"d":"1585.50"},1543.8,1503.2,1346000,{"v":0.022796352583586626,"d":"2.28%"}]
{"$rows_left_out":160}
{"sheet":"Cash Intra","index":2,"n_rows":247,"n_cols":13,"rows_kept":247,"merged":[[7,0,8,0],[7,1,8,1],[7,2,8,2],[7,3,8,3],[7,4,7,6],[7,7,7,9]]}
[]
[]
[]
[]
[{"$nulls":12},"Back to Main Page"]
["FOR INTRA DAY TRADING",{"$nulls":9},{"$f":"Main!B10","v":"2019-10-23"}]
[]
["Sr.no","Scrip","CLOSE RATE","Pivot Point","Supports",null,null,"Resistances"]
[null,null,"Point",null,"S1","S2","S3","R1","R2","R3","HIGH","LOW","Total Trade Quanity in Lakhs"]
[1,"Nifty 50",11588.35,{"v":11625.449999999999,"d":"11625.45"},{"v":11536.549999999997,"d":"11536.55"},{"v":11484.749999999998,"d":"11484.75"},{"v":11395.849999999997,"d":"11395.85"},{"v":11677.249999999998,"d":"11677.25"},11766.15,{"v":11817.949999999999,"d":"11817.95"},11714.35,11573.65]
[2,"Nifty Bank",29411.15,{"v":29444.11666666667,"d":"29444.12"},{"v":29198.233333333337,"d":"29198.23"},{"v":28985.31666666667,"d":"28985.32"},{"v":28739.433333333338,"d":"28739.43"},{"v":29657.033333333336,"d":"29657.03"},{"v":29902.916666666668,"d":"29902.92"},{"v":30115.833333333336,"d":"30115.83"},29690,29231.2]
[3,"Nifty CPSE",2045.45,{"v":2044.8166666666668,"d":"2044.82"},{"v":2034.9833333333336,"d":"2034.98"},{"v":2024.5166666666667,"d":"2024.52"},{"v":2014.6833333333334,"d":"2014.68"},{"v":2055.2833333333338,"d":"2055.28"},{"v":2065.1166666666672,"d":"2065.12"},{"v":2075.583333333334,"d":"2075.58"},2054.65,2034.35]
[4,"Nifty Infra",3297.3,{"v":3308.6,"d":"3308.60"},{"v":3279.3999999999996,"d":"3279.40"},{"v":3261.4999999999995,"d":"3261.50"},{"v":3232.2999999999993,"d":"3232.30"},{"v":3326.5,"d":"3326.50"},{"v":3355.7,"d":"3355.70"},{"v":3373.6000000000004,"d":"3373.60"},3337.8,3290.7]
[5,"Nifty IT",14688.65,{"v":14811.183333333334,"d":"14811.18"},{"v":14536.916666666668,"d":"14536.92"},{"v":14385.183333333334,"d":"14385.18"},{"v":14110.916666666668,"d":"14110.92"},{"v":14962.916666666668,"d":"14962.92"},{"v":15237.183333333334,"d":"15237.18"},{"v":15388.916666666668,"d":"15388.92"},15085.45,14659.45]
[6,"Nifty PSE",3413.8,{"v":3416.2333333333336,"d":"3416.23"},{"v":3396.066666666667,"d":"3396.07"},{"v":3378.3333333333335,"d":"3378.33"},{"v":3358.166666666667,"d":"3358.17"},{"v":3433.966666666667,"d":"3433.97"},{"v":3454.133333333333,"d":"3454.13"},{"v":3471.8666666666672,"d":"3471.87"},3436.4,3398.5]
[7,"Nifty Midcap 50",4457.55,{"v":4470.283333333333,"d":"4470.28"},{"v":4437.816666666666,"d":"4437.82"},{"v":4418.083333333333,"d":"4418.08"},{"v":4385.616666666666,"d":"4385.62"},{"v":4490.0166666666655,"d":"4490.02"},{"v":4522.483333333333,"d":"4522.48"},{"v":4542.216666666665,"d":"4542.22"},4502.75,4450.55]
[8,"ACC",1535.25,{"v":1538.6666666666667,"d":"1538.67"},{"v":1520.3833333333334,"d":"1520.38"},{"v":1505.5166666666667,"d":"1505.52"},{"v":1487.2333333333333,"d":"1487.23"},{"v":1553.5333333333335,"d":"1553.53"},{"v":1571.8166666666668,"d":"1571.82"},{"v":1586.6833333333336,"d":"1586.68"},1556.95,1523.8,9.34518]
[9,"AUBANK",689.25,684.25,{"v":672,"d":"672.00"},654.75,{"v":642.5,"d":"642.50"},{"v":701.5,"d":"701.50"},713.75,{"v":731,"d":"731.00"},696.5,667,14.73667]
[10,"ADANIPORTS",420.75,{"v":422.23333333333335,"d":"422.23"},{"v":415.6166666666667,"d":"415.62"},{"v":410.48333333333335,"d":"410.48"},{"v":403.8666666666667,"d":"403.87"},{"v":427.3666666666667,"d":"427.37"},{"v":433.98333333333335,"d":"433.98"},{"v":439.1166666666667,"d":"439.12"},428.85,417.1,23.80735]
[11,"ADANIPOWER",63.25,63.75,62.45,{"v":61.650000000000006,"d":"61.65"},{"v":60.35000000000001,"d":"60.35"},64.55,{"v":65.85000000000001,"d":"65.85"},{"v":66.64999999999999,"d":"66.65"},65.05,62.95,68.83425]
{"$rows_left_out":228}
{"sheet":"MidCap Intra","index":3,"n_rows":545,"n_cols":13,"rows_kept":545,"merged":[[0,0,0,1],[8,0,9,0],[8,1,9,1],[8,2,9,2],[8,3,9,3],[8,4,8,6],[8,7,8,9]]}
[]
[]
[]
[]
[{"$nulls":11},"Back To Main Page"]
["FOR INTRA DAY TRADING",{"$nulls":9},{"$f":"Main!B10","v":"2019-10-23"}]
[null,null," "]
[]
["Sr.no","Scrip","CLOSE RATE","Pivot Point","Supports",null,null,"Resistances"]
[null,null,"Point",null,"S1","S2","S3","R1","R2","R3","HIGH","LOW","Total Trade Quanity in Lakhs"]
[1,"3MINDIA",21822.3,{"v":21887.766666666666,"d":"21887.77"},{"v":21585.533333333333,"d":"21585.53"},{"v":21348.766666666666,"d":"21348.77"},{"v":21046.533333333333,"d":"21046.53"},{"v":22124.533333333333,"d":"22124.53"},{"v":22426.766666666663,"d":"22426.77"},{"v":22663.533333333333,"d":"22663.53"},22190,21651,0.04653]
[2,"ACC",1535.25,{"v":1538.6666666666667,"d":"1538.67"},{"v":1520.3833333333334,"d":"1520.38"},{"v":1505.5166666666667,"d":"1505.52"},{"v":1487.2333333333333,"d":"1487.23"},{"v":1553.5333333333335,"d":"1553.53"},{"v":1571.8166666666668,"d":"1571.82"},{"v":1586.6833333333336,"d":"1586.68"},1556.95,1523.8,9.34518]
[3,"AIAENG",1709.65,{"v":1723.1000000000001,"d":"1723.10"},{"v":1686.5500000000002,"d":"1686.55"},1663.45,{"v":1626.9,"d":"1626.90"},{"v":1746.2000000000003,"d":"1746.20"},1782.75,{"v":1805.8500000000004,"d":"1805.85"},1759.65,1700,0.16725]
[4,"APLAPOLLO",1386.65,{"v":1391.8666666666668,"d":"1391.87"},{"v":1378.7833333333335,"d":"1378.78"},{"v":1370.9166666666667,"d":"1370.92"},{"v":1357.8333333333335,"d":"1357.83"},{"v":1399.7333333333336,"d":"1399.73"},{"v":1412.8166666666666,"d":"1412.82"},{"v":1420.6833333333336,"d":"1420.68"},1404.95,1384,0.35491]
[5,"AUBANK",689.25,684.25,{"v":672,"d":"672.00"},654.75,{"v":642.5,"d":"642.50"},{"v":701.5,"d":"701.50"},713.75,{"v":731,"d":"731.00"},696.5,667,14.73667]
[6,"AAVAS",1665.5,{"v":1670.4666666666665,"d":"1670.47"},{"v":1649.0333333333328,"d":"1649.03"},{"v":1632.5666666666664,"d":"1632.57"},{"v":1611.1333333333328,"d":"1611.13"},{"v":1686.933333333333,"d":"1686.93"},{"v":1708.3666666666668,"d":"1708.37"},{"v":1724.833333333333,"d":"1724.83"},1691.9,1654,0.13305]
[7,"ABBOTINDIA",10699.85,{"v":10683.283333333333,"d":"10683.28"},{"v":10366.566666666666,"d":"10366.57"},{"v":10033.283333333333,"d":"10033.28"},{"v":9716.566666666666,"d":"9716.57"},{"v":11016.566666666666,"d":"11016.57"},{"v":11333.283333333333,"d":"11333.28"},{"v":11666.566666666666,"d":"11666.57"},11000,10350,0.25468]
[8,"ADANIGAS",148.45,{"v":149.79999999999998,"d":"149.80"},{"v":146.74999999999997,"d":"146.75"},{"v":145.04999999999998,"d":"145.05"},{"v":141.99999999999997,"d":"142.00"},{"v":151.49999999999997,"d":"151.50"},{"v":154.54999999999998,"d":"154.55"},{"v":156.24999999999997,"d":"156.25"},152.85,148.1,6.98922]
[9,"ADANIGREEN",86.6,{"v":87.28333333333335,"d":"87.28"},{"v":83.31666666666669,"d":"83.32"},{"v":80.03333333333335,"d":"80.03"},{"v":76.06666666666669,"d":"76.07"},{"v":90.56666666666669,"d":"90.57"},{"v":94.53333333333336,"d":"94.53"},{"v":97.81666666666669,"d":"97.82"},91.25,84,26.92862]
[10,"ADANIPORTS",420.75,{"v":422.23333333333335,"d":"422.23"},{"v":415.6166666666667,"d":"415.62"},{"v":410.48333333333335,"d":"410.48"},{"v":403.8666666666667,"d":"403.87"},{"v":427.3666666666667,"d":"427.37"},{"v":433.98333333333335,"d":"433.98"},{"v":439.1166666666667,"d":"439.12"},428.85,417.1,23.80735]
{"$rows_left_out":513}
{"sheet":"Bulk Deals","index":4,"n_rows":86,"n_cols":8,"rows_kept":86,"merged":[[4,0,4,1],[4,2,4,3],[6,1,6,2]]}
[" "]
[]
[]
[]
[]
[{"$nulls":4},"Back To Main Page"]
["Subject :","BULK DEAL",null,{"$f":"Main!B10","v":"2019-10-23"}]
[]
["Date","Scrip code","Scrip Name","Client Name","Buy / Sell","Quantity Traded","Trade Price / Wt.Avg.trade price","Exchange  "]
["2019-10-22",511463,"ALEXANDER","KAHAR NIKLESH KANAIYABHAI","BUY",{"v":2200,"d":"2,200"},{"v":18.4,"d":"18.40"},"BSE"]
["2019-10-22",511463,"ALEXANDER","VANDNA ANIRUDH SETHI","BUY",{"v":95000,"d":"95,000"},18.99,"BSE"]
["2019-10-22",511463,"ALEXANDER","KAHAR NIKLESH KANAIYABHAI","SELL",{"v":50200,"d":"50,200"},19.15,"BSE"]
["2019-10-22",540697,"AMFL","HARSHIDA AMITKUMAR SHAH","BUY",{"v":134400,"d":"134,400"},14.28,"BSE"]
["2019-10-22",540697,"AMFL","RIDDHESHKUMAR GIRISHBHAI BHANDARI","SELL",{"v":78400,"d":"78,400"},14.29,"BSE"]
["2019-10-22",531761,"APOLLOPIPES","ROHIT RAJGOPAL DHOOT","SELL",{"v":80000,"d":"80,000"},375.01,"BSE"]
["2019-10-22",531761,"APOLLOPIPES","ASHISH RAMESHCHANDRA KACHOLIA","BUY",{"v":100000,"d":"100,000"},375.01,"BSE"]
["2019-10-22",507515,"CJGEL","JASPAL RAGHUBIR SINGH","BUY",{"v":34900,"d":"34,900"},8.67,"BSE"]
["2019-10-22",507515,"CJGEL","USHA PANDE","SELL",{"v":33901,"d":"33,901"},8.68,"BSE"]
["2019-10-22",504340,"CONFINT","HARENDRA MAHENDRAPRASAD JANI","SELL",{"v":68300,"d":"68,300"},{"v":0.5,"d":"0.50"},"BSE"]
["2019-10-22",540151,"DIKSAT","VINOD HARILAL JHAVERI","SELL",{"v":123000,"d":"123,000"},100,"BSE"]
{"$rows_left_out":67}
{"sheet":"Call Tracker (Equity & F&O)","index":5,"n_rows":342,"n_cols":18,"rows_kept":342,"merged":[[123,0,124,0],[123,1,124,1],[123,9,124,9],[123,11,124,11],[123,12,124,12],[123,13,124,13],[123,14,124,14],[125,0,126,0],[125,1,126,1],[125,9,126,9],[125,11,126,11],[125,12,126,12],[125,13,126,13],[125,14,126,14],[127,0,128,0],[127,1,128,1],[127,9,128,9],[127,11,128,11],[127,12,128,12],[127,13,128,13],[127,14,128,14],[129,0,130,0],[129,1,130,1],[129,9,130,9],[129,11,130,11],[129,12,130,12],[129,13,130,13],[129,14,130,14],[131,0,132,0],[131,1,132,1],[131,9,132,9],[131,11,132,11],[131,12,132,12],[131,13,132,13],[131,14,132,14],[133,0,134,0],[133,1,134,1],[133,9,134,9],[133,11,134,11],[133,12,134,12],[133,13,134,13],[133,14,134,14],[135,0,136,0],[135,1,136,1],[135,9,136,9],[135,11,136,11],[135,12,136,12],[135,13,136,13],[135,14,136,14],[137,0,138,0],[137,1,138,1],[137,9,138,9],[137,11,138,11],[137,12,138,12],[137,13,138,13],[137,14,138,14],[139,0,140,0],[139,1,140,1],[139,9,140,9],[139,11,140,11],[139,12,140,12],[139,13,140,13],[139,14,140,14],[141,0,142,0],[141,1,142,1],[141,9,142,9],[141,11,142,11],[141,12,142,12],[141,13,142,13],[141,14,142,14],[143,0,144,0],[143,1,144,1],[143,9,144,9],[143,11,144,11],[143,12,144,12],[143,13,144,13],[143,14,144,14],[145,0,146,0],[145,1,146,1],[145,9,146,9],[145,11,146,11],[145,12,146,12],[145,13,146,13],[145,14,146,14],[147,0,148,0],[147,1,148,1],[147,9,148,9],[147,11,148,11],[147,12,148,12],[147,13,148,13],[147,14,148,14],[149,0,150,0],[149,1,150,1],[149,9,150,9],[149,11,150,11],[149,12,150,12],[149,13,150,13],[149,14,150,14],[155,0,156,0],[155,1,156,1],[155,9,156,9],[155,11,156,11],[155,12,156,12],[155,13,156,13],[155,14,156,14],[161,0,162,0],[161,1,162,1],[161,9,162,9],[161,11,162,11],[161,12,162,12],[161,13,162,13],[161,14,162,14]]}
[]
[]
[]
[]
[{"$nulls":12},"Back To Main Page"]
["Retail Research Technical Calls & Fundamental Performance Report for the month of October-2019 "]
[{"$nulls":12},{"$f":"Main!B10","v":"2019-10-23"}]
[null,"Positional  Call"]
["Sr.no","Date",null,"Company","Rec","Rec Price","Stop Loss***","Call Closed At","Target","Remark","Profit / Loss per Share","Gain / Loss  %","Status","Closed Date","NSE Closed Price"]
[1,"2019-08-30",null,"BIOCON","Buy{}",229.5,214.3,242.5,"255-260","Profit of Rs.13/-",{"$f":"H10-F10","v":13},{"$f":"K10/F10","v":{"v":0.05664488017429194,"d":"5.66%"}},"Successful","2019-10-10",{"$nulls":3},"R"]
[2,"2019-09-09",null,"TORNTPHARM","Sell",1705,1808,1618,"1560-1540","Profit of Rs.87/-",{"$f":"F11-H11","v":87},{"$f":"K11/F11","v":{"v":0.05102639296187683,"d":"5.10%"}},"Successful","2019-10-01",{"$nulls":3},"R"]
[3,"2019-09-25",null,"AXISBANK","Buy",695,628,717.5,"800-820","Part Profit of Rs.22.50/-",{"$f":"H12-F12","v":22.5},{"v":0.03237410071942446,"d":"3.24%"},"Successful","2019-10-22",{"$f":"VLOOKUP(D12,Sheet2!A42:M1681,6,0)","v":712.75},null,null,"H"]
[4,"2019-09-26",null,"HDFC","Buy",2070,1940,2138,"2250-2300","Part Profit of Rs.68/-",{"$f":"H13-F13","v":68},{"$f":"K13/F13","v":{"v":0.03285024154589372,"d":"3.29%"}},"Successful","2019-10-22",{"$f":"VLOOKUP(D13,Sheet2!A43:M1682,6,0)","v":2114.9},null,null,"H"]
[5,"2019-09-26",null,"BANKBARODA","Buy",96,89,89.5,"110-114","Loss of Rs.6.5/-",{"$f":"H14-F14","v":-6.5},{"$f":"K14/F14","v":{"v":-0.06770833333333333,"d":"-6.77%"}},"UnSuccessful","2019-10-01",{"$nulls":3},"H"]
[6,"2019-09-30",null,"BPCL","Sell",475,510,503,"420-410","Loss of Rs.28/-",{"$f":"F15-H15","v":-28},{"v":-0.05894736842105263,"d":"-5.89%"},"UnSuccessful","2019-10-03",{"$nulls":3},"H"]
[7,"2019-10-01",null,"CUMMINSIND","Buy","574-579",530,null,"640-660","Open",{"$nulls":4},{"$f":"VLOOKUP(D16,Sheet2!A46:M1685,6,0)","v":578.7},null,null,"H"]
[8,"2019-10-01",null,"UPL","Buy","592-598",564,null,"650-660","Open",{"$nulls":4},{"$f":"VLOOKUP(D17,Sheet2!A47:M1686,6,0)","v":597},null,null,"R"]
[9,"2019-10-03",null,"HEIDELBERG","Buy",183,169,195,"205-210","Profit of Rs.12/-",{"$f":"H18-F18","v":12},{"$f":"K18/F18","v":{"v":0.06557377049180328,"d":"6.56%"}},"Successful","2019-10-18",{"$nulls":3},"H"]
[10,"2019-10-03",null,"APOLLOHOSP","Buy{}",1378.5,1286,1448,"1550-1580","Profit of Rs.69.5/-",{"$f":"H19-F19","v":69.5},{"$f":"K19/F19","v":{"v":0.050417120058034094,"d":"5.04%"}},"Successful","2019-10-11",{"$nulls":3},"R"]
[11,"2019-10-04",null,"HDFCAMC","Buy",2665,2537,2835,"2930-2960","Profit of Rs.170/-",{"$f":"H20-F20","v":170},{"$f":"K20/F20","v":{"v":0.06378986866791744,"d":"6.38%"}},"Successful","2019-10-18",{"$nulls":3},"R"]
{"$rows_left_out":312}
{"sheet":"Sheet2","index":6,"n_rows":1899,"n_cols":14,"rows_kept":1899,"hidden":true}
["SYMBOL","SERIES","OPEN","HIGH","LOW","CLOSE","LAST","PREVCLOSE","TOTTRDQTY","TOTTRDVAL","TIMESTAMP","TOTALTRADES","ISIN","ISIN"]
["20MICRONS","EQ",37.85,38.95,37.1,37.45,37.1,38.15,22434,850748.55,"2019-10-22",423,"INE144J01027"]
["21STCENMGM","EQ",12.65,12.9,12.65,12.9,12.9,12.65,107,1363.55,"2019-10-22",6,"INE253B01015"]
["3IINFOTECH","EQ",2.2,2.3,2.15,2.15,2.2,2.2,1315207,2914735.7,"2019-10-22",743,"INE748C01020"]
["3MINDIA","EQ",22000,22190,21651,21822.3,21798,21792.25,4653,102239647.5,"2019-10-22",1445,"INE470A01017"]
["3PLAND","EQ",6.3,6.3,6.3,6.3,6.3,6.2,57,359.1,"2019-10-22",1,"INE105C01023"]
["5PAISA","EQ",175.05,177.25,174.7,174.7,174.7,183.85,38226,6682820.1,"2019-10-22",453,"INE618L01018"]
["63MOONS","EQ",115.35,119.5,114.1,115.05,115.05,114.85,108727,12598429.45,"2019-10-22",2048,"INE111B01023"]
["A2ZINFRA","EQ",10.6,10.65,9.75,9.9,9.8,10.55,848662,8543879.45,"2019-10-22",780,"INE619I01012"]
["AARTIDRUGS","EQ",456,475,450.5,470.95,472,456,9568,4466217.95,"2019-10-22",733,"INE767A01016"]
["AARTIIND","EQ",810,827.4,804.55,821.95,823,804.55,209498,170425419.15,"2019-10-22",10778,"INE769A01020"]
["AARVEEDEN","EQ",14.8,15.95,13.6,14.9,14.9,14.2,4053,58658.45,"2019-10-22",56,"INE273D01019"]
["AAVAS","EQ",1675.85,1691.9,1654,1665.5,1668,1675.85,13305,22253150.2,"2019-10-22",3209,"INE216P01012"]
["ABAN","BE",24.5,26,24.3,25.3,25.25,25.45,31450,799834.4,"2019-10-22",278,"INE421A01028"]
["ABB","EQ",1557,1580,1521,1539.2,1540,1556.3,112943,175376177.25,"2019-10-22",3028,"INE117A01022"]
["ABBOTINDIA","EQ",10699.95,11000,10350,10699.85,10675,10704.5,25468,273550711.8,"2019-10-22",5887,"INE358A01014"]
["ABCAPITAL","EQ",79.05,83.7,79.05,82.95,83.2,79.4,3462436,282919068.9,"2019-10-22",30752,"INE674K01013"]
["ABFRL","EQ",207.55,211.9,204.05,205.75,205.85,209.2,684987,141974677.4,"2019-10-22",4536,"INE647O01011"]
["ABMINTLTD","BE",14.1,14.1,14.1,14.1,14.1,14.1,2,28.2,"2019-10-22",1,"INE251C01017"]
["ABSLNN50ET","EQ",282.96,283.35,282.96,283.35,283.35,281,11,3116.46,"2019-10-22",2,"INF209KB1B87"]
{"$rows_left_out":1701}
{"sheet":"Sheet1","index":7,"n_rows":0,"n_cols":0,"rows_kept":0,"hidden":true}

{"sheet":"Sheet3","index":8,"n_rows":0,"n_cols":0,"rows_kept":0,"hidden":true}

{"sheet":"Sheet4","index":9,"n_rows":0,"n_cols":0,"rows_kept":0,"hidden":true}

{"sheet":"Sheet5","index":10,"n_rows":0,"n_cols":0,"rows_kept":0,"hidden":true}