{"text_format":"3","workbook":"xlsx","n_sheets":10,"sheets":["Main","Future Intra","Cash Intra","MidCap Intra","Bulk Deals","Call Tracker (Equity & F&O)","Sheet2","Sheet1","Sheet3","Sheet4"],"not_rendered":{"images":4,"defined_names":5},"read":"whole","date_system":"1900"}

{"sheet":"Main","index":0,"n_rows":27,"n_cols":11,"rows_kept":27}
[null,"                                                                                                 "]
{"$rows_empty":8}
[null,"2019-07-23"]
[]
[null,"Sheet No.","Template Name","Summary"]
[null,1,"Future Intra","For Intraday trading in F&O segment"]
[null,2,"Cash Intra","For Intraday trading in cash market segment"]
[null,3,"Mid-cap Intra","For Intraday trading in Mid-cap stocks"]
[null,4,"Bulk Deals","Reveals Bulk Deals carried on NSE & BSE"]
[null,5,"Call Tracker"]
{"$rows_empty":9}
[{"$nulls":10},"`"]

{"sheet":"Future Intra","index":1,"n_rows":236,"n_cols":15,"rows_kept":236,"merged":[[8,0,9,0],[8,1,9,1],[8,2,9,2],[8,5,8,7],[8,8,8,10]]}
[]
[]
[]
[]
[{"$nulls":12},"Back to Main Page"]
["FOR INTRA DAY TRADING",{"$nulls":10},{"$f":"Main!B10","v":"2019-07-23"}]
[]
[]
["Sr.no","Sector","Scrip","CLOSE RATE","Pivot Point","Supports",null,null,"Resistances"]
[null,"Sector",null,"Point","Point","S1","S2","S3","R1","R2","R3","HIGH","LOW","OI","% Change in OI"]
[1,"Index","BANKNIFTY",29389.65,{"v":29451.100000000002,"d":"29451.10"},{"v":29203.550000000003,"d":"29203.55"},29017.45,{"v":28769.9,"d":"28769.90"},{"v":29637.200000000004,"d":"29637.20"},29884.75,{"v":30070.850000000006,"d":"30070.85"},29698.65,29265,1795740,{"v":-0.06743872039883672,"d":"-6.74%"}]
[2,"Index","NIFTY",11360.25,11359.85,11311.95,11263.65,11215.75,{"v":11408.150000000001,"d":"11408.15"},11456.05,{"v":11504.350000000002,"d":"11504.35"},11407.75,11311.55,19536300,{"v":-0.03631164007266027,"d":"-3.63%"}]
[3,"Index","NIFTYIT",{"v":15459,"d":"15459.00"},{"v":15447.333333333334,"d":"15447.33"},{"v":15386.666666666668,"d":"15386.67"},{"v":15314.333333333334,"d":"15314.33"},{"v":15253.666666666668,"d":"15253.67"},{"v":15519.666666666668,"d":"15519.67"},{"v":15580.333333333336,"d":"15580.33"},{"v":15652.666666666668,"d":"15652.67"},15508,15375,16700,{"v":-2.9850746268656717E-3,"d":"-0.30%"}]
[4,"Cement","ACC",1583.05,{"v":1569.2833333333335,"d":"1569.28"},{"v":1550.566666666667,"d":"1550.57"},{"v":1518.0833333333335,"d":"1518.08"},{"v":1499.366666666667,"d":"1499.37"},{"v":1601.766666666667,"d":"1601.77"},{"v":1620.4833333333338,"d":"1620.48"},{"v":1652.9666666666672,"d":"1652.97"},1588,1536.8,2730000,{"v":-0.06506849315068493,"d":"-6.51%"}]
[5,"Others","ADANIENT",{"v":132,"d":"132.00"},131.85,{"v":129.2,"d":"129.20"},{"v":126.4,"d":"126.40"},123.75,{"v":134.64999999999998,"d":"134.65"},{"v":137.3,"d":"137.30"},{"v":140.09999999999997,"d":"140.10"},134.5,129.05,30616000,{"v":0.03938077131993482,"d":"3.94%"}]
[6,"Others","ADANIPORTS",{"v":407.2,"d":"407.20"},{"v":404.8333333333333,"d":"404.83"},{"v":399.96666666666664,"d":"399.97"},{"v":392.73333333333335,"d":"392.73"},{"v":387.8666666666667,"d":"387.87"},{"v":412.0666666666666,"d":"412.07"},{"v":416.9333333333333,"d":"416.93"},{"v":424.1666666666666,"d":"424.17"},409.7,397.6,16337500,{"v":0.023492560689115115,"d":"2.35%"}]
[7,"Power","ADANIPOWER",{"v":62.7,"d":"62.70"},{"v":62.01666666666667,"d":"62.02"},{"v":60.83333333333334,"d":"60.83"},{"v":58.96666666666667,"d":"58.97"},{"v":57.78333333333334,"d":"57.78"},{"v":63.88333333333335,"d":"63.88"},{"v":65.06666666666666,"d":"65.07"},{"v":66.93333333333335,"d":"66.93"},63.2,60.15,149140000,{"v":0.16588492808005004,"d":"16.59%"}]
[8,"Automobile","AMARAJABAT",618.95,{"v":616,"d":"616.00"},608.05,597.15,{"v":589.1999999999999,"d":"589.20"},{"v":626.9,"d":"626.90"},634.85,645.75,623.95,605.1,1654800,{"v":-0.0626486915146709,"d":"-6.26%"}]
[9,"Cement","AMBUJACEM",{"v":216.5,"d":"216.50"},{"v":214.98333333333335,"d":"214.98"},{"v":212.66666666666669,"d":"212.67"},{"v":208.83333333333334,"d":"208.83"},{"v":206.51666666666668,"d":"206.52"},{"v":218.8166666666667,"d":"218.82"},{"v":221.13333333333335,"d":"221.13"},{"v":224.9666666666667,"d":"224.97"},217.3,211.15,19557500,{"v":0.01307951307951308,"d":"1.31%"}]
[10,"Others","APOLLOHOSP",1367.45,{"v":1369.7833333333335,"d":"1369.78"},{"v":1351.666666666667,"d":"1351.67"},{"v":1335.8833333333334,"d":"1335.88"},{"v":1317.7666666666669,"d":"1317.77"},{"v":1385.566666666667,"d":"1385.57"},{"v":1403.6833333333334,"d":"1403.68"},{"v":1419.4666666666672,"d":"1419.47"},1387.9,1354,1627000,{"v":0.08502834278092697,"d":"8.50%"}]
{"$rows_left_out":172}
{"sheet":"Cash Intra","index":2,"n_rows":247,"n_cols":13,"rows_kept":247,"merged":[[7,0,8,0],[7,1,8,1],[7,2,8,2],[7,3,8,3],[7,4,7,6],[7,7,7,9]]}
[]
[]
[]
[]
[{"$nulls":12},"Back to Main Page"]
["FOR INTRA DAY TRADING",{"$nulls":9},{"$f":"Main!B10","v":"2019-07-23"}]
[]
["Sr.no","Scrip","CLOSE RATE","Pivot Point","Supports",null,null,"Resistances"]
[null,null,"Point",null,"S1","S2","S3","R1","R2","R3","HIGH","LOW","Total Trade Quanity in Lakhs"]
[1,"Nifty 50",11346.2,{"v":11348.533333333333,"d":"11348.53"},{"v":11298.916666666666,"d":"11298.92"},{"v":11251.633333333333,"d":"11251.63"},{"v":11202.016666666666,"d":"11202.02"},{"v":11395.816666666666,"d":"11395.82"},{"v":11445.433333333334,"d":"11445.43"},{"v":11492.716666666665,"d":"11492.72"},11398.15,11301.25]
[2,"Nifty Bank",29284.95,{"v":29371.400000000005,"d":"29371.40"},{"v":29107.65000000001,"d":"29107.65"},{"v":28930.350000000002,"d":"28930.35"},{"v":28666.600000000006,"d":"28666.60"},{"v":29548.70000000001,"d":"29548.70"},{"v":29812.450000000004,"d":"29812.45"},{"v":29989.750000000015,"d":"29989.75"},29635.15,29194.1]
[3,"Nifty CPSE",2130.9,2119.05,{"v":2095.8,"d":"2095.80"},{"v":2060.7,"d":"2060.70"},{"v":2037.4499999999998,"d":"2037.45"},{"v":2154.1500000000005,"d":"2154.15"},{"v":2177.4000000000005,"d":"2177.40"},{"v":2212.500000000001,"d":"2212.50"},2142.3,2083.95]
[4,"Nifty Infra",3177.8,3167.25,{"v":3144.4,"d":"3144.40"},{"v":3111,"d":"3111.00"},3088.15,3200.65,{"v":3223.5000000000005,"d":"3223.50"},{"v":3256.9,"d":"3256.90"},3190.1,3133.85]
[5,"Nifty IT",15448.25,{"v":15425.633333333333,"d":"15425.63"},{"v":15357.216666666667,"d":"15357.22"},{"v":15266.183333333334,"d":"15266.18"},{"v":15197.766666666668,"d":"15197.77"},{"v":15516.666666666666,"d":"15516.67"},{"v":15585.083333333334,"d":"15585.08"},{"v":15676.116666666665,"d":"15676.12"},15494.05,15334.6]
[6,"Nifty PSE",3370.6,{"v":3352.6,"d":"3352.60"},{"v":3324.3999999999996,"d":"3324.40"},{"v":3278.2,"d":"3278.20"},{"v":3249.9999999999995,"d":"3250.00"},{"v":3398.7999999999997,"d":"3398.80"},{"v":3426.9999999999995,"d":"3427.00"},{"v":3473.2,"d":"3473.20"},3380.8,3306.4]
[7,"Nifty Midcap 50",4491.35,4477.65,{"v":4453.099999999999,"d":"4453.10"},{"v":4414.849999999999,"d":"4414.85"},{"v":4390.299999999999,"d":"4390.30"},{"v":4515.9,"d":"4515.90"},{"v":4540.449999999999,"d":"4540.45"},{"v":4578.7,"d":"4578.70"},4502.2,4439.4]
[8,"ABB",1403.9,1400.55,{"v":1381.6999999999998,"d":"1381.70"},{"v":1359.4999999999998,"d":"1359.50"},{"v":1340.6499999999996,"d":"1340.65"},1422.75,{"v":1441.6,"d":"1441.60"},{"v":1463.8000000000002,"d":"1463.80"},1419.4,1378.35,0.4543]
[9,"ACC",1581.3,{"v":1567.7666666666667,"d":"1567.77"},{"v":1549.5333333333333,"d":"1549.53"},{"v":1517.7666666666667,"d":"1517.77"},{"v":1499.5333333333333,"d":"1499.53"},{"v":1599.5333333333333,"d":"1599.53"},{"v":1617.7666666666664,"d":"1617.77"},{"v":1649.5333333333333,"d":"1649.53"},1586,1536,14.00234]
[10,"AUBANK",656.15,{"v":660.4333333333334,"d":"660.43"},{"v":646.8666666666668,"d":"646.87"},{"v":637.5833333333334,"d":"637.58"},{"v":624.0166666666668,"d":"624.02"},{"v":669.7166666666668,"d":"669.72"},{"v":683.2833333333334,"d":"683.28"},{"v":692.5666666666668,"d":"692.57"},674,651.15,1.5427]
[11,"ADANIPORTS",407.2,{"v":404.40000000000003,"d":"404.40"},{"v":399.30000000000007,"d":"399.30"},{"v":391.40000000000003,"d":"391.40"},{"v":386.30000000000007,"d":"386.30"},{"v":412.30000000000007,"d":"412.30"},{"v":417.4000000000001,"d":"417.40"},{"v":425.30000000000007,"d":"425.30"},409.5,396.5,19.41825]
{"$rows_left_out":228}
{"sheet":"MidCap Intra","index":3,"n_rows":545,"n_cols":13,"rows_kept":545,"merged":[[0,0,0,1],[8,0,9,0],[8,1,9,1],[8,2,9,2],[8,3,9,3],[8,4,8,6],[8,7,8,9]]}
[]
[]
[]
[]
[{"$nulls":11},"Back To Main Page"]
["FOR INTRA DAY TRADING",{"$nulls":9},{"$f":"Main!B10","v":"2019-07-23"}]
[null,null," "]
[]
["Sr.no","Scrip","CLOSE RATE","Pivot Point","Supports",null,null,"Resistances"]
[null,null,"Point",null,"S1","S2","S3","R1","R2","R3","HIGH","LOW","Total Trade Quanity in Lakhs"]
[1,"3MINDIA",21677.2,{"v":21737.36666666667,"d":"21737.37"},{"v":21589.88333333334,"d":"21589.88"},{"v":21502.56666666667,"d":"21502.57"},{"v":21355.08333333334,"d":"21355.08"},{"v":21824.683333333338,"d":"21824.68"},{"v":21972.166666666668,"d":"21972.17"},{"v":22059.483333333337,"d":"22059.48"},21884.85,21650.05,0.06166]
[2,"ABB",1403.9,1400.55,{"v":1381.6999999999998,"d":"1381.70"},{"v":1359.4999999999998,"d":"1359.50"},{"v":1340.6499999999996,"d":"1340.65"},1422.75,{"v":1441.6,"d":"1441.60"},{"v":1463.8000000000002,"d":"1463.80"},1419.4,1378.35,0.4543]
[3,"ACC",1581.3,{"v":1567.7666666666667,"d":"1567.77"},{"v":1549.5333333333333,"d":"1549.53"},{"v":1517.7666666666667,"d":"1517.77"},{"v":1499.5333333333333,"d":"1499.53"},{"v":1599.5333333333333,"d":"1599.53"},{"v":1617.7666666666664,"d":"1617.77"},{"v":1649.5333333333333,"d":"1649.53"},1586,1536,14.00234]
[4,"AIAENG",1759.4,{"v":1743.6666666666667,"d":"1743.67"},{"v":1727.2833333333335,"d":"1727.28"},{"v":1695.1666666666667,"d":"1695.17"},{"v":1678.7833333333335,"d":"1678.78"},{"v":1775.7833333333335,"d":"1775.78"},{"v":1792.1666666666667,"d":"1792.17"},{"v":1824.2833333333335,"d":"1824.28"},1760.05,1711.55,0.19942]
[5,"APLAPOLLO",1493.2,{"v":1489.6333333333332,"d":"1489.63"},{"v":1460.4666666666665,"d":"1460.47"},{"v":1427.7333333333333,"d":"1427.73"},{"v":1398.5666666666666,"d":"1398.57"},{"v":1522.3666666666663,"d":"1522.37"},{"v":1551.5333333333333,"d":"1551.53"},{"v":1584.2666666666662,"d":"1584.27"},1518.8,1456.9,0.49101]
[6,"AUBANK",656.15,{"v":660.4333333333334,"d":"660.43"},{"v":646.8666666666668,"d":"646.87"},{"v":637.5833333333334,"d":"637.58"},{"v":624.0166666666668,"d":"624.02"},{"v":669.7166666666668,"d":"669.72"},{"v":683.2833333333334,"d":"683.28"},{"v":692.5666666666668,"d":"692.57"},674,651.15,1.5427]
[7,"AAVAS",1458.8,{"v":1460.9166666666667,"d":"1460.92"},{"v":1421.9333333333334,"d":"1421.93"},{"v":1385.0666666666666,"d":"1385.07"},{"v":1346.0833333333333,"d":"1346.08"},{"v":1497.7833333333335,"d":"1497.78"},{"v":1536.7666666666667,"d":"1536.77"},{"v":1573.6333333333337,"d":"1573.63"},1499.9,1424.05,0.16284]
[8,"ADANIGREEN",46.8,{"v":46.31666666666666,"d":"46.32"},{"v":45.18333333333332,"d":"45.18"},{"v":43.56666666666666,"d":"43.57"},{"v":42.43333333333332,"d":"42.43"},{"v":47.93333333333332,"d":"47.93"},{"v":49.06666666666666,"d":"49.07"},{"v":50.68333333333332,"d":"50.68"},47.45,44.7,10.2222]
[9,"ADANIPORTS",407.2,{"v":404.40000000000003,"d":"404.40"},{"v":399.30000000000007,"d":"399.30"},{"v":391.40000000000003,"d":"391.40"},{"v":386.30000000000007,"d":"386.30"},{"v":412.30000000000007,"d":"412.30"},{"v":417.4000000000001,"d":"417.40"},{"v":425.30000000000007,"d":"425.30"},409.5,396.5,19.41825]
[10,"ADANIPOWER",62.95,{"v":62.38333333333333,"d":"62.38"},{"v":60.766666666666666,"d":"60.77"},{"v":58.583333333333336,"d":"58.58"},{"v":56.96666666666667,"d":"56.97"},{"v":64.56666666666666,"d":"64.57"},{"v":66.18333333333332,"d":"66.18"},{"v":68.36666666666666,"d":"68.37"},64,60.2,128.31653]
{"$rows_left_out":513}
{"sheet":"Bulk Deals","index":4,"n_rows":61,"n_cols":8,"rows_kept":61,"merged":[[4,0,4,1],[4,2,4,3],[6,1,6,2]]}
[" "]
[]
[]
[]
[]
[{"$nulls":4},"Back To Main Page"]
["Subject :","BULK DEAL",null,{"$f":"Main!B10","v":"2019-07-23"}]
[]
["Date","Scrip code","Scrip Name","Client Name","Buy / Sell","Quantity Traded","Trade Price / Wt.Avg.trade price","Exchange  "]
["2019-07-22",537766,"BCP","ACHINTYA SECURITIES PVT. LTD.","BUY",{"v":765547,"d":"765,547"},44.32,"BSE"]
["2019-07-22",537766,"BCP","ACHINTYA SECURITIES PVT. LTD.","SELL",{"v":765547,"d":"765,547"},44.36,"BSE"]
["2019-07-22",504340,"CONFINT","SWARUPGUCHHAIT","BUY",{"v":60000,"d":"60,000"},0.78,"BSE"]
["2019-07-22",504340,"CONFINT","ESQUIRE ENCLAVE PRIVATE LIMITED","SELL",{"v":136473,"d":"136,473"},0.78,"BSE"]
["2019-07-22",504340,"CONFINT","MORYO INDUSTRIES LIMITED","BUY",{"v":55102,"d":"55,102"},0.77,"BSE"]
["2019-07-22",539770,"DARJEELING","NIRAJ RAJNIKANT SHAH","BUY",{"v":40000,"d":"40,000"},94,"BSE"]
["2019-07-22",539770,"DARJEELING","ANKUR SURESH MEHTA","SELL",{"v":40000,"d":"40,000"},94,"BSE"]
["2019-07-22",542446,"JONJUA","USHA BAID","BUY",{"v":30000,"d":"30,000"},{"v":13,"d":"13.00"},"BSE"]
["2019-07-22",540937,"MEDICO","ARYAMAN BROKING LIMITED","SELL",{"v":99600,"d":"99,600"},85.71,"BSE"]
["2019-07-22",540937,"MEDICO","EMRALD COMMERCIAL LIMITED","BUY",{"v":99600,"d":"99,600"},85.71,"BSE"]
["2019-07-22",540416,"OCTAWARE","S K GROWTH FUND PVT LTD","BUY",{"v":20800,"d":"20,800"},98.5,"BSE"]
{"$rows_left_out":42}
{"sheet":"Call Tracker (Equity & F&O)","index":5,"n_rows":327,"n_cols":18,"rows_kept":327,"merged":[[121,0,122,0],[121,1,122,1],[121,9,122,9],[121,11,122,11],[121,12,122,12],[121,13,122,13],[121,14,122,14],[121,17,122,17],[124,0,125,0],[124,1,125,1],[124,9,125,9],[124,11,125,11],[124,12,125,12],[124,13,125,13],[124,14,125,14],[124,17,125,17],[126,0,127,0],[126,1,127,1],[126,9,127,9],[126,11,127,11],[126,12,127,12],[126,13,127,13],[126,14,127,14]]}
[]
[]
[]
[]
[{"$nulls":12},"Back To Main Page"]
["Retail Research Technical Calls & Fundamental Performance Report for the month of July-2019 "]
[{"$nulls":12},{"$f":"Main!B10","v":"2019-07-23"}]
[null,"Positional  Call"]
["Sr.no","Date",null,"Company","Rec","Rec Price","Stop Loss***","Call Closed At","Target","Remark","Profit / Loss per Share","Gain / Loss  %","Status","Closed Date","NSE Closed Price"]
[1,"2019-05-27",null,"TATAELXSI","Buy",874,818.7,863,"970-990","Loss of Rs.11/-",{"$f":"H10-F10","v":-11},{"$f":"K10/F10","v":{"v":-0.012585812356979404,"d":"-1.26%"}},"Unsuccessful","2019-07-16",{"$nulls":3},"R"]
[2,"2019-05-28",null,"BAJAJFINSV","Sell",8175,8625,7925,7300,"Profit of Rs.250/-",{"$f":"F11-H11","v":250},{"v":0.03058103975535168,"d":"3.06%"},"Successful","2019-07-08",{"$nulls":3},"H"]
[3,"2019-05-31",null,"ITC","Buy",286,268.3,265.5,"315-325","Loss of Rs.20.5/-",{"$f":"H12-F12","v":-20.5},{"$f":"K12/F12","v":{"v":-0.07167832167832168,"d":"-7.17%"}},"Unsuccessful","2019-07-22",{"$nulls":3},"R"]
[4,"2019-06-13",null,"GODREJCP","Buy",677.5,644,639.5,"740-750","Loss of Rs.38/-",{"$f":"H13-F13","v":-38},{"$f":"K13/F13","v":{"v":-0.05608856088560885,"d":"-5.61%"}},"Unsuccessful","2019-07-10",{"$nulls":3},"H"]
[5,"2019-06-17",null,"SUNTV","Buy",517,476,507,"575-585","Loss of Rs.10/-",{"$f":"H14-F14","v":-10},{"$f":"K14/F14","v":{"v":-0.019342359767891684,"d":"-1.93%"}},"Unsuccessful","2019-07-08",{"$nulls":3},"R"]
[6,"2019-06-21",null,"AJANTPHARM","Buy",955,897.7,894,"1060-1080","Loss of Rs.61/-",{"$f":"H15-F15","v":-61},{"$f":"K15/F15","v":{"v":-0.06387434554973823,"d":"-6.39%"}},"Unsuccessful","2019-07-11",{"$nulls":3},"R"]
[7,"2019-06-24",null,"ESCORTS","Buy",549.5,518,545.25,600,"Loss of Rs.4.25/-",-4.25,{"v":-7.7343039126478615E-3,"d":"-0.77%"},"Neutral","2019-07-08",{"$nulls":3},"H"]
[8,"2019-06-25",null,"JUBLFOOD","Buy","1260-1265",1158.3,null,"1450 -1470","Open",{"$nulls":4},{"$f":"VLOOKUP(D17,Sheet2!A4:M1643,6,0)","v":1199.9},null,null,"R"]
[9,"2019-07-04",null,"TORNTPHARM","Buy",1545,1454,1610,"1730-1750","Part Profit of Rs.65/-",{"$f":"H18-F18","v":65},{"$f":"K18/F18","v":{"v":0.042071197411003236,"d":"4.21%"}},"Successful","2019-07-16",{"$nulls":3},"R"]
[10,"2019-07-10",null,"TCS","Buy","2105-2115",1973,null,"2295-2345","Open",{"$nulls":4},{"$f":"VLOOKUP(D19,Sheet2!A6:M1645,6,0)","v":2109.9},null,null,"H"]
[11,"2019-07-11",null,"BAJAJ-AUTO","Buy",2670,2527,2527,"1920-1950","Loss of Rs.143/-",{"$f":"H20-F20","v":-143},{"$f":"K20/F20","v":{"v":-0.05355805243445693,"d":"-5.36%"}},"Unsuccessful","2019-07-22",{"$nulls":3},"R"]
{"$rows_left_out":308}
{"sheet":"Sheet2","index":6,"n_rows":1899,"n_cols":14,"rows_kept":1899,"hidden":true}
["SYMBOL","SERIES","OPEN","HIGH","LOW","CLOSE","LAST","PREVCLOSE","TOTTRDQTY","TOTTRDVAL","TIMESTAMP","TOTALTRADES","ISIN","ISIN"]
["20MICRONS","EQ",36.45,36.45,33.55,34.85,35,35.4,16890,591203.8,"2019-07-22",170,"INE144J01027"]
["21STCENMGM","EQ",16.85,16.85,16.25,16.25,16.25,16.55,54,878.7,"2019-07-22",4,"INE253B01015"]
["3IINFOTECH","EQ",2.65,2.65,2.55,2.65,2.65,2.6,756616,1967137.5,"2019-07-22",404,"INE748C01020"]
["3MINDIA","EQ",21884.85,21884.85,21650.05,21677.2,21660,21884.85,6166,133942626.15,"2019-07-22",405,"INE470A01017"]
["3PLAND","EQ",7.45,8,7.45,7.95,7.95,7.8,1677,12873.5,"2019-07-22",18,"INE105C01023"]
["5PAISA","EQ",196.9,196.9,196.9,196.9,196.9,207.25,2440,480436,"2019-07-22",81,"INE618L01018"]
["63MOONS","EQ",96.7,96.7,92.1,92.3,92.1,96.9,51559,4815945.25,"2019-07-22",906,"INE111B01023"]
["8KMILES","EQ",73.65,73.65,73.65,73.65,73.65,77.5,10337,761320.05,"2019-07-22",187,"INE650K01021"]
["A2ZINFRA","EQ",9.8,10,9.25,9.4,9.4,9.9,163495,1561127.2,"2019-07-22",493,"INE619I01012"]
["AARTIDRUGS","EQ",484.2,494.25,481.65,484.8,485.25,486.2,10023,4873541.6,"2019-07-22",871,"INE767A01016"]
["AARTIIND","EQ",1660.65,1666.4,1592.05,1629.75,1629,1638.7,86850,141032535.55,"2019-07-22",4649,"INE769A01020"]
["AARVEEDEN","EQ",16.75,18.85,15.3,16.6,16.9,16.9,16844,275764.75,"2019-07-22",192,"INE273D01019"]
["AAVAS","EQ",1482,1499.9,1424.05,1458.8,1453,1493.05,16284,23888234.3,"2019-07-22",2475,"INE216P01012"]
["ABAN","EQ",34.05,34.4,32.65,32.7,32.75,34.35,85366,2819891.6,"2019-07-22",1016,"INE421A01028"]
["ABB","EQ",1419.4,1419.4,1378.35,1403.9,1405,1415.1,45430,63398368.3,"2019-07-22",3503,"INE117A01022"]
["ABBOTINDIA","EQ",8680,8697.85,8501,8545.25,8550,8572.8,5625,48581904.55,"2019-07-22",1835,"INE358A01014"]
["ABCAPITAL","EQ",87.05,88.25,86,88,88,87.2,1028679,89788936.2,"2019-07-22",8305,"INE674K01013"]
["ABFRL","EQ",204,208.35,202.5,207.55,204.25,205.85,251802,51781886.8,"2019-07-22",4234,"INE647O01011"]
["ABSLNN50ET","EQ",264.26,267.23,264.26,267.23,267.23,265.24,5,1333.18,"2019-07-22",2,"INF209KB1B87"]
{"$rows_left_out":1674}
{"sheet":"Sheet1","index":7,"n_rows":0,"n_cols":0,"rows_kept":0,"hidden":true}

{"sheet":"Sheet3","index":8,"n_rows":0,"n_cols":0,"rows_kept":0,"hidden":true}

{"sheet":"Sheet4","index":9,"n_rows":0,"n_cols":0,"rows_kept":0,"hidden":true}