{"text_format":"3","workbook":"xlsx","n_sheets":6,"sheets":["Main","Future Intra","Cash Intra","MidCap Intra","Bulk Deals","Call Tracker (Equity & F&O)"],"not_rendered":{"images":4,"defined_names":1},"read":"whole","date_system":"1900"}

{"sheet":"Main","index":0,"n_rows":27,"n_cols":11,"rows_kept":27}
[null,"                                                                                                 "]
[]
[]
[]
[]
[{"$nulls":6}," "]
[]
[]
[]
[null,"2024-02-22"]
[]
[null,"Sheet No.","Template Name","Summary"]
[null,1,"Future Intra","For Intraday trading in F&O segment"]
[null,2,"Cash Intra","For Intraday trading in cash market segment"]
[null,3,"Mid-cap Intra","For Intraday trading in Mid-cap stocks"]
[null,4,"Bulk Deals","Reveals Bulk Deals carried on NSE & BSE"]
[null,5,"Call Tracker"]
{"$rows_empty":9}
[{"$nulls":10},"`"]

{"sheet":"Future Intra","index":1,"n_rows":236,"n_cols":16,"rows_kept":236,"merged":[[8,0,9,0],[8,1,9,1],[8,2,9,2],[8,3,9,3],[8,6,8,8],[8,9,8,11]]}
[]
[]
[]
[]
[{"$nulls":12},"Back to Main Page"]
["FOR INTRA DAY TRADING",{"$nulls":10},{"$f":"Main!B10","v":"2024-02-22"}]
[]
[]
["Sr.no","Sector","Scrip","Expiry Date","CLOSE RATE","Pivot Point","Supports",null,null,"Resistances"]
[{"$nulls":4},"Point","Point","S1","S2","S3","R1","R2","R3","HIGH","LOW","OI","% Change in OI"]
[1,"Index","NIFTY","2024-02-29",22070.15,{"v":22121.666666666668,"d":"22121.67"},{"v":21971.333333333336,"d":"21971.33"},{"v":21872.516666666666,"d":"21872.52"},{"v":21722.183333333334,"d":"21722.18"},{"v":22220.483333333337,"d":"22220.48"},{"v":22370.816666666673,"d":"22370.82"},{"v":22469.63333333334,"d":"22469.63"},22272,22022.85,13573300,{"v":0.010418101218236702,"d":"1.04%"}]
[2,"Index","BANKNIFTY","2024-02-29",47024.85,{"v":47108.583333333336,"d":"47108.58"},{"v":46817.11666666667,"d":"46817.12"},{"v":46609.38333333333,"d":"46609.38"},{"v":46317.916666666664,"d":"46317.92"},{"v":47316.31666666667,"d":"47316.32"},{"v":47607.78333333333,"d":"47607.78"},{"v":47815.51666666668,"d":"47815.52"},47400.05,46900.85,3246150,{"v":0.035206888304233436,"d":"3.52%"}]
[3,"Index","FINNIFTY","2024-02-27",{"v":20676.4,"d":"20676.40"},{"v":20738.466666666667,"d":"20738.47"},{"v":20587.933333333334,"d":"20587.93"},{"v":20499.466666666667,"d":"20499.47"},{"v":20348.933333333334,"d":"20348.93"},{"v":20826.933333333334,"d":"20826.93"},{"v":20977.466666666667,"d":"20977.47"},{"v":21065.933333333334,"d":"21065.93"},20889,20650,101160,{"v":-0.15952143569292124,"d":"-15.95%"}]
[4,"Index","MIDCPNIFTY","2024-02-26",10862.65,{"v":10913.4,"d":"10913.40"},{"v":10782.949999999999,"d":"10782.95"},10703.25,{"v":10572.8,"d":"10572.80"},{"v":10993.099999999999,"d":"10993.10"},11123.55,{"v":11203.249999999998,"d":"11203.25"},11043.85,10833.7,858150,{"v":0.10904332654841524,"d":"10.90%"}]
[5,"Chemical","AARTIIND","2024-02-29",{"v":688.8,"d":"688.80"},{"v":694.1833333333334,"d":"694.18"},{"v":677.3666666666668,"d":"677.37"},{"v":665.9333333333334,"d":"665.93"},{"v":649.1166666666668,"d":"649.12"},{"v":705.6166666666668,"d":"705.62"},{"v":722.4333333333334,"d":"722.43"},{"v":733.8666666666668,"d":"733.87"},711,682.75,13265000,{"v":0.0415358040201005,"d":"4.15%"}]
[6,"Capital_Goods","ABB","2024-02-29",{"v":4999.8,"d":"4999.80"},{"v":4885.599999999999,"d":"4885.60"},{"v":4746.199999999999,"d":"4746.20"},{"v":4492.599999999999,"d":"4492.60"},{"v":4353.199999999999,"d":"4353.20"},{"v":5139.199999999999,"d":"5139.20"},{"v":5278.5999999999985,"d":"5278.60"},{"v":5532.199999999999,"d":"5532.20"},5025,4632,1795375,{"v":0.11600621600621601,"d":"11.60%"}]
[7,"Pharma","ABBOTINDIA","2024-02-29",{"v":29166.9,"d":"29166.90"},{"v":29205.516666666666,"d":"29205.52"},{"v":29011.13333333333,"d":"29011.13"},{"v":28855.366666666665,"d":"28855.37"},{"v":28660.98333333333,"d":"28660.98"},{"v":29361.283333333333,"d":"29361.28"},{"v":29555.66666666667,"d":"29555.67"},{"v":29711.433333333334,"d":"29711.43"},29399.9,29049.75,190840,{"v":8.241758241758242E-3,"d":"0.82%"}]
[8,"Others","ABCAPITAL","2024-02-29",182.65,183.85,{"v":180.79999999999998,"d":"180.80"},178.95,{"v":175.89999999999998,"d":"175.90"},{"v":185.7,"d":"185.70"},188.75,{"v":190.6,"d":"190.60"},186.9,182,66495600,{"v":0.010089410220654581,"d":"1.01%"}]
[9,"Textile","ABFRL","2024-02-29",226.65,{"v":230.86666666666665,"d":"230.87"},{"v":220.7333333333333,"d":"220.73"},{"v":214.81666666666663,"d":"214.82"},{"v":204.68333333333328,"d":"204.68"},{"v":236.7833333333333,"d":"236.78"},{"v":246.91666666666669,"d":"246.92"},{"v":252.83333333333331,"d":"252.83"},241,224.95,48594000,{"v":0.12421052631578948,"d":"12.42%"}]
[10,"Cement","ACC","2024-02-29",2672.65,{"v":2687.9166666666665,"d":"2687.92"},{"v":2643.933333333333,"d":"2643.93"},{"v":2615.2166666666662,"d":"2615.22"},{"v":2571.2333333333327,"d":"2571.23"},{"v":2716.633333333333,"d":"2716.63"},{"v":2760.616666666667,"d":"2760.62"},{"v":2789.3333333333335,"d":"2789.33"},2731.9,2659.2,4808700,{"v":1.0617037222083437E-3,"d":"0.11%"}]
{"$rows_left_out":195}
{"sheet":"Cash Intra","index":2,"n_rows":245,"n_cols":13,"rows_kept":245,"merged":[[7,0,8,0],[7,1,8,1],[7,2,8,2],[7,3,8,3],[7,4,7,6],[7,7,7,9]]}
[]
[]
[]
[]
[{"$nulls":12},"Back to Main Page"]
["FOR INTRA DAY TRADING",{"$nulls":9},{"$f":"Main!B10","v":"2024-02-22"}]
[]
["Sr.no",null,"CLOSE RATE","Pivot Point","Supports",null,null,"Resistances"]
[{"$nulls":4},"S1","S2","S3","R1","R2","R3","HIGH","LOW","Total Trade Quanity in Lakhs"]
[1,"Nifty 50",22055.05,{"v":22100.8,"d":"22100.80"},{"v":21952.199999999997,"d":"21952.20"},21849.35,{"v":21700.749999999996,"d":"21700.75"},{"v":22203.649999999998,"d":"22203.65"},{"v":22352.249999999996,"d":"22352.25"},{"v":22455.1,"d":"22455.10"},{"v":22249.4,"d":"22249.40"},21997.95]
[2,"Nifty Bank",{"v":47019.7,"d":"47019.70"},{"v":47090.01666666666,"d":"47090.02"},{"v":46816.633333333324,"d":"46816.63"},{"v":46613.56666666666,"d":"46613.57"},{"v":46340.18333333332,"d":"46340.18"},{"v":47293.08333333333,"d":"47293.08"},{"v":47566.46666666666,"d":"47566.47"},{"v":47769.53333333333,"d":"47769.53"},{"v":47363.4,"d":"47363.40"},46886.95]
[3,"Nifty CPSE",5762.15,{"v":5812.983333333334,"d":"5812.98"},{"v":5690.966666666667,"d":"5690.97"},{"v":5619.783333333334,"d":"5619.78"},{"v":5497.766666666667,"d":"5497.77"},{"v":5884.166666666667,"d":"5884.17"},{"v":6006.183333333333,"d":"6006.18"},{"v":6077.366666666667,"d":"6077.37"},{"v":5935,"d":"5935.00"},{"v":5741.8,"d":"5741.80"}]
[4,"Nifty Infra",8078.55,{"v":8104.133333333334,"d":"8104.13"},{"v":8024.966666666668,"d":"8024.97"},{"v":7971.383333333334,"d":"7971.38"},{"v":7892.216666666668,"d":"7892.22"},{"v":8157.716666666668,"d":"8157.72"},{"v":8236.883333333335,"d":"8236.88"},{"v":8290.466666666667,"d":"8290.47"},{"v":8183.3,"d":"8183.30"},8050.55]
[5,"Nifty IT",{"v":37405.9,"d":"37405.90"},{"v":37569.98333333334,"d":"37569.98"},{"v":37138.51666666668,"d":"37138.52"},{"v":36871.13333333334,"d":"36871.13"},{"v":36439.66666666668,"d":"36439.67"},{"v":37837.366666666676,"d":"37837.37"},{"v":38268.833333333336,"d":"38268.83"},{"v":38536.216666666674,"d":"38536.22"},38001.45,{"v":37302.6,"d":"37302.60"}]
[6,"Nifty PSE",9225.95,{"v":9311.733333333332,"d":"9311.73"},{"v":9100.566666666664,"d":"9100.57"},{"v":8975.183333333332,"d":"8975.18"},{"v":8764.016666666665,"d":"8764.02"},{"v":9437.116666666663,"d":"9437.12"},{"v":9648.283333333331,"d":"9648.28"},{"v":9773.666666666662,"d":"9773.67"},{"v":9522.9,"d":"9522.90"},9186.35]
[7,"Nifty Midcap 50",13813.55,{"v":13874.833333333334,"d":"13874.83"},{"v":13716.116666666669,"d":"13716.12"},{"v":13618.683333333334,"d":"13618.68"},{"v":13459.966666666669,"d":"13459.97"},{"v":13972.266666666668,"d":"13972.27"},{"v":14130.983333333332,"d":"14130.98"},{"v":14228.416666666668,"d":"14228.42"},14033.55,{"v":13777.4,"d":"13777.40"}]
[8,"ABB",4984.7,{"v":4919.566666666667,"d":"4919.57"},{"v":4705.133333333333,"d":"4705.13"},{"v":4425.566666666667,"d":"4425.57"},{"v":4211.133333333333,"d":"4211.13"},{"v":5199.133333333333,"d":"5199.13"},{"v":5413.566666666666,"d":"5413.57"},{"v":5693.133333333333,"d":"5693.13"},5134,4640,44.04765]
[9,"ACC",2666.75,{"v":2678.9500000000003,"d":"2678.95"},{"v":2638.9000000000005,"d":"2638.90"},2611.05,{"v":2571.0000000000005,"d":"2571.00"},{"v":2706.8000000000006,"d":"2706.80"},{"v":2746.850000000001,"d":"2746.85"},{"v":2774.7000000000007,"d":"2774.70"},2719,2651.1,3.83105]
[10,"APLAPOLLO",1433.95,{"v":1437.1499999999999,"d":"1437.15"},{"v":1418.2999999999997,"d":"1418.30"},{"v":1402.6499999999999,"d":"1402.65"},{"v":1383.7999999999997,"d":"1383.80"},{"v":1452.7999999999997,"d":"1452.80"},{"v":1471.6499999999996,"d":"1471.65"},{"v":1487.2999999999997,"d":"1487.30"},1456,1421.5,2.96162]
[11,"AUBANK",588.15,{"v":591.6999999999999,"d":"591.70"},{"v":580.8499999999999,"d":"580.85"},573.55,{"v":562.6999999999999,"d":"562.70"},{"v":598.9999999999999,"d":"599.00"},609.85,{"v":617.1499999999999,"d":"617.15"},602.55,584.4,31.76517]
{"$rows_left_out":226}
{"sheet":"MidCap Intra","index":3,"n_rows":530,"n_cols":13,"rows_kept":530,"merged":[[0,0,0,1],[8,0,9,0],[8,1,9,1],[8,2,9,2],[8,3,9,3],[8,4,8,6],[8,7,8,9]]}
[]
[]
[]
[]
[{"$nulls":11},"Back To Main Page"]
["FOR INTRA DAY TRADING",{"$nulls":9},{"$f":"Main!B10","v":"2024-02-22"}]
[null,null," "]
[]
["Sr.no","Scrip","CLOSE RATE","Pivot Point","Supports",null,null,"Resistances"]
[{"$nulls":4},"S1","S2","S3","R1","R2","R3","HIGH","LOW","Total Trade Quanity in Lakhs"]
[1,"360ONE",713.7,{"v":722.1166666666667,"d":"722.12"},{"v":699.3333333333334,"d":"699.33"},{"v":684.9666666666667,"d":"684.97"},{"v":662.1833333333334,"d":"662.18"},{"v":736.4833333333333,"d":"736.48"},{"v":759.2666666666667,"d":"759.27"},{"v":773.6333333333333,"d":"773.63"},744.9,707.75,3.27025]
[2,"3MINDIA",31009.25,{"v":31146.083333333332,"d":"31146.08"},{"v":30772.166666666664,"d":"30772.17"},{"v":30535.083333333332,"d":"30535.08"},{"v":30161.166666666664,"d":"30161.17"},{"v":31383.166666666664,"d":"31383.17"},{"v":31757.08333333333,"d":"31757.08"},{"v":31994.166666666664,"d":"31994.17"},31520,30909,0.02801]
[3,"ABB",4984.7,{"v":4919.566666666667,"d":"4919.57"},{"v":4705.133333333333,"d":"4705.13"},{"v":4425.566666666667,"d":"4425.57"},{"v":4211.133333333333,"d":"4211.13"},{"v":5199.133333333333,"d":"5199.13"},{"v":5413.566666666666,"d":"5413.57"},{"v":5693.133333333333,"d":"5693.13"},5134,4640,44.04765]
[4,"ACC",2666.75,{"v":2678.9500000000003,"d":"2678.95"},{"v":2638.9000000000005,"d":"2638.90"},2611.05,{"v":2571.0000000000005,"d":"2571.00"},{"v":2706.8000000000006,"d":"2706.80"},{"v":2746.850000000001,"d":"2746.85"},{"v":2774.7000000000007,"d":"2774.70"},2719,2651.1,3.83105]
[5,"AIAENG",3797.7,{"v":3814.2333333333336,"d":"3814.23"},{"v":3753.466666666667,"d":"3753.47"},{"v":3709.2333333333336,"d":"3709.23"},{"v":3648.466666666667,"d":"3648.47"},{"v":3858.466666666667,"d":"3858.47"},{"v":3919.2333333333336,"d":"3919.23"},{"v":3963.466666666667,"d":"3963.47"},3875,3770,0.77094]
[6,"APLAPOLLO",1433.95,{"v":1437.1499999999999,"d":"1437.15"},{"v":1418.2999999999997,"d":"1418.30"},{"v":1402.6499999999999,"d":"1402.65"},{"v":1383.7999999999997,"d":"1383.80"},{"v":1452.7999999999997,"d":"1452.80"},{"v":1471.6499999999996,"d":"1471.65"},{"v":1487.2999999999997,"d":"1487.30"},1456,1421.5,2.96162]
[7,"AUBANK",588.15,{"v":591.6999999999999,"d":"591.70"},{"v":580.8499999999999,"d":"580.85"},573.55,{"v":562.6999999999999,"d":"562.70"},{"v":598.9999999999999,"d":"599.00"},609.85,{"v":617.1499999999999,"d":"617.15"},602.55,584.4,31.76517]
[8,"AARTIDRUGS",533.45,{"v":537.4499999999999,"d":"537.45"},{"v":526.0999999999999,"d":"526.10"},518.75,{"v":507.4,"d":"507.40"},{"v":544.7999999999998,"d":"544.80"},556.15,{"v":563.4999999999998,"d":"563.50"},548.8,530.1,1.54253]
[9,"AARTIIND",687.4,{"v":693.9500000000002,"d":"693.95"},{"v":675.9000000000003,"d":"675.90"},{"v":664.4000000000002,"d":"664.40"},{"v":646.3500000000004,"d":"646.35"},{"v":705.4500000000003,"d":"705.45"},{"v":723.5000000000002,"d":"723.50"},{"v":735.0000000000002,"d":"735.00"},712,682.45,23.61143]
[10,"AAVAS",1443.15,1442.45,{"v":1435,"d":"1435.00"},1426.85,{"v":1419.3999999999999,"d":"1419.40"},{"v":1450.6000000000001,"d":"1450.60"},{"v":1458.0500000000004,"d":"1458.05"},{"v":1466.2000000000003,"d":"1466.20"},1449.9,1434.3,2.56381]
{"$rows_left_out":511}
{"sheet":"Bulk Deals","index":4,"n_rows":207,"n_cols":8,"rows_kept":207,"merged":[[4,0,4,1],[4,2,4,3],[6,1,6,2]]}
[" "]
[]
[]
[]
[]
[{"$nulls":4},"Back To Main Page"]
["Subject :","BULK DEAL",null,{"$f":"Main!B10","v":"2024-02-22"}]
[]
["Date","Scrip code","Scrip Name","Client Name","Buy / Sell","Quantity Traded","Trade Price / Wt.Avg.trade price","Exchange  "]
["2024-02-21",542580,"AARTECH","PRIYA KABRA","BUY",{"v":143746,"d":"143,746"},183.36,"BSE"]
["2024-02-21",542580,"AARTECH","PRIYA KABRA","SELL",{"v":13502,"d":"13,502"},184.4,"BSE"]
["2024-02-21",542580,"AARTECH","HENSEX SECURITIES PVT LTD","SELL",{"v":70492,"d":"70,492"},184.01,"BSE"]
["2024-02-21",542580,"AARTECH","HENSEX SECURITIES PVT LTD","BUY",{"v":12677,"d":"12,677"},183.6,"BSE"]
["2024-02-21",513119,"ABCGAS","SYAMALPRASAD DWARKAPRASAD SHOREWALA","SELL",{"v":30000,"d":"30,000"},54.7,"BSE"]
["2024-02-21",513119,"ABCGAS","ADVANCED ENERGY SYSTEMS LLP","BUY",{"v":12000,"d":"12,000"},54.7,"BSE"]
["2024-02-21",513119,"ABCGAS","ARJUN LEASING AND FINANCE PVT LTD .","BUY",{"v":10000,"d":"10,000"},54.7,"BSE"]
["2024-02-21",507852,"ADDIND","NEHA MOHIT JALAN","SELL",{"v":100000,"d":"100,000"},70.68,"BSE"]
["2024-02-21",538351,"AFEL","ANUPREET KAUR SARABJIT KEER","SELL",{"v":73510,"d":"73,510"},6.95,"BSE"]
["2024-02-21",539277,"ALSTONE","AVAIL FINANCIAL SERVICES LIMITED","SELL",{"v":23660000,"d":"23,660,000"},0.91,"BSE"]
["2024-02-21",539277,"ALSTONE","SAHASTRAA ADVISORS PRIVATE LIMITED","BUY",{"v":14050000,"d":"14,050,000"},0.9,"BSE"]
{"$rows_left_out":188}
{"sheet":"Call Tracker (Equity & F&O)","index":5,"n_rows":342,"n_cols":19,"rows_kept":342,"merged":[[49,0,50,0],[49,1,50,1],[49,6,50,6],[49,9,50,9],[49,12,50,12],[49,14,50,14],[49,15,50,15],[68,0,69,0],[68,1,69,1],[68,9,69,9],[68,14,69,14],[68,15,69,15],[72,0,73,0],[72,1,73,1],[72,9,73,9],[72,12,73,12],[72,14,73,14],[72,15,73,15],[78,0,79,0],[78,1,79,1],[78,9,79,9],[78,12,79,12],[78,14,79,14],[78,15,79,15],[83,0,84,0],[83,1,84,1],[83,9,84,9],[83,12,84,12],[83,14,84,14],[83,15,84,15],[85,0,86,0],[85,1,86,1],[85,9,86,9],[85,12,86,12],[85,14,86,14],[85,15,86,15],[87,0,88,0],[87,1,88,1],[87,9,88,9],[87,12,88,12],[87,14,88,14],[87,15,88,15],[89,0,90,0],[89,1,90,1],[89,9,90,9],[89,12,90,12],[89,14,90,14],[89,15,90,15],[91,0,92,0],[91,1,92,1],[91,9,92,9],[91,12,92,12],[91,14,92,14],[91,15,92,15],[93,0,94,0],[93,1,94,1],[93,9,94,9],[93,12,94,12],[93,14,94,14],[93,15,94,15],[95,0,96,0],[95,1,96,1],[95,9,96,9],[95,12,96,12],[95,14,96,14],[95,15,96,15],[97,0,98,0],[97,1,98,1],[97,9,98,9],[97,12,98,12],[97,14,98,14],[97,15,98,15],[100,0,101,0],[100,1,101,1],[100,9,101,9],[100,12,101,12],[100,14,101,14],[100,15,101,15],[102,0,103,0],[102,1,103,1],[102,9,103,9],[102,15,103,15],[105,0,106,0],[105,1,106,1],[105,9,106,9],[105,12,106,12],[105,14,106,14],[105,15,106,15],[107,0,108,0],[107,1,108,1],[107,9,108,9],[107,15,108,15]]}
[]
[]
[]
[]
[{"$nulls":12},"Back To Main Page"]
["Retail Research Technical Calls & Fundamental Performance Report for the month of February-2024"]
[{"$nulls":12},{"$f":"Main!B10","v":"2024-02-22"}]
[null,"Positional  Call"]
["Sr.no","Date",null,"Company","Rec","Rec Price","Stop Loss***","Call Closed At","Target","Remark","Profit / Loss per Share","All charges","Net Gain / Loss  %","Status","Closed Date","Market Closing Price","Second Buying Date"]
[1,"2023-12-18",null,"SBIN","Accu",632,593,670,"680-720","Profit of Rs.38/-",{"$f":"H10-F10","v":38},{"$f":"(F10*-0.3)/100","v":{"v":-1.896,"d":"-1.90"}},{"$f":"(K10+L10)/F10","v":{"v":0.05712658227848101,"d":"5.71%"}},"Successful","2024-02-07",null,"2024-01-10",null,"H"]
[2,"2023-12-28",null,"VINATIORGA","Accu",1725,1645,1645,"1860-1960","Loss of Rs.80/-",{"$f":"H11-F11","v":-80},{"$f":"(F11*-0.3)/100","v":{"v":-5.175,"d":"-5.18"}},{"v":-0.049376811594202895,"d":"-4.94%"},"Unsuccessful","2024-02-09",null,"2024-01-10",null,"H"]
[3,"2024-01-03",null,"MARUTI","Accu",9937.5,9340,10410,"10700-11200","Profit of Rs.472.5/-",{"$f":"H12-F12","v":472.5},{"$f":"(F12*-0.3)/100","v":{"v":-29.8125,"d":"-29.81"}},{"$f":"(K12+L12)/F12","v":{"v":0.04454716981132076,"d":"4.45%"}},"Successful","2024-02-01",{"$nulls":3},"H"]
[4,"2024-01-12",null,"JUBLFOOD","Accu",521.5,490,487,"555-575","Loss of Rs.34.5/-",{"$f":"H13-F13","v":-34.5},{"$f":"(F13*-0.3)/100","v":{"v":-1.5644999999999998,"d":"-1.56"}},{"$f":"(K13+L13)/F13","v":{"v":-0.06915532118887824,"d":"-6.92%"}},"Unsuccessful","2024-02-05",null,"2024-01-18",null,"K"]
[5,"2024-01-16",null,"CAPACITE ","Accu",267.5,237,282.5,"300-330","Profit of Rs.15/-",{"$f":"H14-F14","v":15},{"$f":"(F14*-0.3)/100","v":{"v":-0.8025,"d":"-0.80"}},{"v":0.053074766355140184,"d":"5.31%"},"Successful","2024-02-08",{"$nulls":3},"H"]
[6,"2024-01-25",null,"FLUOROCHEM","Accu","3395-3575",3280,null,"3900-4200","Open",{"$nulls":5},{"$f":"VLOOKUP(D15,'MidCap Intra'!$B$11:$C$568,2,0)","v":3536.95},null,null,"H"]
[7,"2024-01-25",null,"VGUARD","Accu",288,267,305,"305-325","Profit of Rs.17/-",{"$f":"H16-F16","v":17},{"$f":"(F16*-0.3)/100","v":{"v":-0.8639999999999999,"d":"-0.86"}},{"$f":"(K16+L16)/F16","v":{"v":0.056027777777777774,"d":"5.60%"}},"Successful","2024-02-01",{"$nulls":3},"H"]
[8,"2024-01-29",null,"GMMPFAUDLR","Accu",1502.5,1415,1400,"1650-1750","Loss of Rs.102.5/-",{"$f":"H17-F17","v":-102.5},{"$f":"(F17*-0.3)/100","v":{"v":-4.5075,"d":"-4.51"}},{"v":-0.07121963394342762,"d":"-7.12%"},"Unsuccessful","2024-02-09",{"$nulls":3},"H"]
[9,"2024-01-30",null,"RELIANCE","Accu","2870-2790",2640,null,"3100-3200","Open",{"$nulls":5},{"$f":"VLOOKUP(D18,'MidCap Intra'!$B$11:$C$568,2,0)","v":{"v":2935.4,"d":"2935.40"}},null,null,"H"]
[10,"2024-01-30",null,"JAMNAAUTO","Accu",115.5,106,123,"124-130","Profit of Rs.7.5/-",{"$f":"H19-F19","v":7.5},{"$f":"(F19*-0.3)/100","v":{"v":-0.3465,"d":"-0.35"}},{"$f":"(K19+L19)/F19","v":{"v":0.06193506493506494,"d":"6.19%"}},"Successful","2024-02-05",{"$nulls":3},"H"]
[11,"2024-02-02",null,"DATAPATTNS","Accu",1880,1790,1990,"2040-2140","Profit of Rs.110/-",{"$f":"H20-F20","v":110},{"$f":"(F20*-0.3)/100","v":-5.64},{"$f":"(K20+L20)/F20","v":{"v":0.05551063829787234,"d":"5.55%"}},"Successful","2024-02-16",{"$nulls":3},"H"]
{"$rows_left_out":315}