{"text_format":"3","workbook":"xlsx","n_sheets":11,"sheets":["Main","Future Intra","Cash Intra","MidCap Intra","Bulk Deals","Call Tracker (Equity & F&O)","Sheet2","Sheet1","Sheet3","Sheet4","Sheet5"],"not_rendered":{"images":4,"defined_names":5},"read":"whole","date_system":"1900"}

{"sheet":"Main","index":0,"n_rows":27,"n_cols":11,"rows_kept":27}
[null,"                                                                                                 "]
{"$rows_empty":8}
[null,"2020-01-22"]
[]
[null,"Sheet No.","Template Name","Summary"]
[null,1,"Future Intra","For Intraday trading in F&O segment"]
[null,2,"Cash Intra","For Intraday trading in cash market segment"]
[null,3,"Mid-cap Intra","For Intraday trading in Mid-cap stocks"]
[null,4,"Bulk Deals","Reveals Bulk Deals carried on NSE & BSE"]
[null,5,"Call Tracker"]
{"$rows_empty":9}
[{"$nulls":10},"`"]

{"sheet":"Future Intra","index":1,"n_rows":190,"n_cols":15,"rows_kept":190,"merged":[[8,0,9,0],[8,1,9,1],[8,2,9,2],[8,5,8,7],[8,8,8,10]]}
[]
[]
[]
[]
[{"$nulls":12},"Back to Main Page"]
["FOR INTRA DAY TRADING",{"$nulls":10},{"$f":"Main!B10","v":"2020-01-22"}]
[]
[]
["Sr.no","Sector","Scrip","CLOSE RATE","Pivot Point","Supports",null,null,"Resistances"]
[null,"Sector",null,"Point","Point","S1","S2","S3","R1","R2","R3","HIGH","LOW","OI","% Change in OI"]
[1,"Index","BANKNIFTY",{"v":31042.8,"d":"31042.80"},{"v":31054.583333333332,"d":"31054.58"},{"v":30909.166666666664,"d":"30909.17"},{"v":30775.533333333333,"d":"30775.53"},{"v":30630.116666666665,"d":"30630.12"},{"v":31188.216666666664,"d":"31188.22"},{"v":31333.633333333328,"d":"31333.63"},{"v":31467.266666666663,"d":"31467.27"},31200,30920.95,1594040,{"v":0.029675085588786253,"d":"2.97%"}]
[2,"Index","NIFTY",{"v":12203.1,"d":"12203.10"},{"v":12209.449999999999,"d":"12209.45"},{"v":12174.899999999998,"d":"12174.90"},{"v":12146.699999999999,"d":"12146.70"},{"v":12112.149999999998,"d":"12112.15"},{"v":12237.649999999998,"d":"12237.65"},{"v":12272.199999999997,"d":"12272.20"},{"v":12300.399999999998,"d":"12300.40"},12244,12181.25,14739225,{"v":-0.004362055688404328,"d":"-0.44%"}]
[3,"Index","NIFTYIT",{"v":16128,"d":"16128.00"},{"v":16127.666666666666,"d":"16127.67"},{"v":16105.333333333332,"d":"16105.33"},{"v":16082.666666666666,"d":"16082.67"},{"v":16060.333333333332,"d":"16060.33"},{"v":16150.333333333332,"d":"16150.33"},{"v":16172.666666666664,"d":"16172.67"},{"v":16195.333333333332,"d":"16195.33"},16150,16105,6050,{"v":-0.032,"d":"-3.20%"}]
[4,"Cement","ACC",{"v":1501.1,"d":"1501.10"},{"v":1500.9666666666665,"d":"1500.97"},{"v":1490.083333333333,"d":"1490.08"},{"v":1479.0666666666666,"d":"1479.07"},{"v":1468.1833333333332,"d":"1468.18"},{"v":1511.983333333333,"d":"1511.98"},{"v":1522.8666666666666,"d":"1522.87"},{"v":1533.8833333333328,"d":"1533.88"},1511.85,1489.95,3934000,{"v":0.002241923978396005,"d":"0.22%"}]
[5,"Others","ADANIENT",{"v":225,"d":"225.00"},{"v":224.38333333333333,"d":"224.38"},{"v":221.36666666666665,"d":"221.37"},{"v":217.73333333333332,"d":"217.73"},{"v":214.71666666666664,"d":"214.72"},{"v":228.01666666666665,"d":"228.02"},{"v":231.0333333333333,"d":"231.03"},{"v":234.66666666666666,"d":"234.67"},227.4,220.75,29708000,{"v":-0.02302025782688766,"d":"-2.30%"}]
[6,"Others","ADANIPORTS",{"v":380.2,"d":"380.20"},{"v":379.8166666666666,"d":"379.82"},{"v":376.48333333333323,"d":"376.48"},{"v":372.76666666666665,"d":"372.77"},{"v":369.4333333333333,"d":"369.43"},{"v":383.5333333333332,"d":"383.53"},{"v":386.86666666666656,"d":"386.87"},{"v":390.58333333333314,"d":"390.58"},383.15,376.1,29650000,{"v":-0.028187479514913145,"d":"-2.82%"}]
[7,"Power","ADANIPOWER",{"v":62.9,"d":"62.90"},{"v":63.04999999999999,"d":"63.05"},{"v":62.39999999999998,"d":"62.40"},{"v":61.899999999999984,"d":"61.90"},{"v":61.24999999999997,"d":"61.25"},{"v":63.54999999999998,"d":"63.55"},{"v":64.2,"d":"64.20"},{"v":64.69999999999999,"d":"64.70"},63.7,62.55,76590000,{"v":1.9623233908948193E-3,"d":"0.20%"}]
[8,"Automobile","AMARAJABAT",{"v":778.2,"d":"778.20"},{"v":776.0833333333334,"d":"776.08"},{"v":769.3666666666668,"d":"769.37"},{"v":760.5333333333334,"d":"760.53"},{"v":753.8166666666668,"d":"753.82"},{"v":784.9166666666667,"d":"784.92"},{"v":791.6333333333332,"d":"791.63"},{"v":800.4666666666667,"d":"800.47"},782.8,767.25,1541600,{"v":0.02011646373742721,"d":"2.01%"}]
[9,"Cement","AMBUJACEM",208.35,{"v":208.36666666666667,"d":"208.37"},{"v":206.13333333333335,"d":"206.13"},{"v":203.91666666666669,"d":"203.92"},{"v":201.68333333333337,"d":"201.68"},{"v":210.58333333333334,"d":"210.58"},{"v":212.8166666666667,"d":"212.82"},{"v":215.03333333333333,"d":"215.03"},210.6,206.15,19210000,{"v":0.008266631675633119,"d":"0.83%"}]
[10,"Others","APOLLOHOSP",1632.15,{"v":1631.7,"d":"1631.70"},1620.45,1608.75,{"v":1597.5,"d":"1597.50"},{"v":1643.4,"d":"1643.40"},1654.65,{"v":1666.3500000000001,"d":"1666.35"},1642.95,1620,1752000,{"v":0.016831108531630876,"d":"1.68%"}]
{"$rows_left_out":155}
{"sheet":"Cash Intra","index":2,"n_rows":247,"n_cols":13,"rows_kept":247,"merged":[[7,0,8,0],[7,1,8,1],[7,2,8,2],[7,3,8,3],[7,4,7,6],[7,7,7,9]]}
[]
[]
[]
[]
[{"$nulls":12},"Back to Main Page"]
["FOR INTRA DAY TRADING",{"$nulls":9},{"$f":"Main!B10","v":"2020-01-22"}]
[]
["Sr.no","Scrip","CLOSE RATE","Pivot Point","Supports",null,null,"Resistances"]
[null,null,"Point",null,"S1","S2","S3","R1","R2","R3","HIGH","LOW","Total Trade Quanity in Lakhs"]
[1,"Nifty 50",12169.85,{"v":12187.4,"d":"12187.40"},12144.75,12119.65,{"v":12077,"d":"12077.00"},{"v":12212.5,"d":"12212.50"},{"v":12255.149999999998,"d":"12255.15"},12280.25,12230.05,12162.3]
[2,"Nifty Bank",30947.55,{"v":30992.466666666664,"d":"30992.47"},{"v":30813.683333333327,"d":"30813.68"},{"v":30679.816666666662,"d":"30679.82"},{"v":30501.033333333326,"d":"30501.03"},{"v":31126.33333333333,"d":"31126.33"},{"v":31305.11666666666,"d":"31305.12"},{"v":31438.98333333333,"d":"31438.98"},31171.25,30858.6]
[3,"Nifty CPSE",1854.45,{"v":1862.7666666666667,"d":"1862.77"},{"v":1842.5833333333333,"d":"1842.58"},{"v":1830.7166666666667,"d":"1830.72"},{"v":1810.5333333333333,"d":"1810.53"},{"v":1874.6333333333332,"d":"1874.63"},{"v":1894.8166666666666,"d":"1894.82"},{"v":1906.6833333333332,"d":"1906.68"},1882.95,1850.9]
[4,"Nifty Infra",3335.5,{"v":3338.5,"d":"3338.50"},3327.75,{"v":3320,"d":"3320.00"},3309.25,3346.25,{"v":3357,"d":"3357.00"},3364.75,3349.25,3330.75]
[5,"Nifty IT",16175.2,{"v":16176.766666666668,"d":"16176.77"},{"v":16132.033333333336,"d":"16132.03"},{"v":16088.866666666669,"d":"16088.87"},{"v":16044.133333333337,"d":"16044.13"},{"v":16219.933333333336,"d":"16219.93"},{"v":16264.66666666667,"d":"16264.67"},{"v":16307.833333333336,"d":"16307.83"},16221.5,16133.6]
[6,"Nifty PSE",3173,{"v":3185.7333333333336,"d":"3185.73"},{"v":3156.966666666667,"d":"3156.97"},{"v":3140.9333333333334,"d":"3140.93"},{"v":3112.166666666667,"d":"3112.17"},{"v":3201.7666666666673,"d":"3201.77"},{"v":3230.5333333333338,"d":"3230.53"},{"v":3246.5666666666675,"d":"3246.57"},3214.5,3169.7]
[7,"Nifty Midcap 50",4940.6,{"v":4943,"d":"4943.00"},{"v":4916,"d":"4916.00"},{"v":4891.4,"d":"4891.40"},{"v":4864.4,"d":"4864.40"},{"v":4967.6,"d":"4967.60"},{"v":4994.6,"d":"4994.60"},{"v":5019.200000000001,"d":"5019.20"},4970,4918.4]
[8,"ACC",1496.1,{"v":1497.5,"d":"1497.50"},{"v":1485.6,"d":"1485.60"},{"v":1475.1,"d":"1475.10"},{"v":1463.1999999999998,"d":"1463.20"},{"v":1508,"d":"1508.00"},{"v":1519.9,"d":"1519.90"},{"v":1530.4,"d":"1530.40"},1509.4,1487,3.5932]
[9,"AUBANK",888.35,{"v":885.2833333333333,"d":"885.28"},{"v":878.5666666666666,"d":"878.57"},{"v":868.7833333333333,"d":"868.78"},{"v":862.0666666666666,"d":"862.07"},{"v":895.0666666666666,"d":"895.07"},{"v":901.7833333333333,"d":"901.78"},{"v":911.5666666666666,"d":"911.57"},892,875.5,2.5552]
[10,"ADANIPORTS",379.95,{"v":379.0833333333333,"d":"379.08"},{"v":376.16666666666663,"d":"376.17"},{"v":372.3833333333333,"d":"372.38"},{"v":369.46666666666664,"d":"369.47"},{"v":382.8666666666666,"d":"382.87"},{"v":385.78333333333325,"d":"385.78"},{"v":389.5666666666666,"d":"389.57"},382,375.3,20.05178]
[11,"ADANIPOWER",62.75,{"v":62.9,"d":"62.90"},62.25,61.75,{"v":61.1,"d":"61.10"},{"v":63.4,"d":"63.40"},{"v":64.04999999999998,"d":"64.05"},64.55,63.55,62.4,46.51073]
{"$rows_left_out":228}
{"sheet":"MidCap Intra","index":3,"n_rows":545,"n_cols":13,"rows_kept":545,"merged":[[0,0,0,1],[8,0,9,0],[8,1,9,1],[8,2,9,2],[8,3,9,3],[8,4,8,6],[8,7,8,9]]}
[]
[]
[]
[]
[{"$nulls":11},"Back To Main Page"]
["FOR INTRA DAY TRADING",{"$nulls":9},{"$f":"Main!B10","v":"2020-01-22"}]
[null,null," "]
[]
["Sr.no","Scrip","CLOSE RATE","Pivot Point","Supports",null,null,"Resistances"]
[null,null,"Point",null,"S1","S2","S3","R1","R2","R3","HIGH","LOW","Total Trade Quanity in Lakhs"]
[1,"3MINDIA",22119.65,{"v":22140.63333333333,"d":"22140.63"},{"v":21978.966666666664,"d":"21978.97"},{"v":21838.283333333333,"d":"21838.28"},{"v":21676.616666666665,"d":"21676.62"},{"v":22281.316666666662,"d":"22281.32"},{"v":22442.983333333334,"d":"22442.98"},{"v":22583.66666666666,"d":"22583.67"},22302.3,21999.95,0.04571]
[2,"ACC",1496.1,{"v":1497.5,"d":"1497.50"},{"v":1485.6,"d":"1485.60"},{"v":1475.1,"d":"1475.10"},{"v":1463.1999999999998,"d":"1463.20"},{"v":1508,"d":"1508.00"},{"v":1519.9,"d":"1519.90"},{"v":1530.4,"d":"1530.40"},1509.4,1487,3.5932]
[3,"AIAENG",1789.85,1750.95,{"v":1701.9,"d":"1701.90"},1613.95,{"v":1564.9,"d":"1564.90"},{"v":1838.9,"d":"1838.90"},{"v":1887.9499999999998,"d":"1887.95"},{"v":1975.9,"d":"1975.90"},1800,1663,1.9031]
[4,"APLAPOLLO",1994.8,{"v":1979.9666666666665,"d":"1979.97"},{"v":1937.833333333333,"d":"1937.83"},{"v":1880.8666666666666,"d":"1880.87"},{"v":1838.7333333333331,"d":"1838.73"},{"v":2036.933333333333,"d":"2036.93"},{"v":2079.0666666666666,"d":"2079.07"},{"v":2136.033333333333,"d":"2136.03"},2022.1,1923,0.52625]
[5,"AUBANK",888.35,{"v":885.2833333333333,"d":"885.28"},{"v":878.5666666666666,"d":"878.57"},{"v":868.7833333333333,"d":"868.78"},{"v":862.0666666666666,"d":"862.07"},{"v":895.0666666666666,"d":"895.07"},{"v":901.7833333333333,"d":"901.78"},{"v":911.5666666666666,"d":"911.57"},892,875.5,2.5552]
[6,"AARTIIND",864.7,863.25,{"v":856.7,"d":"856.70"},{"v":848.7,"d":"848.70"},{"v":842.1500000000001,"d":"842.15"},871.25,{"v":877.8,"d":"877.80"},{"v":885.8,"d":"885.80"},869.8,855.25,0.77697]
[7,"AAVAS",1957.65,{"v":1975.8333333333333,"d":"1975.83"},{"v":1932.8166666666666,"d":"1932.82"},{"v":1907.9833333333333,"d":"1907.98"},{"v":1864.9666666666667,"d":"1864.97"},{"v":2000.6666666666665,"d":"2000.67"},{"v":2043.6833333333334,"d":"2043.68"},{"v":2068.5166666666664,"d":"2068.52"},2018.85,1951,0.37482]
[8,"ABBOTINDIA",12713.15,{"v":12681.050000000001,"d":"12681.05"},{"v":12612.100000000002,"d":"12612.10"},{"v":12511.050000000001,"d":"12511.05"},{"v":12442.100000000002,"d":"12442.10"},{"v":12782.100000000002,"d":"12782.10"},{"v":12851.050000000003,"d":"12851.05"},{"v":12952.100000000002,"d":"12952.10"},12750,12580,0.06644]
[9,"ADANIGAS",169.8,{"v":170.51666666666668,"d":"170.52"},{"v":168.48333333333335,"d":"168.48"},{"v":167.16666666666666,"d":"167.17"},{"v":165.13333333333333,"d":"165.13"},{"v":171.83333333333337,"d":"171.83"},{"v":173.86666666666673,"d":"173.87"},{"v":175.1833333333334,"d":"175.18"},172.55,169.2,6.46295]
[10,"ADANIGREEN",202.25,{"v":200.41666666666666,"d":"200.42"},{"v":193.83333333333331,"d":"193.83"},{"v":185.41666666666666,"d":"185.42"},{"v":178.83333333333331,"d":"178.83"},{"v":208.83333333333331,"d":"208.83"},{"v":215.41666666666663,"d":"215.42"},{"v":223.83333333333331,"d":"223.83"},207,192,35.06909]
{"$rows_left_out":513}
{"sheet":"Bulk Deals","index":4,"n_rows":53,"n_cols":8,"rows_kept":53,"merged":[[4,0,4,1],[4,2,4,3],[6,1,6,2]]}
[" "]
[]
[]
[]
[]
[{"$nulls":4},"Back To Main Page"]
["Subject :","BULK DEAL",null,{"$f":"Main!B10","v":"2020-01-22"}]
[]
["Date","Scrip code","Scrip Name","Client Name","Buy / Sell","Quantity Traded","Trade Price / Wt.Avg.trade price","Exchange  "]
["2020-01-21",511463,"ALEXANDER","KAHAR NIKLESH KANAIYABHAI","BUY",{"v":46523,"d":"46,523"},17.26,"BSE"]
["2020-01-21",511463,"ALEXANDER","KAHAR NIKLESH KANAIYABHAI","SELL",{"v":24100,"d":"24,100"},16.62,"BSE"]
["2020-01-21",540545,"BGJL","RAGHURAM SHIVRAM THAKKER","BUY",{"v":69000,"d":"69,000"},35.9,"BSE"]
["2020-01-21",530309,"CHANDRAP","RICHA ARNEJA","BUY",{"v":19893,"d":"19,893"},17.38,"BSE"]
["2020-01-21",530309,"CHANDRAP","TANUJ ARNEJA","SELL",{"v":20094,"d":"20,094"},17.38,"BSE"]
["2020-01-21",538521,"CROWNTOURS","MANJULABEN BHAVESHKUMAR RANGEE","SELL",{"v":18656,"d":"18,656"},18.47,"BSE"]
["2020-01-21",538432,"DIVINUS","BRIJESH UMESHBHAI JOSHI","BUY",{"v":26400,"d":"26,400"},32.1,"BSE"]
["2020-01-21",538432,"DIVINUS","JIGAR BHADRESH GANDHI","SELL",{"v":26400,"d":"26,400"},{"v":32,"d":"32.00"},"BSE"]
["2020-01-21",538432,"DIVINUS","MANOJKUMAR GUNVANTRAI SOMANI","BUY",{"v":26400,"d":"26,400"},{"v":32,"d":"32.00"},"BSE"]
["2020-01-21",538432,"DIVINUS","MANOJKUMAR GUNVANTRAI SOMANI","SELL",{"v":4400,"d":"4,400"},{"v":32.1,"d":"32.10"},"BSE"]
["2020-01-21",532940,"JKIL","NORGES BANK ON ACCOUNT OF THE GOVERNMENT PENSION FUND GLOBAL","BUY",{"v":2198182,"d":"2,198,182"},157,"BSE"]
{"$rows_left_out":34}
{"sheet":"Call Tracker (Equity & F&O)","index":5,"n_rows":331,"n_cols":18,"rows_kept":331,"merged":[[134,0,135,0],[134,1,135,1],[134,9,135,9],[134,11,135,11],[134,12,135,12],[134,13,135,13],[134,14,135,14],[136,0,137,0],[136,1,137,1],[136,9,137,9],[136,11,137,11],[136,12,137,12],[136,13,137,13],[136,14,137,14],[144,0,145,0],[144,1,145,1],[144,9,145,9],[144,11,145,11],[144,12,145,12],[144,13,145,13],[144,14,145,14],[148,0,149,0],[148,1,149,1],[148,9,149,9],[148,11,149,11],[148,12,149,12],[148,13,149,13],[148,14,149,14],[157,0,158,0],[157,1,158,1],[157,9,158,9],[157,11,158,11],[157,12,158,12],[157,13,158,13],[157,14,158,14],[159,0,160,0],[159,1,160,1],[159,9,160,9],[159,11,160,11],[159,12,160,12],[159,13,160,13],[159,14,160,14]]}
[]
[]
[]
[]
[{"$nulls":12},"Back To Main Page"]
["Retail Research Technical Calls & Fundamental Performance Report for the month of January-2020 "]
[{"$nulls":12},{"$f":"Main!B10","v":"2020-01-22"}]
[null,"Positional  Call"]
["Sr.no","Date",null,"Company","Rec","Rec Price","Stop Loss***","Call Closed At","Target","Remark","Profit / Loss per Share","Gain / Loss  %","Status","Closed Date","NSE Closed Price"]
[1,"2019-10-07",null,"PIDILITIND","Buy{}",1367.5,1297,1399.25,"1500-1520","Profit of Rs.31.75/-",{"$f":"H10-F10","v":31.75},{"$f":"K10/F10","v":{"v":0.023217550274223033,"d":"2.32%"}},"Successful","2020-01-06",{"$nulls":3},"R"]
[2,"2019-11-14",null,"HEIDELBERG","Buy{}",186.5,174,193,"205-210","Profit of Rs.5/-",{"$f":"H11-F11","v":6.5},{"$f":"K11/F11","v":{"v":0.03485254691689008,"d":"3.49%"}},"Successful","2020-01-07",{"$nulls":3},"H"]
[3,"2019-11-18",null,"BAJAJ-AUTO","Sell",3190,3356.7,3030,"2900-2850","Profit of Rs.160/-",{"$f":"F12-H12","v":160},{"v":0.050156739811912224,"d":"5.02%"},"Successful","2020-01-06",{"$nulls":3},"R"]
[4,"2019-11-20",null,"BRITANNIA","Buy","3075-3100",2930,null,"3380-3420","Open",{"$nulls":4},{"$f":"VLOOKUP(D13,Sheet2!A76:M1715,6,0)","v":3111.25},null,null,"H"]
[5,"2019-11-21",null,"HINDUNILVR","Buy{}",2020,1917,1999.75,"2200-2250","Loss of Rs.20/-",{"$f":"H14-F14","v":-20.25},{"$f":"K14/F14","v":{"v":-0.010024752475247525,"d":"-1.00%"}},"Successful","2020-01-06",{"$nulls":3},"H"]
[6,"2019-11-27",null,"LT","Buy","1330-1340",1270,null,"1450-1500","Open",{"$nulls":4},{"$f":"VLOOKUP(D15,Sheet2!A80:M1719,6,0)","v":1302.35},null,null,"H"]
[7,"2019-12-02",null,"HAVELLS","Buy",664.5,632.7,627.5,"725-735","Loss of Rs.37/-",{"$f":"H16-F16","v":-37},{"$f":"K16/F16","v":{"v":-0.05568096313017306,"d":"-5.57%"}},"Successful","2020-01-20",{"$nulls":3},"R"]
[8,"2019-12-06",null,"ONGC","Buy",127.5,122,132.5,140,"Part Profit of Rs.5/-",{"$f":"H17-F17","v":5},{"$f":"K17/F17","v":{"v":0.0392156862745098,"d":"3.92%"}},"Successful","2020-01-03",{"$f":"VLOOKUP(D17,Sheet2!A87:M1726,6,0)","v":122.75},null,null,"H"]
[9,"2019-12-23",null,"CANBK","Sell",227,238.3,216,"216-213","Profit of Rs.11/-",{"$f":"F18-H18","v":11},{"$f":"K18/F18","v":{"v":0.048458149779735685,"d":"4.85%"}},"Successful","2020-01-06",{"$nulls":3},"R"]
[10,"2019-12-24",null,"SBIN","Sell",334,351.3,317,"305-300","Profit of Rs.17/-",{"$f":"F19-H19","v":17},{"v":0.05089820359281437,"d":"5.09%"},"Successful","2020-01-07",{"$nulls":3},"R"]
[11,"2019-12-30",null,"EIHOTEL","Buy",140,132,147.5,"152-156","Profit of Rs.7.50/-",{"$f":"H20-F20","v":7.5},{"$f":"K20/F20","v":{"v":0.05357142857142857,"d":"5.36%"}},"Successful","2020-01-09",{"$nulls":3},"H"]
{"$rows_left_out":312}
{"sheet":"Sheet2","index":6,"n_rows":1899,"n_cols":14,"rows_kept":1899,"hidden":true}
["SYMBOL","SERIES","OPEN","HIGH","LOW","CLOSE","LAST","PREVCLOSE","TOTTRDQTY","TOTTRDVAL","TIMESTAMP","TOTALTRADES","ISIN","ISIN"]
["20MICRONS","EQ",34.35,35.5,33.3,34.25,34.3,34.35,18479,635892.25,"2020-01-21",204,"INE144J01027"]
["21STCENMGM","EQ",14.75,15.3,14.7,15,15,15,2745,40509.6,"2020-01-21",23,"INE253B01015"]
["3IINFOTECH","EQ",2.5,2.55,2.45,2.45,2.45,2.5,802128,1992372.95,"2020-01-21",602,"INE748C01020"]
["3MINDIA","EQ",22004.6,22302.3,21999.95,22119.65,22051.05,22273.9,4571,100677845.5,"2020-01-21",520,"INE470A01017"]
["3PLAND","EQ",7.2,7.2,7,7,7,6.9,1150,8270,"2020-01-21",7,"INE105C01023"]
["5PAISA","EQ",198,199,192.95,197.05,196.2,199.2,7505,1477265.95,"2020-01-21",247,"INE618L01018"]
["63MOONS","EQ",111.4,114.3,110.25,112.25,111.75,112.25,179454,20186706.65,"2020-01-21",3150,"INE111B01023"]
["A2ZINFRA","EQ",7.85,7.85,7.55,7.6,7.65,7.75,164826,1266728.05,"2020-01-21",304,"INE619I01012"]
["AARTIDRUGS","EQ",615,628.65,607.6,610.25,609.05,616.95,6529,4024607.35,"2020-01-21",646,"INE767A01016"]
["AARTIIND","EQ",862.5,869.8,855.25,864.7,862.5,863.9,77697,67070302.4,"2020-01-21",4183,"INE769A01020"]
["AARVEEDEN","EQ",14.65,14.7,14,14.35,14.5,14.3,2023,28740.05,"2020-01-21",55,"INE273D01019"]
["AAVAS","EQ",1990,2018.85,1951,1957.65,1956.7,2006.5,37482,74661229.7,"2020-01-21",4420,"INE216P01012"]
["ABAN","EQ",26.25,26.95,26.25,26.3,26.25,26.75,24742,657408.7,"2020-01-21",284,"INE421A01028"]
["ABB","EQ",1290,1319.45,1286,1310.15,1311,1290.6,37591,49243447.8,"2020-01-21",2047,"INE117A01022"]
["ABBOTINDIA","EQ",12660.6,12750,12580,12713.15,12715,12643.4,6644,84370670.85,"2020-01-21",1204,"INE358A01014"]
["ABCAPITAL","EQ",107.25,108.8,105.8,106.2,106,107.95,1372187,147209191.2,"2020-01-21",13465,"INE674K01013"]
["ABFRL","EQ",231.9,233.75,229,229.4,229.15,230.95,186185,42991789.85,"2020-01-21",4802,"INE647O01011"]
["ABSLBANETF","EQ",310.25,310.25,309.9,309.9,309.9,311.49,10,3101.8,"2020-01-21",3,"INF209KB1O58"]
["ABSLNN50ET","EQ",289.71,289.71,289.71,289.71,289.71,290.98,5,1448.55,"2020-01-21",1,"INF209KB1B87"]
{"$rows_left_out":1695}
{"sheet":"Sheet1","index":7,"n_rows":0,"n_cols":0,"rows_kept":0,"hidden":true}

{"sheet":"Sheet3","index":8,"n_rows":0,"n_cols":0,"rows_kept":0,"hidden":true}

{"sheet":"Sheet4","index":9,"n_rows":0,"n_cols":0,"rows_kept":0,"hidden":true}

{"sheet":"Sheet5","index":10,"n_rows":0,"n_cols":0,"rows_kept":0,"hidden":true}