{"text_format":"3","workbook":"xlsx","n_sheets":11,"sheets":["Main","Future Intra","Cash Intra","MidCap Intra","Bulk Deals","Call Tracker (Equity & F&O)","Sheet2","Sheet1","Sheet3","Sheet4","Sheet5"],"not_rendered":{"images":4,"defined_names":5},"read":"whole","date_system":"1900"}

{"sheet":"Main","index":0,"n_rows":27,"n_cols":11,"rows_kept":27}
[null,"                                                                                                 "]
{"$rows_empty":8}
[null,"2019-11-21"]
[]
[null,"Sheet No.","Template Name","Summary"]
[null,1,"Future Intra","For Intraday trading in F&O segment"]
[null,2,"Cash Intra","For Intraday trading in cash market segment"]
[null,3,"Mid-cap Intra","For Intraday trading in Mid-cap stocks"]
[null,4,"Bulk Deals","Reveals Bulk Deals carried on NSE & BSE"]
[null,5,"Call Tracker"]
{"$rows_empty":9}
[{"$nulls":10},"`"]

{"sheet":"Future Intra","index":1,"n_rows":193,"n_cols":15,"rows_kept":193,"merged":[[8,0,9,0],[8,1,9,1],[8,2,9,2],[8,5,8,7],[8,8,8,10]]}
[]
[]
[]
[]
[{"$nulls":12},"Back to Main Page"]
["FOR INTRA DAY TRADING",{"$nulls":10},{"$f":"Main!B10","v":"2019-11-21"}]
[]
[]
["Sr.no","Sector","Scrip","CLOSE RATE","Pivot Point","Supports",null,null,"Resistances"]
[null,"Sector",null,"Point","Point","S1","S2","S3","R1","R2","R3","HIGH","LOW","OI","% Change in OI"]
[1,"Index","BANKNIFTY",31321.25,{"v":31313.399999999998,"d":"31313.40"},{"v":31192.399999999994,"d":"31192.40"},{"v":31063.549999999996,"d":"31063.55"},{"v":30942.549999999992,"d":"30942.55"},{"v":31442.249999999996,"d":"31442.25"},{"v":31563.250000000004,"d":"31563.25"},{"v":31692.1,"d":"31692.10"},31434.4,31184.55,2024980,{"v":-0.015910813910541766,"d":"-1.59%"}]
[2,"Index","NIFTY",12018.15,{"v":12018.933333333334,"d":"12018.93"},{"v":11971.866666666669,"d":"11971.87"},{"v":11925.583333333334,"d":"11925.58"},{"v":11878.516666666668,"d":"11878.52"},{"v":12065.216666666669,"d":"12065.22"},{"v":12112.283333333335,"d":"12112.28"},{"v":12158.56666666667,"d":"12158.57"},12066,11972.65,16257450,{"v":-0.031325968825968824,"d":"-3.13%"}]
[3,"Index","NIFTYIT",{"v":15400,"d":"15400.00"},{"v":15395,"d":"15395.00"},{"v":15355,"d":"15355.00"},{"v":15310,"d":"15310.00"},{"v":15270,"d":"15270.00"},{"v":15440,"d":"15440.00"},{"v":15480,"d":"15480.00"},{"v":15525,"d":"15525.00"},15435,15350,8850,{"v":0.029069767441860465,"d":"2.91%"}]
[4,"Cement","ACC",1488.15,{"v":1493.6499999999999,"d":"1493.65"},{"v":1480.4499999999998,"d":"1480.45"},1472.75,1459.55,{"v":1501.3499999999997,"d":"1501.35"},1514.55,{"v":1522.2499999999995,"d":"1522.25"},1506.85,1485.95,2911600,{"v":0.030873813907378558,"d":"3.09%"}]
[5,"Others","ADANIENT",206.15,204.15,{"v":200.4,"d":"200.40"},194.65,{"v":190.9,"d":"190.90"},{"v":209.9,"d":"209.90"},213.65,{"v":219.4,"d":"219.40"},207.9,198.4,31228000,{"v":2.1822849807445442E-3,"d":"0.22%"}]
[6,"Others","ADANIPORTS",367.85,{"v":370.4166666666667,"d":"370.42"},{"v":362.1333333333334,"d":"362.13"},{"v":356.4166666666667,"d":"356.42"},{"v":348.1333333333334,"d":"348.13"},{"v":376.1333333333334,"d":"376.13"},{"v":384.4166666666667,"d":"384.42"},{"v":390.1333333333334,"d":"390.13"},378.7,364.7,19795000,{"v":0.02631237848347375,"d":"2.63%"}]
[7,"Power","ADANIPOWER",{"v":60.5,"d":"60.50"},{"v":60.38333333333333,"d":"60.38"},{"v":59.36666666666667,"d":"59.37"},{"v":58.233333333333334,"d":"58.23"},{"v":57.21666666666667,"d":"57.22"},{"v":61.516666666666666,"d":"61.52"},{"v":62.53333333333333,"d":"62.53"},{"v":63.666666666666664,"d":"63.67"},61.4,59.25,85610000,{"v":0.018075871090498276,"d":"1.81%"}]
[8,"Automobile","AMARAJABAT",{"v":748.6,"d":"748.60"},{"v":749.8166666666666,"d":"749.82"},{"v":741.8333333333333,"d":"741.83"},{"v":735.0666666666666,"d":"735.07"},{"v":727.0833333333333,"d":"727.08"},{"v":756.5833333333333,"d":"756.58"},{"v":764.5666666666666,"d":"764.57"},{"v":771.3333333333333,"d":"771.33"},757.8,743.05,1542300,{"v":-0.010331108829568789,"d":"-1.03%"}]
[9,"Cement","AMBUJACEM",201.95,{"v":202.16666666666666,"d":"202.17"},{"v":201.08333333333331,"d":"201.08"},{"v":200.21666666666667,"d":"200.22"},{"v":199.13333333333333,"d":"199.13"},{"v":203.0333333333333,"d":"203.03"},{"v":204.11666666666662,"d":"204.12"},{"v":204.9833333333333,"d":"204.98"},203.25,201.3,18315000,{"v":-0.01704011807325909,"d":"-1.70%"}]
[10,"Others","APOLLOHOSP",{"v":1421.4,"d":"1421.40"},{"v":1424.4666666666665,"d":"1424.47"},{"v":1411.083333333333,"d":"1411.08"},{"v":1400.7666666666667,"d":"1400.77"},{"v":1387.3833333333332,"d":"1387.38"},{"v":1434.7833333333328,"d":"1434.78"},{"v":1448.1666666666665,"d":"1448.17"},{"v":1458.4833333333327,"d":"1458.48"},1437.85,1414.15,1836000,{"v":-0.07366296670030273,"d":"-7.37%"}]
{"$rows_left_out":159}
{"sheet":"Cash Intra","index":2,"n_rows":247,"n_cols":13,"rows_kept":247,"merged":[[7,0,8,0],[7,1,8,1],[7,2,8,2],[7,3,8,3],[7,4,7,6],[7,7,7,9]]}
[]
[]
[]
[]
[{"$nulls":12},"Back to Main Page"]
["FOR INTRA DAY TRADING",{"$nulls":9},{"$f":"Main!B10","v":"2019-11-21"}]
[]
["Sr.no","Scrip","CLOSE RATE","Pivot Point","Supports",null,null,"Resistances"]
[null,null,"Point",null,"S1","S2","S3","R1","R2","R3","HIGH","LOW","Total Trade Quanity in Lakhs"]
[1,"Nifty 50",11999.1,12001.25,{"v":11963.9,"d":"11963.90"},{"v":11928.699999999999,"d":"11928.70"},{"v":11891.349999999999,"d":"11891.35"},12036.45,{"v":12073.8,"d":"12073.80"},{"v":12109.000000000002,"d":"12109.00"},12038.6,11966.05]
[2,"Nifty Bank",31353.85,{"v":31343.683333333334,"d":"31343.68"},{"v":31215.716666666667,"d":"31215.72"},{"v":31077.583333333332,"d":"31077.58"},{"v":30949.616666666665,"d":"30949.62"},{"v":31481.81666666667,"d":"31481.82"},{"v":31609.783333333336,"d":"31609.78"},{"v":31747.91666666667,"d":"31747.92"},31471.65,31205.55]
[3,"Nifty CPSE",1959.9,{"v":1963.4000000000003,"d":"1963.40"},{"v":1947.6000000000006,"d":"1947.60"},{"v":1935.3000000000002,"d":"1935.30"},{"v":1919.5000000000005,"d":"1919.50"},{"v":1975.7000000000007,"d":"1975.70"},{"v":1991.5000000000005,"d":"1991.50"},{"v":2003.8000000000009,"d":"2003.80"},1979.2,1951.1]
[4,"Nifty Infra",3325.35,{"v":3330.366666666667,"d":"3330.37"},{"v":3313.2333333333336,"d":"3313.23"},{"v":3301.116666666667,"d":"3301.12"},{"v":3283.9833333333336,"d":"3283.98"},{"v":3342.4833333333336,"d":"3342.48"},{"v":3359.616666666667,"d":"3359.62"},{"v":3371.7333333333336,"d":"3371.73"},3347.5,3318.25]
[5,"Nifty IT",15318.5,15300.85,{"v":15252.650000000001,"d":"15252.65"},{"v":15186.800000000001,"d":"15186.80"},{"v":15138.600000000002,"d":"15138.60"},{"v":15366.7,"d":"15366.70"},{"v":15414.900000000001,"d":"15414.90"},15480.75,15349.05,15235]
[6,"Nifty PSE",3310.65,{"v":3305.4500000000003,"d":"3305.45"},{"v":3295.0500000000006,"d":"3295.05"},{"v":3279.4500000000003,"d":"3279.45"},{"v":3269.0500000000006,"d":"3269.05"},{"v":3321.0500000000006,"d":"3321.05"},{"v":3331.4500000000003,"d":"3331.45"},{"v":3347.0500000000006,"d":"3347.05"},3315.85,3289.85]
[7,"Nifty Midcap 50",4668.9,{"v":4672.133333333333,"d":"4672.13"},{"v":4651.666666666666,"d":"4651.67"},{"v":4634.4333333333325,"d":"4634.43"},{"v":4613.966666666665,"d":"4613.97"},{"v":4689.366666666667,"d":"4689.37"},{"v":4709.833333333334,"d":"4709.83"},{"v":4727.0666666666675,"d":"4727.07"},4692.6,4654.9]
[8,"ACC",1483.75,{"v":1489.7666666666667,"d":"1489.77"},{"v":1474.9833333333333,"d":"1474.98"},{"v":1466.2166666666667,"d":"1466.22"},{"v":1451.4333333333334,"d":"1451.43"},{"v":1498.5333333333333,"d":"1498.53"},{"v":1513.3166666666666,"d":"1513.32"},{"v":1522.0833333333333,"d":"1522.08"},1504.55,1481,5.36347]
[9,"AUBANK",816.4,{"v":814.1666666666666,"d":"814.17"},{"v":798.3333333333333,"d":"798.33"},{"v":780.2666666666667,"d":"780.27"},{"v":764.4333333333333,"d":"764.43"},{"v":832.2333333333332,"d":"832.23"},{"v":848.0666666666665,"d":"848.07"},{"v":866.1333333333332,"d":"866.13"},830,796.1,2.42179]
[10,"ADANIPORTS",366.7,{"v":369.26666666666665,"d":"369.27"},{"v":361.4333333333333,"d":"361.43"},{"v":356.16666666666663,"d":"356.17"},{"v":348.33333333333326,"d":"348.33"},{"v":374.5333333333333,"d":"374.53"},{"v":382.3666666666667,"d":"382.37"},{"v":387.6333333333333,"d":"387.63"},377.1,364,63.85953]
[11,"ADANIPOWER",60.35,{"v":60.366666666666674,"d":"60.37"},{"v":59.283333333333346,"d":"59.28"},{"v":58.21666666666667,"d":"58.22"},{"v":57.13333333333334,"d":"57.13"},{"v":61.43333333333335,"d":"61.43"},{"v":62.51666666666668,"d":"62.52"},{"v":63.58333333333336,"d":"63.58"},61.45,59.3,91.65116]
{"$rows_left_out":228}
{"sheet":"MidCap Intra","index":3,"n_rows":545,"n_cols":13,"rows_kept":545,"merged":[[0,0,0,1],[8,0,9,0],[8,1,9,1],[8,2,9,2],[8,3,9,3],[8,4,8,6],[8,7,8,9]]}
[]
[]
[]
[]
[{"$nulls":11},"Back To Main Page"]
["FOR INTRA DAY TRADING",{"$nulls":9},{"$f":"Main!B10","v":"2019-11-21"}]
[null,null," "]
[]
["Sr.no","Scrip","CLOSE RATE","Pivot Point","Supports",null,null,"Resistances"]
[null,null,"Point",null,"S1","S2","S3","R1","R2","R3","HIGH","LOW","Total Trade Quanity in Lakhs"]
[1,"3MINDIA",22372.85,{"v":22375.933333333334,"d":"22375.93"},{"v":22271.916666666668,"d":"22271.92"},{"v":22170.983333333334,"d":"22170.98"},{"v":22066.966666666667,"d":"22066.97"},{"v":22476.86666666667,"d":"22476.87"},{"v":22580.88333333333,"d":"22580.88"},{"v":22681.81666666667,"d":"22681.82"},22479.95,22275,0.00624]
[2,"ACC",1483.75,{"v":1489.7666666666667,"d":"1489.77"},{"v":1474.9833333333333,"d":"1474.98"},{"v":1466.2166666666667,"d":"1466.22"},{"v":1451.4333333333334,"d":"1451.43"},{"v":1498.5333333333333,"d":"1498.53"},{"v":1513.3166666666666,"d":"1513.32"},{"v":1522.0833333333333,"d":"1522.08"},1504.55,1481,5.36347]
[3,"AIAENG",1648.75,{"v":1648.5833333333333,"d":"1648.58"},{"v":1632.1666666666665,"d":"1632.17"},{"v":1615.5833333333333,"d":"1615.58"},{"v":1599.1666666666665,"d":"1599.17"},{"v":1665.1666666666665,"d":"1665.17"},{"v":1681.583333333333,"d":"1681.58"},{"v":1698.1666666666665,"d":"1698.17"},1665,1632,0.07453]
[4,"APLAPOLLO",1542.5,{"v":1534.1833333333334,"d":"1534.18"},{"v":1518.3666666666668,"d":"1518.37"},{"v":1494.2333333333333,"d":"1494.23"},{"v":1478.4166666666667,"d":"1478.42"},{"v":1558.3166666666668,"d":"1558.32"},{"v":1574.1333333333334,"d":"1574.13"},{"v":1598.2666666666669,"d":"1598.27"},1550,1510.05,0.18906]
[5,"AUBANK",816.4,{"v":814.1666666666666,"d":"814.17"},{"v":798.3333333333333,"d":"798.33"},{"v":780.2666666666667,"d":"780.27"},{"v":764.4333333333333,"d":"764.43"},{"v":832.2333333333332,"d":"832.23"},{"v":848.0666666666665,"d":"848.07"},{"v":866.1333333333332,"d":"866.13"},830,796.1,2.42179]
[6,"AAVAS",1695.3,{"v":1701.7166666666665,"d":"1701.72"},{"v":1683.633333333333,"d":"1683.63"},{"v":1671.9666666666665,"d":"1671.97"},{"v":1653.883333333333,"d":"1653.88"},{"v":1713.383333333333,"d":"1713.38"},{"v":1731.4666666666665,"d":"1731.47"},{"v":1743.133333333333,"d":"1743.13"},1719.8,1690.05,0.16187]
[7,"ABBOTINDIA",12578.95,{"v":12655.883333333333,"d":"12655.88"},{"v":12413.766666666666,"d":"12413.77"},{"v":12248.583333333334,"d":"12248.58"},{"v":12006.466666666667,"d":"12006.47"},{"v":12821.066666666666,"d":"12821.07"},{"v":13063.18333333333,"d":"13063.18"},{"v":13228.366666666665,"d":"13228.37"},12898,12490.7,0.0889]
[8,"ADANIGAS",146.55,{"v":147.03333333333333,"d":"147.03"},{"v":145.66666666666666,"d":"145.67"},{"v":144.78333333333333,"d":"144.78"},{"v":143.41666666666666,"d":"143.42"},{"v":147.91666666666666,"d":"147.92"},{"v":149.28333333333333,"d":"149.28"},{"v":150.16666666666666,"d":"150.17"},148.4,146.15,5.27163]
[9,"ADANIGREEN",98.75,{"v":98.41666666666667,"d":"98.42"},{"v":95.93333333333334,"d":"95.93"},{"v":93.11666666666666,"d":"93.12"},{"v":90.63333333333333,"d":"90.63"},{"v":101.23333333333335,"d":"101.23"},{"v":103.71666666666667,"d":"103.72"},{"v":106.53333333333336,"d":"106.53"},100.9,95.6,22.79188]
[10,"ADANIPORTS",366.7,{"v":369.26666666666665,"d":"369.27"},{"v":361.4333333333333,"d":"361.43"},{"v":356.16666666666663,"d":"356.17"},{"v":348.33333333333326,"d":"348.33"},{"v":374.5333333333333,"d":"374.53"},{"v":382.3666666666667,"d":"382.37"},{"v":387.6333333333333,"d":"387.63"},377.1,364,63.85953]
{"$rows_left_out":513}
{"sheet":"Bulk Deals","index":4,"n_rows":70,"n_cols":8,"rows_kept":70,"merged":[[4,0,4,1],[4,2,4,3],[6,1,6,2]]}
[" "]
[]
[]
[]
[]
[{"$nulls":4},"Back To Main Page"]
["Subject :","BULK DEAL",null,{"$f":"Main!B10","v":"2019-11-21"}]
[]
["Date","Scrip code","Scrip Name","Client Name","Buy / Sell","Quantity Traded","Trade Price / Wt.Avg.trade price","Exchange  "]
["2019-11-20",538812,"AANCHALISP","DURGA ALLOY AND STEEL PRIVATE LIMITED","SELL",{"v":166000,"d":"166,000"},{"v":16.4,"d":"16.40"},"BSE"]
["2019-11-20",538812,"AANCHALISP","PREMILABEN MAHESHKUMAR CHAUHAN","BUY",{"v":125005,"d":"125,005"},16.06,"BSE"]
["2019-11-20",538812,"AANCHALISP","PREMILABEN MAHESHKUMAR CHAUHAN","SELL",{"v":125005,"d":"125,005"},16.11,"BSE"]
["2019-11-20",538812,"AANCHALISP","NEETA SETHIA","BUY",{"v":213000,"d":"213,000"},16.39,"BSE"]
["2019-11-20",538812,"AANCHALISP","NIMESHKUMAR BALDEVBHAI PARMAR","BUY",{"v":125005,"d":"125,005"},16.04,"BSE"]
["2019-11-20",538812,"AANCHALISP","NIMESHKUMAR BALDEVBHAI PARMAR","SELL",{"v":125005,"d":"125,005"},15.98,"BSE"]
["2019-11-20",540205,"AVL","YASHOVARDHAN SINHA","BUY",{"v":96000,"d":"96,000"},23.94,"BSE"]
["2019-11-20",542727,"CPML","VIJETA BROKING INDIA PRIVATE LIMITED","BUY",{"v":4000,"d":"4,000"},25.25,"BSE"]
["2019-11-20",542727,"CPML","VIJETA BROKING INDIA PRIVATE LIMITED","SELL",{"v":56000,"d":"56,000"},21.24,"BSE"]
["2019-11-20",538432,"DIVINUS","PRADIP HANUMANT KADAM","SELL",{"v":22301,"d":"22,301"},{"v":27,"d":"27.00"},"BSE"]
["2019-11-20",538432,"DIVINUS","MANOJKUMAR GUNVANTRAI SOMANI","BUY",{"v":22300,"d":"22,300"},27,"BSE"]
{"$rows_left_out":51}
{"sheet":"Call Tracker (Equity & F&O)","index":5,"n_rows":363,"n_cols":18,"rows_kept":363,"merged":[[112,0,113,0],[112,1,113,1],[112,9,113,9],[112,11,113,11],[112,12,113,12],[112,13,113,13],[112,14,113,14],[114,0,115,0],[114,1,115,1],[114,9,115,9],[114,11,115,11],[114,12,115,12],[114,13,115,13],[114,14,115,14],[116,0,117,0],[116,1,117,1],[116,9,117,9],[116,11,117,11],[116,12,117,12],[116,13,117,13],[116,14,117,14],[118,0,119,0],[118,1,119,1],[118,9,119,9],[118,11,119,11],[118,12,119,12],[118,13,119,13],[118,14,119,14],[120,0,121,0],[120,1,121,1],[120,9,121,9],[120,11,121,11],[120,12,121,12],[120,13,121,13],[120,14,121,14],[122,0,123,0],[122,1,123,1],[122,9,123,9],[122,11,123,11],[122,12,123,12],[122,13,123,13],[122,14,123,14],[124,0,125,0],[124,1,125,1],[124,9,125,9],[124,11,125,11],[124,12,125,12],[124,13,125,13],[124,14,125,14],[126,0,127,0],[126,1,127,1],[126,9,127,9],[126,11,127,11],[126,12,127,12],[126,13,127,13],[126,14,127,14],[128,0,129,0],[128,1,129,1],[128,9,129,9],[128,11,129,11],[128,12,129,12],[128,13,129,13],[128,14,129,14],[130,0,131,0],[130,1,131,1],[130,9,131,9],[130,11,131,11],[130,12,131,12],[130,13,131,13],[130,14,131,14],[132,0,133,0],[132,1,133,1],[132,9,133,9],[132,11,133,11],[132,12,133,12],[132,13,133,13],[132,14,133,14],[134,0,135,0],[134,1,135,1],[134,9,135,9],[134,11,135,11],[134,12,135,12],[134,13,135,13],[134,14,135,14],[136,0,137,0],[136,1,137,1],[136,9,137,9],[136,11,137,11],[136,12,137,12],[136,13,137,13],[136,14,137,14],[138,0,139,0],[138,1,139,1],[138,9,139,9],[138,11,139,11],[138,12,139,12],[138,13,139,13],[138,14,139,14],[140,0,141,0],[140,1,141,1],[140,9,141,9],[140,11,141,11],[140,12,141,12],[140,13,141,13],[140,14,141,14],[142,0,143,0],[142,1,143,1],[142,9,143,9],[142,11,143,11],[142,12,143,12],[142,13,143,13],[142,14,143,14],[144,0,145,0],[144,1,145,1],[144,9,145,9],[144,11,145,11],[144,12,145,12],[144,13,145,13],[144,14,145,14],[147,0,148,0],[147,1,148,1],[147,9,148,9],[147,11,148,11],[147,12,148,12],[147,13,148,13],[147,14,148,14],[149,0,150,0],[149,1,150,1],[149,9,150,9],[149,11,150,11],[149,12,150,12],[149,13,150,13],[149,14,150,14],[160,0,161,0],[160,1,161,1],[160,9,161,9],[160,11,161,11],[160,12,161,12],[160,13,161,13],[160,14,161,14],[162,0,163,0],[162,1,163,1],[162,9,163,9],[162,11,163,11],[162,12,163,12],[162,13,163,13],[162,14,163,14],[165,0,166,0],[165,1,166,1],[165,9,166,9],[165,11,166,11],[165,12,166,12],[165,13,166,13],[165,14,166,14],[167,0,168,0],[167,1,168,1],[167,9,168,9],[167,11,168,11],[167,12,168,12],[167,13,168,13],[167,14,168,14],[169,0,170,0],[169,1,170,1],[169,9,170,9],[169,11,170,11],[169,12,170,12],[169,13,170,13],[169,14,170,14],[171,0,172,0],[171,1,172,1],[171,9,172,9],[171,11,172,11],[171,12,172,12],[171,13,172,13],[171,14,172,14],[173,0,174,0],[173,1,174,1],[173,9,174,9],[173,11,174,11],[173,12,174,12],[173,13,174,13],[173,14,174,14],[176,0,177,0],[176,1,177,1],[176,9,177,9],[176,11,177,11],[176,12,177,12],[176,13,177,13],[176,14,177,14],[178,0,179,0],[178,1,179,1],[178,9,179,9],[178,11,179,11],[178,12,179,12],[178,13,179,13],[178,14,179,14],[180,0,181,0],[180,1,181,1],[180,9,181,9],[180,11,181,11],[180,12,181,12],[180,13,181,13],[180,14,181,14],[184,0,185,0],[184,1,185,1],[184,9,185,9],[184,11,185,11],[184,12,185,12],[184,13,185,13],[184,14,185,14],[186,0,187,0],[186,1,187,1],[186,9,187,9],[186,11,187,11],[186,12,187,12],[186,13,187,13],[186,14,187,14],[188,0,189,0],[188,1,189,1],[188,9,189,9],[188,11,189,11],[188,12,189,12],[188,13,189,13],[188,14,189,14]]}
[]
[]
[]
[]
[{"$nulls":12},"Back To Main Page"]
["Retail Research Technical Calls & Fundamental Performance Report for the month of November-2019 "]
[{"$nulls":12},{"$f":"Main!B10","v":"2019-11-21"}]
[null,"Positional  Call"]
["Sr.no","Date",null,"Company","Rec","Rec Price","Stop Loss***","Call Closed At","Target","Remark","Profit / Loss per Share","Gain / Loss  %","Status","Closed Date","NSE Closed Price"]
[1,"2019-09-26",null,"HDFC","Buy",2070,1940,2165,"2250-2300","Profit of Rs.95/-",{"$f":"H10-F10","v":95},{"$f":"K10/F10","v":{"v":0.04589371980676329,"d":"4.59%"}},"Successful","2019-11-01",{"$nulls":3},"H"]
[2,"2019-10-01",null,"UPL","Buy{}",595,564,599.5,"650-660","Profit of Rs.4.50/-",4.5,{"v":0.007563025210084034,"d":"0.76%"},"Neutral","2019-11-07",{"$nulls":3},"R"]
[3,"2019-10-07",null,"PIDILITIND","Buy{}",1367.5,1297,1413.5,"1500-1520","Part Profit of Rs.46/-",{"$f":"H12-F12","v":46},{"$f":"K12/F12","v":{"v":0.03363802559414991,"d":"3.36%"}},"Successful","2019-10-31",{"$f":"VLOOKUP(D12,Sheet2!A51:M1690,6,0)","v":1328.1},null,null,"R"]
[4,"2019-10-22",null,"HEIDELBERG","Buy",188.5,178,199,"205-210","Profit of Rs.10.50/-",10.5,{"v":0.05570291777188329,"d":"5.57%"},"Successful","2019-11-05",{"$nulls":3},"H"]
[5,"2019-10-27",null,"AMBUJACEM","Buy{}",197,185.4,203.5,"216-220","Part Profit of Rs.6.5/-",{"$f":"H14-F14","v":6.5},{"$f":"K14/F14","v":{"v":0.03299492385786802,"d":"3.30%"}},"Successful","2019-10-30",{"$f":"VLOOKUP(D14,Sheet2!A60:M1699,6,0)","v":201.6},null,null,"R"]
[6,"2019-11-04",null,"UBL","Buy{}",1240,1178,1292.5,"1340-1360","Profit of Rs.52.5/-",{"$f":"H15-F15","v":52.5},{"$f":"K15/F15","v":{"v":0.04233870967741935,"d":"4.23%"}},"Successful","2019-11-08",{"$nulls":3},"H"]
[7,"2019-11-05",null,"TATAMOTORS","Sell",173,183.3,166.5,"158-155","Part Profit of Rs.6.5/-",{"$f":"F16-H16","v":6.5},{"v":0.03757225433526012,"d":"3.76%"},"Successful","2019-11-14",{"$f":"VLOOKUP(D16,Sheet2!A62:M1701,6,0)","v":167.4},null,null,"R"]
[8,"2019-11-06",null,"BANDHANBNK","Buy",572.5,538,547,"630-650","Loss of Rs.25.5/-",-25.5,{"$f":"K17/F17","v":{"v":-0.0445414847161572,"d":"-4.45%"}},"Unsuccessful","2019-11-11",{"$nulls":3},"H"]
[9,"2019-11-07",null,"PRESTIGE","Buy",312,288,288.5,"340-360","Loss of Rs.23.5/-",{"$f":"H18-F18","v":-23.5},{"$f":"K18/F18","v":{"v":-0.07532051282051282,"d":"-7.53%"}},"Unsuccessful","2019-11-15",{"$nulls":3},"H"]
[10,"2019-11-07",null,"JINDALSTEL","Sell",138,148.3,143,"120-117","Loss of Rs.5/-",{"$f":"F19-H19","v":-5},{"$f":"K19/F19","v":{"v":-0.036231884057971016,"d":"-3.62%"}},"Unsuccessful","2019-11-07",{"$nulls":3},"R"]
[11,"2019-11-08",null,"CIPLA","Sell{}",465,491.3,440,"425-418","Profit of Rs.25/-",{"$f":"F20-H20","v":25},{"v":0.053763440860215055,"d":"5.38%"},"Successful","2019-11-15",{"$nulls":3},"R"]
{"$rows_left_out":338}
{"sheet":"Sheet2","index":6,"n_rows":1899,"n_cols":14,"rows_kept":1899,"hidden":true}
["SYMBOL","SERIES","OPEN","HIGH","LOW","CLOSE","LAST","PREVCLOSE","TOTTRDQTY","TOTTRDVAL","TIMESTAMP","TOTALTRADES","ISIN","ISIN"]
["20MICRONS","EQ",34.05,35,34.05,34.9,35,34.05,15616,541869.8,"2019-11-20",298,"INE144J01027"]
["21STCENMGM","EQ",13.75,14.2,13.75,14.1,13.9,13.95,1111,15762.65,"2019-11-20",12,"INE253B01015"]
["3IINFOTECH","EQ",1.95,2,1.9,1.95,2,1.95,1502581,2950041.85,"2019-11-20",907,"INE748C01020"]
["3MINDIA","EQ",22275,22479.95,22275,22372.85,22377,22310.05,624,13965895.85,"2019-11-20",408,"INE470A01017"]
["3PLAND","EQ",6.2,6.2,6.2,6.2,6.2,6.2,1011,6268.2,"2019-11-20",3,"INE105C01023"]
["5PAISA","EQ",156,156.05,150,154.05,154.05,154.9,10551,1613671.8,"2019-11-20",534,"INE618L01018"]
["63MOONS","EQ",104.25,105.4,99.8,101.9,102.4,104.2,134765,13785005.5,"2019-11-20",2272,"INE111B01023"]
["A2ZINFRA","EQ",8.85,9.05,8.8,8.85,8.9,8.85,144655,1290259.55,"2019-11-20",318,"INE619I01012"]
["AARTIDRUGS","EQ",524,527,520,525.25,525,520.9,8356,4384880.8,"2019-11-20",732,"INE767A01016"]
["AARTIIND","EQ",848.9,857.5,833.1,847.75,851,841.5,94048,79715991.7,"2019-11-20",4803,"INE769A01020"]
["AARVEEDEN","EQ",12.95,12.95,12.4,12.6,12.5,12.35,6814,85958.55,"2019-11-20",83,"INE273D01019"]
["AAVAS","EQ",1705,1719.8,1690.05,1695.3,1695,1688.95,16187,27542513.85,"2019-11-20",2827,"INE216P01012"]
["ABAN","BE",28.15,28.45,27,28.1,28.4,27.55,24069,669203,"2019-11-20",249,"INE421A01028"]
["ABB","EQ",1471.5,1475,1439.25,1449.65,1441,1474.55,637863,937384740.2,"2019-11-20",3291,"INE117A01022"]
["ABBOTINDIA","EQ",12898,12898,12490.7,12578.95,12521,12785.15,8890,113083279.2,"2019-11-20",2366,"INE358A01014"]
["ABCAPITAL","EQ",84.2,85.9,84,85.6,85.5,83.65,2269017,193245289.15,"2019-11-20",18024,"INE674K01013"]
["ABFRL","EQ",217.65,219.05,213.4,216.05,216.2,217.65,400831,86803852.6,"2019-11-20",12442,"INE647O01011"]
["ABSLBANETF","EQ",315,316.2,315,315.72,315.72,314.5,120,37819.2,"2019-11-20",3,"INF209KB1O58"]
["ABSLNN50ET","EQ",284.01,284.01,284.01,284.01,284.01,282.7,26,7384.26,"2019-11-20",1,"INF209KB1B87"]
{"$rows_left_out":1701}
{"sheet":"Sheet1","index":7,"n_rows":0,"n_cols":0,"rows_kept":0,"hidden":true}

{"sheet":"Sheet3","index":8,"n_rows":0,"n_cols":0,"rows_kept":0,"hidden":true}

{"sheet":"Sheet4","index":9,"n_rows":0,"n_cols":0,"rows_kept":0,"hidden":true}

{"sheet":"Sheet5","index":10,"n_rows":0,"n_cols":0,"rows_kept":0,"hidden":true}