{"text_format":"3","workbook":"xlsx","n_sheets":10,"sheets":["Main","Future Intra","Cash Intra","MidCap Intra","Bulk Deals","Call Tracker (Equity & F&O)","Sheet2","Sheet1","Sheet3","Sheet4"],"not_rendered":{"images":4,"defined_names":5},"read":"whole","date_system":"1900"}

{"sheet":"Main","index":0,"n_rows":27,"n_cols":11,"rows_kept":27}
[null,"                                                                                                 "]
{"$rows_empty":8}
[null,"2019-07-19"]
[]
[null,"Sheet No.","Template Name","Summary"]
[null,1,"Future Intra","For Intraday trading in F&O segment"]
[null,2,"Cash Intra","For Intraday trading in cash market segment"]
[null,3,"Mid-cap Intra","For Intraday trading in Mid-cap stocks"]
[null,4,"Bulk Deals","Reveals Bulk Deals carried on NSE & BSE"]
[null,5,"Call Tracker"]
{"$rows_empty":9}
[{"$nulls":10},"`"]

{"sheet":"Future Intra","index":1,"n_rows":236,"n_cols":15,"rows_kept":236,"merged":[[8,0,9,0],[8,1,9,1],[8,2,9,2],[8,5,8,7],[8,8,8,10]]}
[]
[]
[]
[]
[{"$nulls":12},"Back to Main Page"]
["FOR INTRA DAY TRADING",{"$nulls":10},{"$f":"Main!B10","v":"2019-07-19"}]
[]
[]
["Sr.no","Sector","Scrip","CLOSE RATE","Pivot Point","Supports",null,null,"Resistances"]
[null,"Sector",null,"Point","Point","S1","S2","S3","R1","R2","R3","HIGH","LOW","OI","% Change in OI"]
[1,"Index","BANKNIFTY",30448.65,{"v":30534.733333333334,"d":"30534.73"},{"v":30324.466666666667,"d":"30324.47"},{"v":30200.283333333333,"d":"30200.28"},{"v":29990.016666666666,"d":"29990.02"},{"v":30658.916666666668,"d":"30658.92"},{"v":30869.183333333338,"d":"30869.18"},{"v":30993.36666666667,"d":"30993.37"},30745,30410.55,1989900,{"v":0.04405175399015709,"d":"4.41%"}]
[2,"Index","NIFTY",11604.35,{"v":11619.916666666666,"d":"11619.92"},{"v":11574.533333333333,"d":"11574.53"},{"v":11544.716666666667,"d":"11544.72"},{"v":11499.333333333334,"d":"11499.33"},{"v":11649.733333333332,"d":"11649.73"},{"v":11695.116666666667,"d":"11695.12"},{"v":11724.93333333333,"d":"11724.93"},11665.3,11590.1,20328300,{"v":0.016924733522678242,"d":"1.69%"}]
[3,"Index","NIFTYIT",{"v":15538,"d":"15538.00"},{"v":15569.666666666666,"d":"15569.67"},{"v":15469.333333333332,"d":"15469.33"},{"v":15400.666666666666,"d":"15400.67"},{"v":15300.333333333332,"d":"15300.33"},{"v":15638.333333333332,"d":"15638.33"},{"v":15738.666666666664,"d":"15738.67"},{"v":15807.333333333332,"d":"15807.33"},15670,15501,17300,{"v":-0.0335195530726257,"d":"-3.35%"}]
[4,"Cement","ACC",1572.45,1583.25,1554.25,1536.05,1507.05,1601.45,1630.45,1648.65,1612.25,1565.05,2400800,{"v":0.12144992526158445,"d":"12.14%"}]
[5,"Others","ADANIENT",{"v":134.5,"d":"134.50"},135.25,132.45,{"v":130.39999999999998,"d":"130.40"},{"v":127.59999999999997,"d":"127.60"},{"v":137.3,"d":"137.30"},{"v":140.10000000000002,"d":"140.10"},{"v":142.15000000000003,"d":"142.15"},138.05,133.2,29952000,{"v":0.009981116806042621,"d":"1.00%"}]
[6,"Others","ADANIPORTS",413.75,415.25,{"v":410.6,"d":"410.60"},{"v":407.45000000000005,"d":"407.45"},{"v":402.80000000000007,"d":"402.80"},{"v":418.4,"d":"418.40"},{"v":423.04999999999995,"d":"423.05"},{"v":426.19999999999993,"d":"426.20"},419.9,412.1,15832500,{"v":-0.00892018779342723,"d":"-0.89%"}]
[7,"Power","ADANIPOWER",62.45,{"v":63.20000000000001,"d":"63.20"},{"v":60.500000000000014,"d":"60.50"},{"v":58.550000000000004,"d":"58.55"},{"v":55.85000000000001,"d":"55.85"},{"v":65.15000000000002,"d":"65.15"},{"v":67.85000000000002,"d":"67.85"},{"v":69.80000000000003,"d":"69.80"},65.9,61.25,125480000,{"v":-0.020911360799001247,"d":"-2.09%"}]
[8,"Automobile","AMARAJABAT",{"v":635.9,"d":"635.90"},{"v":639.9833333333332,"d":"639.98"},{"v":628.9166666666665,"d":"628.92"},{"v":621.9333333333333,"d":"621.93"},{"v":610.8666666666666,"d":"610.87"},{"v":646.9666666666665,"d":"646.97"},{"v":658.0333333333333,"d":"658.03"},{"v":665.0166666666664,"d":"665.02"},651.05,633,1468600,{"v":6.7178502879078695E-3,"d":"0.67%"}]
[9,"Cement","AMBUJACEM",217.55,{"v":218.38333333333333,"d":"218.38"},{"v":214.91666666666666,"d":"214.92"},{"v":212.28333333333333,"d":"212.28"},{"v":208.81666666666666,"d":"208.82"},{"v":221.01666666666665,"d":"221.02"},{"v":224.48333333333335,"d":"224.48"},{"v":227.11666666666665,"d":"227.12"},221.85,215.75,20015000,{"v":0.07679892400806994,"d":"7.68%"}]
[10,"Others","APOLLOHOSP",{"v":1390.6,"d":"1390.60"},{"v":1386.6500000000003,"d":"1386.65"},{"v":1373.3500000000006,"d":"1373.35"},{"v":1356.1000000000004,"d":"1356.10"},{"v":1342.8000000000006,"d":"1342.80"},{"v":1403.9000000000005,"d":"1403.90"},{"v":1417.2000000000003,"d":"1417.20"},{"v":1434.4500000000005,"d":"1434.45"},1399.95,1369.4,1514000,{"v":5.980066445182724E-3,"d":"0.60%"}]
{"$rows_left_out":172}
{"sheet":"Cash Intra","index":2,"n_rows":247,"n_cols":13,"rows_kept":247,"merged":[[7,0,8,0],[7,1,8,1],[7,2,8,2],[7,3,8,3],[7,4,7,6],[7,7,7,9]]}
[]
[]
[]
[]
[{"$nulls":12},"Back to Main Page"]
["FOR INTRA DAY TRADING",{"$nulls":9},{"$f":"Main!B10","v":"2019-07-19"}]
[]
["Sr.no","Scrip","CLOSE RATE","Pivot Point","Supports",null,null,"Resistances"]
[null,null,"Point",null,"S1","S2","S3","R1","R2","R3","HIGH","LOW","Total Trade Quanity in Lakhs"]
[1,"Nifty 50",11596.9,{"v":11618.816666666666,"d":"11618.82"},{"v":11560.483333333332,"d":"11560.48"},{"v":11524.066666666666,"d":"11524.07"},{"v":11465.733333333332,"d":"11465.73"},{"v":11655.233333333332,"d":"11655.23"},{"v":11713.566666666668,"d":"11713.57"},{"v":11749.983333333332,"d":"11749.98"},11677.15,11582.4]
[2,"Nifty Bank",30430.6,{"v":30526.18333333333,"d":"30526.18"},{"v":30283.016666666663,"d":"30283.02"},{"v":30135.43333333333,"d":"30135.43"},{"v":29892.266666666663,"d":"29892.27"},{"v":30673.766666666663,"d":"30673.77"},{"v":30916.933333333327,"d":"30916.93"},{"v":31064.516666666663,"d":"31064.52"},30769.35,30378.6]
[3,"Nifty CPSE",2103.8,{"v":2126.4500000000003,"d":"2126.45"},{"v":2078.4500000000007,"d":"2078.45"},{"v":2053.1000000000004,"d":"2053.10"},{"v":2005.1000000000008,"d":"2005.10"},{"v":2151.8000000000006,"d":"2151.80"},{"v":2199.7999999999997,"d":"2199.80"},{"v":2225.1500000000005,"d":"2225.15"},2174.45,2101.1]
[4,"Nifty Infra",3194.2,3209.85,{"v":3175.1,"d":"3175.10"},{"v":3156,"d":"3156.00"},3121.25,3228.95,{"v":3263.7,"d":"3263.70"},{"v":3282.7999999999997,"d":"3282.80"},3244.6,3190.75]
[5,"Nifty IT",15498.45,{"v":15530.116666666669,"d":"15530.12"},{"v":15423.383333333337,"d":"15423.38"},{"v":15348.316666666668,"d":"15348.32"},{"v":15241.583333333336,"d":"15241.58"},{"v":15605.183333333338,"d":"15605.18"},{"v":15711.916666666668,"d":"15711.92"},{"v":15786.983333333339,"d":"15786.98"},15636.85,15455.05]
[6,"Nifty PSE",3349.1,{"v":3376.9,"d":"3376.90"},{"v":3318.2000000000003,"d":"3318.20"},{"v":3287.3,"d":"3287.30"},{"v":3228.6000000000004,"d":"3228.60"},{"v":3407.8,"d":"3407.80"},{"v":3466.5,"d":"3466.50"},{"v":3497.4,"d":"3497.40"},3435.6,3346]
[7,"Nifty Midcap 50",4620.15,{"v":4652.266666666666,"d":"4652.27"},{"v":4582.533333333333,"d":"4582.53"},{"v":4544.916666666666,"d":"4544.92"},{"v":4475.1833333333325,"d":"4475.18"},{"v":4689.883333333333,"d":"4689.88"},{"v":4759.616666666667,"d":"4759.62"},{"v":4797.233333333334,"d":"4797.23"},4722,4614.65]
[8,"ABB",1454.1,{"v":1466.3666666666668,"d":"1466.37"},{"v":1432.7333333333336,"d":"1432.73"},{"v":1411.3666666666668,"d":"1411.37"},{"v":1377.7333333333336,"d":"1377.73"},{"v":1487.7333333333336,"d":"1487.73"},{"v":1521.3666666666668,"d":"1521.37"},{"v":1542.7333333333336,"d":"1542.73"},1500,1445,0.63333]
[9,"ACC",1567.1,{"v":1578.8166666666668,"d":"1578.82"},{"v":1548.4333333333336,"d":"1548.43"},{"v":1529.7666666666669,"d":"1529.77"},{"v":1499.3833333333337,"d":"1499.38"},{"v":1597.4833333333336,"d":"1597.48"},{"v":1627.8666666666668,"d":"1627.87"},{"v":1646.5333333333335,"d":"1646.53"},1609.2,1560.15,14.75891]
[10,"AUBANK",669.35,{"v":670.4833333333335,"d":"670.48"},{"v":666.0166666666669,"d":"666.02"},{"v":662.6833333333334,"d":"662.68"},{"v":658.2166666666668,"d":"658.22"},{"v":673.816666666667,"d":"673.82"},{"v":678.2833333333334,"d":"678.28"},{"v":681.616666666667,"d":"681.62"},674.95,667.15,0.81812]
[11,"ADANIPORTS",412.4,{"v":414.15000000000003,"d":"414.15"},{"v":409.00000000000006,"d":"409.00"},{"v":405.6,"d":"405.60"},{"v":400.45000000000005,"d":"400.45"},{"v":417.55000000000007,"d":"417.55"},{"v":422.70000000000005,"d":"422.70"},{"v":426.1000000000001,"d":"426.10"},419.3,410.75,13.00071]
{"$rows_left_out":228}
{"sheet":"MidCap Intra","index":3,"n_rows":545,"n_cols":13,"rows_kept":545,"merged":[[0,0,0,1],[8,0,9,0],[8,1,9,1],[8,2,9,2],[8,3,9,3],[8,4,8,6],[8,7,8,9]]}
[]
[]
[]
[]
[{"$nulls":11},"Back To Main Page"]
["FOR INTRA DAY TRADING",{"$nulls":9},{"$f":"Main!B10","v":"2019-07-19"}]
[null,null," "]
[]
["Sr.no","Scrip","CLOSE RATE","Pivot Point","Supports",null,null,"Resistances"]
[null,null,"Point",null,"S1","S2","S3","R1","R2","R3","HIGH","LOW","Total Trade Quanity in Lakhs"]
[1,"3MINDIA",21915.85,{"v":22052.533333333336,"d":"22052.53"},{"v":21768.866666666672,"d":"21768.87"},{"v":21621.883333333335,"d":"21621.88"},{"v":21338.21666666667,"d":"21338.22"},{"v":22199.516666666674,"d":"22199.52"},{"v":22483.183333333338,"d":"22483.18"},{"v":22630.166666666675,"d":"22630.17"},22336.2,21905.55,0.00651]
[2,"ABB",1454.1,{"v":1466.3666666666668,"d":"1466.37"},{"v":1432.7333333333336,"d":"1432.73"},{"v":1411.3666666666668,"d":"1411.37"},{"v":1377.7333333333336,"d":"1377.73"},{"v":1487.7333333333336,"d":"1487.73"},{"v":1521.3666666666668,"d":"1521.37"},{"v":1542.7333333333336,"d":"1542.73"},1500,1445,0.63333]
[3,"ACC",1567.1,{"v":1578.8166666666668,"d":"1578.82"},{"v":1548.4333333333336,"d":"1548.43"},{"v":1529.7666666666669,"d":"1529.77"},{"v":1499.3833333333337,"d":"1499.38"},{"v":1597.4833333333336,"d":"1597.48"},{"v":1627.8666666666668,"d":"1627.87"},{"v":1646.5333333333335,"d":"1646.53"},1609.2,1560.15,14.75891]
[4,"AIAENG",1758.2,{"v":1760.0166666666667,"d":"1760.02"},{"v":1748.2333333333333,"d":"1748.23"},{"v":1738.2666666666667,"d":"1738.27"},{"v":1726.4833333333333,"d":"1726.48"},{"v":1769.9833333333333,"d":"1769.98"},{"v":1781.7666666666667,"d":"1781.77"},{"v":1791.7333333333333,"d":"1791.73"},1771.8,1750.05,0.61724]
[5,"APLAPOLLO",1521.95,{"v":1531.0166666666664,"d":"1531.02"},{"v":1503.0333333333328,"d":"1503.03"},{"v":1484.1166666666663,"d":"1484.12"},{"v":1456.1333333333328,"d":"1456.13"},{"v":1549.933333333333,"d":"1549.93"},{"v":1577.9166666666665,"d":"1577.92"},{"v":1596.833333333333,"d":"1596.83"},1559,1512.1,0.06167]
[6,"AUBANK",669.35,{"v":670.4833333333335,"d":"670.48"},{"v":666.0166666666669,"d":"666.02"},{"v":662.6833333333334,"d":"662.68"},{"v":658.2166666666668,"d":"658.22"},{"v":673.816666666667,"d":"673.82"},{"v":678.2833333333334,"d":"678.28"},{"v":681.616666666667,"d":"681.62"},674.95,667.15,0.81812]
[7,"AAVAS",1491.6,{"v":1499.8666666666668,"d":"1499.87"},{"v":1476.7333333333336,"d":"1476.73"},{"v":1461.8666666666668,"d":"1461.87"},{"v":1438.7333333333336,"d":"1438.73"},{"v":1514.7333333333336,"d":"1514.73"},{"v":1537.8666666666668,"d":"1537.87"},{"v":1552.7333333333336,"d":"1552.73"},1523,1485,0.20866]
[8,"ADANIGREEN",47.5,{"v":48.06666666666666,"d":"48.07"},{"v":46.383333333333326,"d":"46.38"},{"v":45.266666666666666,"d":"45.27"},{"v":43.58333333333333,"d":"43.58"},{"v":49.18333333333332,"d":"49.18"},{"v":50.86666666666666,"d":"50.87"},{"v":51.98333333333332,"d":"51.98"},49.75,46.95,9.38262]
[9,"ADANIPORTS",412.4,{"v":414.15000000000003,"d":"414.15"},{"v":409.00000000000006,"d":"409.00"},{"v":405.6,"d":"405.60"},{"v":400.45000000000005,"d":"400.45"},{"v":417.55000000000007,"d":"417.55"},{"v":422.70000000000005,"d":"422.70"},{"v":426.1000000000001,"d":"426.10"},419.3,410.75,13.00071]
[10,"ADANIPOWER",62.7,63.35,{"v":60.8,"d":"60.80"},{"v":58.9,"d":"58.90"},{"v":56.349999999999994,"d":"56.35"},65.25,{"v":67.8,"d":"67.80"},{"v":69.7,"d":"69.70"},65.9,61.45,274.0317]
{"$rows_left_out":513}
{"sheet":"Bulk Deals","index":4,"n_rows":49,"n_cols":8,"rows_kept":49,"merged":[[4,0,4,1],[4,2,4,3],[6,1,6,2]]}
[" "]
[]
[]
[]
[]
[{"$nulls":4},"Back To Main Page"]
["Subject :","BULK DEAL",null,{"$f":"Main!B10","v":"2019-07-19"}]
[]
["Date","Scrip code","Scrip Name","Client Name","Buy / Sell","Quantity Traded","Trade Price / Wt.Avg.trade price","Exchange  "]
["2019-07-18",537766,"BCP","ACHINTYA SECURITIES PVT. LTD.","BUY",{"v":450764,"d":"450,764"},45.05,"BSE"]
["2019-07-18",537766,"BCP","ACHINTYA SECURITIES PVT. LTD.","SELL",{"v":450764,"d":"450,764"},44.65,"BSE"]
["2019-07-18",539399,"BELLACASA","HEM CHAND JAIN","BUY",{"v":80000,"d":"80,000"},149.63,"BSE"]
["2019-07-18",504340,"CONFINT","HEMANGINI VINITKUMAR PARIKH","SELL",{"v":448759,"d":"448,759"},0.76,"BSE"]
["2019-07-18",504340,"CONFINT","PINKY SURANA","BUY",{"v":448764,"d":"448,764"},0.76,"BSE"]
["2019-07-18",542724,"EARUM","MOHIT PRAKASH JALAN","SELL",{"v":36000,"d":"36,000"},39.99,"BSE"]
["2019-07-18",538835,"INTELLECT","AMANSA HOLDINGS PRIVATE LIMITED","BUY",{"v":960400,"d":"960,400"},267,"BSE"]
["2019-07-18",540937,"MEDICO","EMRALD COMMERCIAL LIMITED","BUY",{"v":37200,"d":"37,200"},87.15,"BSE"]
["2019-07-18",540937,"MEDICO","SAJANKUMAR RAMESHWARLAL BAJAJ","SELL",{"v":54000,"d":"54,000"},87.15,"BSE"]
["2019-07-18",542628,"NSL","AMIT JAYANTILAL PATEL .","SELL",{"v":87000,"d":"87,000"},{"v":32,"d":"32.00"},"BSE"]
["2019-07-18",500337,"PRIMESECU","YAMINI ANANT GAWANDE","SELL",{"v":141050,"d":"141,050"},40,"BSE"]
{"$rows_left_out":30}
{"sheet":"Call Tracker (Equity & F&O)","index":5,"n_rows":327,"n_cols":18,"rows_kept":327,"merged":[[110,0,111,0],[110,1,111,1],[110,9,111,9],[110,11,111,11],[110,12,111,12],[110,13,111,13],[110,14,111,14],[110,17,111,17],[113,0,114,0],[113,1,114,1],[113,9,114,9],[113,11,114,11],[113,12,114,12],[113,13,114,13],[113,14,114,14],[113,17,114,17],[115,0,116,0],[115,1,116,1],[115,9,116,9],[115,11,116,11],[115,12,116,12],[115,13,116,13],[115,14,116,14]]}
[]
[]
[]
[]
[{"$nulls":12},"Back To Main Page"]
["Retail Research Technical Calls & Fundamental Performance Report for the month of July-2019 "]
[{"$nulls":12},{"$f":"Main!B10","v":"2019-07-19"}]
[null,"Positional  Call"]
["Sr.no","Date",null,"Company","Rec","Rec Price","Stop Loss***","Call Closed At","Target","Remark","Profit / Loss per Share","Gain / Loss  %","Status","Closed Date","NSE Closed Price"]
[1,"2019-05-27",null,"TATAELXSI","Buy",874,818.7,863,"970-990","Loss of Rs.11/-",{"$f":"H10-F10","v":-11},{"$f":"K10/F10","v":{"v":-0.012585812356979404,"d":"-1.26%"}},"Unsuccessful","2019-07-16",{"$nulls":3},"R"]
[2,"2019-05-28",null,"BAJAJFINSV","Sell",8175,8625,7925,7300,"Profit of Rs.250/-",{"$f":"F11-H11","v":250},{"v":0.03058103975535168,"d":"3.06%"},"Successful","2019-07-08",{"$nulls":3},"H"]
[3,"2019-05-31",null,"ITC","Buy","285-287",268.3,null,"315-325","Open",{"$nulls":4},{"$f":"VLOOKUP(D12,Sheet2!A61:M1856,6,0)","v":273},null,null,"R"]
[4,"2019-06-13",null,"GODREJCP","Buy",677.5,644,639.5,"740-750","Loss of Rs.38/-",{"$f":"H13-F13","v":-38},{"$f":"K13/F13","v":{"v":-0.05608856088560885,"d":"-5.61%"}},"Unsuccessful","2019-07-10",{"$nulls":3},"H"]
[5,"2019-06-17",null,"SUNTV","Buy",517,476,507,"575-585","Loss of Rs.10/-",{"$f":"H14-F14","v":-10},{"$f":"K14/F14","v":{"v":-0.019342359767891684,"d":"-1.93%"}},"Unsuccessful","2019-07-08",{"$nulls":3},"R"]
[6,"2019-06-21",null,"AJANTPHARM","Buy",955,897.7,894,"1060-1080","Loss of Rs.61/-",{"$f":"H15-F15","v":-61},{"$f":"K15/F15","v":{"v":-0.06387434554973823,"d":"-6.39%"}},"Unsuccessful","2019-07-11",{"$nulls":3},"R"]
[7,"2019-06-24",null,"ESCORTS","Buy",549.5,518,545.25,600,"Loss of Rs.4.25/-",-4.25,{"v":-7.7343039126478615E-3,"d":"-0.77%"},"Neutral","2019-07-08",{"$nulls":3},"H"]
[8,"2019-06-25",null,"JUBLFOOD","Buy","1260-1265",1158.3,null,"1450 -1470","Open",{"$nulls":4},{"$f":"VLOOKUP(D17,Sheet2!A4:M1643,6,0)","v":1245.85},null,null,"R"]
[9,"2019-07-04",null,"TORNTPHARM","Buy",1545,1454,1610,"1730-1750","Part Profit of Rs.65/-",{"$f":"H18-F18","v":65},{"$f":"K18/F18","v":{"v":0.042071197411003236,"d":"4.21%"}},"Successful","2019-07-16",{"$nulls":3},"R"]
[10,"2019-07-10",null,"TCS","Buy","2105-2115",1973,null,"2295-2345","Open",{"$nulls":4},{"$f":"VLOOKUP(D19,Sheet2!A6:M1645,6,0)","v":2065.95},null,null,"H"]
[11,"2019-07-11",null,"BAJAJ-AUTO","Buy","2665-2675",2527,null,"1920-1950","Open",{"$nulls":4},{"$f":"VLOOKUP(D20,Sheet2!A7:M1646,6,0)","v":2630.8},null,null,"R"]
{"$rows_left_out":308}
{"sheet":"Sheet2","index":6,"n_rows":1899,"n_cols":14,"rows_kept":1899,"hidden":true}
["SYMBOL","SERIES","OPEN","HIGH","LOW","CLOSE","LAST","PREVCLOSE","TOTTRDQTY","TOTTRDVAL","TIMESTAMP","TOTALTRADES","ISIN","ISIN"]
["20MICRONS","EQ",35.4,36.3,35.4,36,36.3,35.95,4979,178546.65,"2019-07-18",87,"INE144J01027"]
["21STCENMGM","EQ",17.15,17.15,16.55,16.55,16.55,16.85,615,10347.75,"2019-07-18",24,"INE253B01015"]
["3IINFOTECH","EQ",2.75,2.75,2.55,2.6,2.6,2.7,2823745,7432996,"2019-07-18",1050,"INE748C01020"]
["3MINDIA","EQ",22258,22336.2,21905.55,21915.85,21910,22258.7,651,14342624.75,"2019-07-18",271,"INE470A01017"]
["3PLAND","EQ",7.9,8.15,7.55,7.95,7.55,7.9,75,606.5,"2019-07-18",9,"INE105C01023"]
["5PAISA","EQ",218.15,218.15,218.15,218.15,218.15,229.6,1286,280540.9,"2019-07-18",65,"INE618L01018"]
["63MOONS","EQ",102.95,105.05,99.25,100,99.25,103.25,69480,7042289.4,"2019-07-18",1290,"INE111B01023"]
["8KMILES","EQ",81.55,81.55,81.55,81.55,81.55,85.8,16757,1366533.35,"2019-07-18",287,"INE650K01021"]
["A2ZINFRA","EQ",10.35,10.6,9.9,10,10.2,10.1,682570,6909731.15,"2019-07-18",921,"INE619I01012"]
["AARTIDRUGS","EQ",503,505,495,496.2,495.5,502.05,4464,2221134.2,"2019-07-18",438,"INE767A01016"]
["AARTIIND","EQ",1682.6,1696.5,1663.25,1679.2,1680,1682.6,13480,22677119.7,"2019-07-18",1681,"INE769A01020"]
["AARVEEDEN","EQ",18.05,18.8,16.5,17.35,17.45,18.1,7144,124378.15,"2019-07-18",150,"INE273D01019"]
["AAVAS","EQ",1523,1523,1485,1491.6,1490,1511,20866,31520030.9,"2019-07-18",1345,"INE216P01012"]
["ABAN","EQ",35.15,36.05,34.95,35.25,35.9,35.85,43506,1530233.4,"2019-07-18",530,"INE421A01028"]
["ABB","EQ",1493,1500,1445,1454.1,1448.5,1489.1,63333,93036355.15,"2019-07-18",5754,"INE117A01022"]
["ABBOTINDIA","EQ",8670.1,8798,8522.75,8552.2,8550,8696.15,3954,34031456.1,"2019-07-18",712,"INE358A01014"]
["ABCAPITAL","EQ",90.25,90.3,89,89.05,89.1,90.4,870912,77949134.4,"2019-07-18",8949,"INE674K01013"]
["ABFRL","EQ",203.9,204.6,202.8,203.05,203.25,203.2,288176,58575668.65,"2019-07-18",2522,"INE647O01011"]
["ABMINTLTD","BE",14,14,14,14,14,14,58,812,"2019-07-18",3,"INE251C01017"]
{"$rows_left_out":1680}
{"sheet":"Sheet1","index":7,"n_rows":0,"n_cols":0,"rows_kept":0,"hidden":true}

{"sheet":"Sheet3","index":8,"n_rows":0,"n_cols":0,"rows_kept":0,"hidden":true}

{"sheet":"Sheet4","index":9,"n_rows":0,"n_cols":0,"rows_kept":0,"hidden":true}