{"text_format":"3","workbook":"xlsx","n_sheets":6,"sheets":["Main","Future Intra","Cash Intra","MidCap Intra","Bulk Deals","Call Tracker (Equity & F&O)"],"not_rendered":{"images":2,"defined_names":3},"read":"whole","date_system":"1900"}

{"sheet":"Main","index":0,"n_rows":27,"n_cols":11,"rows_kept":27}
[null,"                                                                                                 "]
{"$rows_empty":8}
[null,"2023-05-19"]
[]
[null,"Sheet No.","Template Name","Summary"]
[null,1,"Future Intra","For Intraday trading in F&O segment"]
[null,2,"Cash Intra","For Intraday trading in cash market segment"]
[null,3,"Mid-cap Intra","For Intraday trading in Mid-cap stocks"]
[null,4,"Bulk Deals","Reveals Bulk Deals carried on NSE & BSE"]
[null,5,"Call Tracker"]
{"$rows_empty":9}
[{"$nulls":10},"`"]

{"sheet":"Future Intra","index":1,"n_rows":236,"n_cols":16,"rows_kept":236,"merged":[[8,0,9,0],[8,1,9,1],[8,2,9,2],[8,3,9,3],[8,6,8,8],[8,9,8,11]]}
[]
[]
[]
[]
[{"$nulls":12},"Back to Main Page"]
["FOR INTRA DAY TRADING",{"$nulls":10},{"$f":"Main!B10","v":"2023-05-19"}]
[]
[]
["Sr.no","Sector","Scrip","Expiry Date","CLOSE RATE","Pivot Point","Supports",null,null,"Resistances"]
[{"$nulls":4},"Point","Point","S1","S2","S3","R1","R2","R3","HIGH","LOW","OI","% Change in OI"]
[1,"Index","NIFTY","2023-05-25",18175.45,{"v":18216.933333333334,"d":"18216.93"},{"v":18109.31666666667,"d":"18109.32"},{"v":18043.183333333334,"d":"18043.18"},{"v":17935.56666666667,"d":"17935.57"},{"v":18283.06666666667,"d":"18283.07"},{"v":18390.683333333338,"d":"18390.68"},{"v":18456.81666666667,"d":"18456.82"},18324.55,18150.8,12701000,{"v":0.009999801196795293,"d":"1.00%"}]
[2,"Index","BANKNIFTY","2023-05-25",43775.45,{"v":43848.649999999994,"d":"43848.65"},{"v":43639.44999999999,"d":"43639.45"},43503.45,{"v":43294.24999999999,"d":"43294.25"},{"v":43984.64999999999,"d":"43984.65"},44193.85,{"v":44329.849999999984,"d":"44329.85"},44057.85,43712.65,3136555,{"v":0.03381894889500486,"d":"3.38%"}]
[3,"Index","FINNIFTY","2023-05-30",{"v":19385.4,"d":"19385.40"},{"v":19412.316666666666,"d":"19412.32"},{"v":19333.083333333332,"d":"19333.08"},{"v":19280.766666666666,"d":"19280.77"},{"v":19201.533333333333,"d":"19201.53"},{"v":19464.63333333333,"d":"19464.63"},{"v":19543.86666666667,"d":"19543.87"},{"v":19596.18333333333,"d":"19596.18"},19491.55,19360,45040,{"v":0.085824493731919,"d":"8.58%"}]
[4,"Index","MIDCPNIFTY","2023-05-31",7514.45,{"v":7519.349999999999,"d":"7519.35"},{"v":7509.549999999999,"d":"7509.55"},7504.65,{"v":7494.849999999999,"d":"7494.85"},{"v":7524.249999999999,"d":"7524.25"},7534.05,{"v":7538.949999999999,"d":"7538.95"},7529.15,7514.45,150,{"v":0,"d":"0.00%"}]
[5,"Chemical","AARTIIND","2023-05-25",{"v":495.7,"d":"495.70"},{"v":499.1666666666667,"d":"499.17"},{"v":491.48333333333335,"d":"491.48"},{"v":487.26666666666665,"d":"487.27"},{"v":479.5833333333333,"d":"479.58"},{"v":503.3833333333334,"d":"503.38"},{"v":511.06666666666666,"d":"511.07"},{"v":515.2833333333334,"d":"515.28"},506.85,494.95,6364550,{"v":0.026283751642734478,"d":"2.63%"}]
[6,"Capital_Goods","ABB","2023-05-25",3899.75,{"v":3910.5333333333333,"d":"3910.53"},{"v":3881.2666666666664,"d":"3881.27"},{"v":3862.7833333333333,"d":"3862.78"},{"v":3833.5166666666664,"d":"3833.52"},{"v":3929.0166666666664,"d":"3929.02"},{"v":3958.2833333333338,"d":"3958.28"},{"v":3976.7666666666664,"d":"3976.77"},3939.8,3892.05,1494000,{"v":-0.017428477474514963,"d":"-1.74%"}]
[7,"Pharma","ABBOTINDIA","2023-05-25",20967.15,{"v":21089.766666666666,"d":"21089.77"},{"v":20778.38333333333,"d":"20778.38"},{"v":20589.616666666665,"d":"20589.62"},{"v":20278.23333333333,"d":"20278.23"},{"v":21278.533333333333,"d":"21278.53"},{"v":21589.91666666667,"d":"21589.92"},{"v":21778.683333333334,"d":"21778.68"},21401.15,20901,86560,{"v":-0.027852650494159928,"d":"-2.79%"}]
[8,"Others","ABCAPITAL","2023-05-25",164.95,{"v":165.6833333333333,"d":"165.68"},{"v":163.51666666666662,"d":"163.52"},{"v":162.08333333333331,"d":"162.08"},{"v":159.91666666666663,"d":"159.92"},{"v":167.11666666666662,"d":"167.12"},{"v":169.2833333333333,"d":"169.28"},{"v":170.7166666666666,"d":"170.72"},167.85,164.25,32616000,{"v":0.013252809931219594,"d":"1.33%"}]
[9,"Textile","ABFRL","2023-05-25",{"v":193.9,"d":"193.90"},194.65,{"v":191.3,"d":"191.30"},{"v":188.70000000000002,"d":"188.70"},{"v":185.35000000000002,"d":"185.35"},197.25,{"v":200.59999999999997,"d":"200.60"},{"v":203.2,"d":"203.20"},198,192.05,33238400,{"v":-0.03407631280695127,"d":"-3.41%"}]
[10,"Cement","ACC","2023-05-25",{"v":1714,"d":"1714.00"},{"v":1732.6333333333332,"d":"1732.63"},{"v":1690.4666666666665,"d":"1690.47"},{"v":1666.9333333333332,"d":"1666.93"},{"v":1624.7666666666664,"d":"1624.77"},{"v":1756.1666666666665,"d":"1756.17"},{"v":1798.3333333333335,"d":"1798.33"},{"v":1821.8666666666666,"d":"1821.87"},1774.8,1709.1,4330150,{"v":0.042430005536965264,"d":"4.24%"}]
{"$rows_left_out":202}
{"sheet":"Cash Intra","index":2,"n_rows":246,"n_cols":13,"rows_kept":246,"merged":[[7,0,8,0],[7,1,8,1],[7,2,8,2],[7,3,8,3],[7,4,7,6],[7,7,7,9]]}
[]
[]
[]
[]
[{"$nulls":12},"Back to Main Page"]
["FOR INTRA DAY TRADING",{"$nulls":9},{"$f":"Main!B10","v":"2023-05-19"}]
[]
["Sr.no",null,"CLOSE RATE","Pivot Point","Supports",null,null,"Resistances"]
[{"$nulls":4},"S1","S2","S3","R1","R2","R3","HIGH","LOW","Total Trade Quanity in Lakhs"]
[1,"Nifty 50",18129.95,{"v":18177.333333333332,"d":"18177.33"},{"v":18057.466666666664,"d":"18057.47"},{"v":17984.98333333333,"d":"17984.98"},{"v":17865.11666666666,"d":"17865.12"},{"v":18249.816666666666,"d":"18249.82"},{"v":18369.683333333334,"d":"18369.68"},{"v":18442.166666666668,"d":"18442.17"},{"v":18297.2,"d":"18297.20"},18104.85]
[2,"Nifty Bank",{"v":43752.3,"d":"43752.30"},{"v":43835.06666666667,"d":"43835.07"},{"v":43590.93333333335,"d":"43590.93"},{"v":43429.56666666667,"d":"43429.57"},{"v":43185.43333333335,"d":"43185.43"},{"v":43996.43333333335,"d":"43996.43"},{"v":44240.566666666666,"d":"44240.57"},{"v":44401.93333333335,"d":"44401.93"},{"v":44079.2,"d":"44079.20"},{"v":43673.7,"d":"43673.70"}]
[3,"Nifty CPSE",3129.85,{"v":3141.2166666666667,"d":"3141.22"},{"v":3114.0333333333333,"d":"3114.03"},{"v":3098.2166666666667,"d":"3098.22"},{"v":3071.0333333333333,"d":"3071.03"},{"v":3157.0333333333333,"d":"3157.03"},{"v":3184.2166666666667,"d":"3184.22"},{"v":3200.0333333333333,"d":"3200.03"},{"v":3168.4,"d":"3168.40"},{"v":3125.4,"d":"3125.40"}]
[4,"Nifty Infra",5348.05,5371.45,{"v":5318.2,"d":"5318.20"},5288.35,{"v":5235.1,"d":"5235.10"},{"v":5401.299999999999,"d":"5401.30"},{"v":5454.549999999999,"d":"5454.55"},{"v":5484.399999999999,"d":"5484.40"},{"v":5424.7,"d":"5424.70"},{"v":5341.6,"d":"5341.60"}]
[5,"Nifty IT",27892.55,{"v":27963,"d":"27963.00"},{"v":27788.3,"d":"27788.30"},27684.05,27509.35,28067.25,{"v":28241.949999999997,"d":"28241.95"},{"v":28346.2,"d":"28346.20"},{"v":28137.7,"d":"28137.70"},27858.75]
[6,"Nifty PSE",{"v":4766.7,"d":"4766.70"},{"v":4788.816666666667,"d":"4788.82"},{"v":4738.033333333333,"d":"4738.03"},{"v":4709.366666666666,"d":"4709.37"},{"v":4658.583333333332,"d":"4658.58"},{"v":4817.483333333334,"d":"4817.48"},{"v":4868.266666666668,"d":"4868.27"},{"v":4896.933333333334,"d":"4896.93"},{"v":4839.6,"d":"4839.60"},4760.15]
[7,"Nifty Midcap 50",9176.55,{"v":9209.916666666666,"d":"9209.92"},{"v":9132.633333333331,"d":"9132.63"},{"v":9088.716666666665,"d":"9088.72"},{"v":9011.43333333333,"d":"9011.43"},{"v":9253.833333333332,"d":"9253.83"},{"v":9331.116666666669,"d":"9331.12"},{"v":9375.033333333333,"d":"9375.03"},{"v":9287.2,"d":"9287.20"},{"v":9166,"d":"9166.00"}]
[8,"ABB",3897.5,{"v":3907.683333333333,"d":"3907.68"},{"v":3880.366666666666,"d":"3880.37"},{"v":3863.233333333333,"d":"3863.23"},{"v":3835.916666666666,"d":"3835.92"},{"v":3924.8166666666657,"d":"3924.82"},{"v":3952.1333333333323,"d":"3952.13"},{"v":3969.2666666666655,"d":"3969.27"},3935,3890.55,1.41795]
[9,"ACC",1712.45,1731.95,1684.95,1657.45,1610.45,1759.45,1806.45,1833.95,1778.95,1704.45,6.47641]
[10,"AUBANK",747.6,743.65,{"v":732.4,"d":"732.40"},{"v":717.2,"d":"717.20"},705.95,{"v":758.8499999999999,"d":"758.85"},{"v":770.0999999999999,"d":"770.10"},{"v":785.2999999999998,"d":"785.30"},754.9,728.45,34.22021]
[11,"ABBOTINDIA",20970.55,{"v":21085.5,"d":"21085.50"},20817.05,20663.55,{"v":20395.1,"d":"20395.10"},{"v":21239,"d":"21239.00"},{"v":21507.449999999997,"d":"21507.45"},21660.95,21353.95,20932,0.07346]
{"$rows_left_out":227}
{"sheet":"MidCap Intra","index":3,"n_rows":532,"n_cols":13,"rows_kept":532,"merged":[[0,0,0,1],[8,0,9,0],[8,1,9,1],[8,2,9,2],[8,3,9,3],[8,4,8,6],[8,7,8,9]]}
[]
[]
[]
[]
[{"$nulls":11},"Back To Main Page"]
["FOR INTRA DAY TRADING",{"$nulls":9},{"$f":"Main!B10","v":"2023-05-19"}]
[null,null," "]
[]
["Sr.no","Scrip","CLOSE RATE","Pivot Point","Supports",null,null,"Resistances"]
[{"$nulls":4},"S1","S2","S3","R1","R2","R3","HIGH","LOW","Total Trade Quanity in Lakhs"]
[1,"360ONE",402.2,{"v":403.3666666666666,"d":"403.37"},{"v":397.98333333333323,"d":"397.98"},{"v":393.7666666666666,"d":"393.77"},{"v":388.3833333333332,"d":"388.38"},{"v":407.58333333333326,"d":"407.58"},{"v":412.9666666666666,"d":"412.97"},{"v":417.1833333333333,"d":"417.18"},408.75,399.15,11.59692]
[2,"3MINDIA",23363.35,{"v":23392.033333333336,"d":"23392.03"},{"v":23284.066666666673,"d":"23284.07"},{"v":23204.783333333336,"d":"23204.78"},{"v":23096.816666666673,"d":"23096.82"},{"v":23471.316666666673,"d":"23471.32"},{"v":23579.28333333334,"d":"23579.28"},{"v":23658.566666666673,"d":"23658.57"},23500,23312.75,0.0062]
[3,"ABB",3897.5,{"v":3907.683333333333,"d":"3907.68"},{"v":3880.366666666666,"d":"3880.37"},{"v":3863.233333333333,"d":"3863.23"},{"v":3835.916666666666,"d":"3835.92"},{"v":3924.8166666666657,"d":"3924.82"},{"v":3952.1333333333323,"d":"3952.13"},{"v":3969.2666666666655,"d":"3969.27"},3935,3890.55,1.41795]
[4,"ACC",1712.45,1731.95,1684.95,1657.45,1610.45,1759.45,1806.45,1833.95,1778.95,1704.45,6.47641]
[5,"AIAENG",2855.8,{"v":2852.2999999999997,"d":"2852.30"},{"v":2804.5999999999995,"d":"2804.60"},{"v":2753.3999999999996,"d":"2753.40"},{"v":2705.6999999999994,"d":"2705.70"},{"v":2903.4999999999995,"d":"2903.50"},{"v":2951.1999999999994,"d":"2951.20"},{"v":3002.3999999999996,"d":"3002.40"},2900,2801.1,1.24624]
[6,"APLAPOLLO",1114.45,{"v":1127.0333333333335,"d":"1127.03"},{"v":1090.7166666666672,"d":"1090.72"},{"v":1066.9833333333336,"d":"1066.98"},{"v":1030.6666666666672,"d":"1030.67"},{"v":1150.766666666667,"d":"1150.77"},{"v":1187.0833333333333,"d":"1187.08"},{"v":1210.816666666667,"d":"1210.82"},1163.35,1103.3,5.12932]
[7,"AUBANK",747.6,743.65,{"v":732.4,"d":"732.40"},{"v":717.2,"d":"717.20"},705.95,{"v":758.8499999999999,"d":"758.85"},{"v":770.0999999999999,"d":"770.10"},{"v":785.2999999999998,"d":"785.30"},754.9,728.45,34.22021]
[8,"AARTIDRUGS",466.9,466.55,{"v":459.6,"d":"459.60"},{"v":452.3,"d":"452.30"},445.35,473.85,{"v":480.79999999999995,"d":"480.80"},{"v":488.1,"d":"488.10"},473.5,459.25,1.98147]
[9,"AAVAS",1396.6,{"v":1403.4833333333333,"d":"1403.48"},{"v":1384.5666666666666,"d":"1384.57"},{"v":1372.5333333333333,"d":"1372.53"},{"v":1353.6166666666666,"d":"1353.62"},{"v":1415.5166666666667,"d":"1415.52"},{"v":1434.4333333333332,"d":"1434.43"},{"v":1446.4666666666667,"d":"1446.47"},1422.4,1391.45,1.94712]
[10,"ABBOTINDIA",20970.55,{"v":21085.5,"d":"21085.50"},20817.05,20663.55,{"v":20395.1,"d":"20395.10"},{"v":21239,"d":"21239.00"},{"v":21507.449999999997,"d":"21507.45"},21660.95,21353.95,20932,0.07346]
{"$rows_left_out":513}
{"sheet":"Bulk Deals","index":4,"n_rows":95,"n_cols":8,"rows_kept":95,"merged":[[4,0,4,1],[4,2,4,3],[6,1,6,2]]}
[" "]
[]
[]
[]
[]
[{"$nulls":4},"Back To Main Page"]
["Subject :","BULK DEAL",null,{"$f":"Main!B10","v":"2023-05-19"}]
[]
["Date","Scrip code","Scrip Name","Client Name","Buy / Sell","Quantity Traded","Trade Price / Wt.Avg.trade price","Exchange  "]
["2023-05-18",530233,"AUROLAB","AMIT DHANYAKUMAR CHORDIA","BUY",{"v":50000,"d":"50,000"},97.64,"BSE"]
["2023-05-18",531671,"BISIL","ALGOQUANT FINTECH LIMITED .","SELL",{"v":781907,"d":"781,907"},3.63,"BSE"]
["2023-05-18",532123,"BSELINFRA","MULTIPLIER SHARE & STOCK ADVISORS PRIVATE LIMITED","SELL",{"v":497254,"d":"497,254"},6.7,"BSE"]
["2023-05-18",532123,"BSELINFRA","MULTIPLIER SHARE & STOCK ADVISORS PRIVATE LIMITED","BUY",{"v":291160,"d":"291,160"},6.65,"BSE"]
["2023-05-18",531283,"CINDRELL","RAJAT SINGH","SELL",{"v":30105,"d":"30,105"},7.75,"BSE"]
["2023-05-18",531364,"EKANSH","CHARTERED CAPITAL RESEARCH PRIVATE LIMITED","SELL",{"v":109500,"d":"109,500"},68.01,"BSE"]
["2023-05-18",543895,"EXHICON","YUGA STOCKS AND COMMODITIES PRIVATE LIMITED .","BUY",{"v":34000,"d":"34,000"},150.04,"BSE"]
["2023-05-18",543895,"EXHICON","YUGA STOCKS AND COMMODITIES PRIVATE LIMITED .","SELL",{"v":150000,"d":"150,000"},153.27,"BSE"]
["2023-05-18",543895,"EXHICON","EPITOME TRADING AND INVESTMENTS","BUY",{"v":100000,"d":"100,000"},154,"BSE"]
["2023-05-18",543895,"EXHICON","EPITOME TRADING AND INVESTMENTS","SELL",{"v":26000,"d":"26,000"},153.94,"BSE"]
["2023-05-18",533048,"GISOLUTION","AG DYNAMIC FUNDS LIMITED","BUY",{"v":200000,"d":"200,000"},36.35,"BSE"]
{"$rows_left_out":76}
{"sheet":"Call Tracker (Equity & F&O)","index":5,"n_rows":326,"n_cols":18,"rows_kept":326,"merged":[[87,0,88,0],[87,1,88,1],[87,9,88,9],[93,0,94,0],[93,1,94,1],[93,9,94,9],[93,12,94,12],[93,14,94,14],[93,15,94,15]]}
[]
[]
[]
[]
[{"$nulls":12},"Back To Main Page"]
["Retail Research Technical Calls & Fundamental Performance Report for the month of May-2023"]
[{"$nulls":12},{"$f":"Main!B10","v":"2023-05-19"}]
[null,"Positional  Call"]
["Sr.no","Date",null,"Company","Rec","Rec Price","Stop Loss***","Call Closed At","Target","Remark","Profit / Loss per Share","All charges","Net Gain / Loss  %","Status","Closed Date","Market Closing Price"]
[1,"2023-04-11",null,"SHARDACROP","Accu",460,425,489,"500-530","Profit of Rs.29/-",{"$f":"H10-F10","v":29},{"$f":"(F10*-0.7)/100","v":-3.22},{"$f":"(K10+L10)/F10","v":{"v":0.05604347826086957,"d":"5.60%"}},"Successful","2023-05-11",null,null,"H"]
[2,"2023-04-12",null,"SUDARSCHEM","Accu","390-410",377,null,"440-460","Open",{"$nulls":5},{"$f":"VLOOKUP(D11,'MidCap Intra'!B28:C528,2,0)","v":394.25},null,"H"]
[3,"2023-04-17",null,"REDINGTON","Accu",167.5,158,177.5,"180-190","Profit of Rs.10/-",{"$f":"H12-F12","v":10},{"$f":"(F12*-0.7)/100","v":{"v":-1.1724999999999999,"d":"-1.17"}},{"$f":"(K12+L12)/F12","v":{"v":0.05270149253731344,"d":"5.27%"}},"Successful","2023-05-12",null,null,"H"]
[4,"2023-04-17",null,"HCLTECH","Accu",1035,945,1092.5,"1150-1200","Profit of Rs.29/-",{"$f":"H13-F13","v":57.5},{"$f":"(F13*-0.7)/100","v":{"v":-7.245,"d":"-7.25"}},{"$f":"(K13+L13)/F13","v":{"v":0.04855555555555556,"d":"4.86%"}},"Successful","2023-05-11",null,null,"H"]
[5,"2023-04-17",null,"KOLTEPATIL","Accu",248.5,233,265.5,"280-290","Profit of Rs.17/-",{"$f":"H14-F14","v":17},{"$f":"(F14*-0.7)/100","v":{"v":-1.7394999999999998,"d":"-1.74"}},{"$f":"(K14+L14)/F14","v":{"v":0.061410462776659965,"d":"6.14%"}},"Successful","2023-05-03",null,null,"N"]
[6,"2023-04-24",null,"BHARTIARTL","Accu","755-790",735,null,"850-900","Open",{"$nulls":5},{"$f":"VLOOKUP(D15,'MidCap Intra'!B33:C533,2,0)","v":799.35},null,"H"]
[7,"2023-04-25",null,"MASTEK","Accu",1715,1550,1817.5,"1900-2000","Profit of Rs.102.5/-",{"$f":"H16-F16","v":102.5},{"$f":"(F16*-0.7)/100","v":{"v":-12.005,"d":"-12.01"}},{"$f":"(K16+L16)/F16","v":{"v":0.05276676384839651,"d":"5.28%"}},"Successful","2023-05-17",null,null,"H"]
[8,"2023-04-28",null,"GNFC","Accu",580,530,614,"640-680","Profit of Rs.34/-",{"$f":"H17-F17","v":34},{"$f":"(F17*-0.7)/100","v":-4.06},{"$f":"(K17+L17)/F17","v":{"v":0.051620689655172414,"d":"5.16%"}},"Successful","2023-05-11",null,null,"H"]
[9,"2023-05-03",null,"TATAELXSI","Accu",6575,6150,6970,"7000-7300","Profit of Rs.395/-",{"$f":"H18-F18","v":395},{"$f":"(F18*-0.7)/100","v":{"v":-46.025,"d":"-46.03"}},{"$f":"(K18+L18)/F18","v":{"v":0.05307604562737643,"d":"5.31%"}},"Successful","2023-05-09",null,null,"H"]
[10,"2023-05-09",null,"KANSAINER","Accu","400-410",379,null,"450-470","Open",{"$nulls":5},{"$f":"VLOOKUP(D19,'MidCap Intra'!B37:C537,2,0)","v":{"v":415.4,"d":"415.40"}},null,"H"]
[11,"2023-05-12",null,"RECLTD","Accu","126-130.5",119,null,"140-150","Open",{"$nulls":5},{"$f":"VLOOKUP(D20,'MidCap Intra'!B38:C538,2,0)","v":{"v":129.5,"d":"129.50"}}]
{"$rows_left_out":293}