{"text_format":"3","workbook":"xlsx","n_sheets":7,"sheets":["Main","Future Intra","Cash Intra","MidCap Intra","Bulk Deals","Call Tracker (Equity)","Call Tracker (F&O)"],"not_rendered":{"images":4,"defined_names":1},"read":"whole","date_system":"1900"}

{"sheet":"Main","index":0,"n_rows":27,"n_cols":11,"rows_kept":27}
[null,"                                                                                                 "]
[]
[]
[]
[]
[{"$nulls":6}," "]
[]
[]
[]
[null,"2024-08-20"]
[]
[null,"Sheet No.","Template Name","Summary"]
[null,1,"Future Intra","For Intraday trading in F&O segment"]
[null,2,"Cash Intra","For Intraday trading in cash market segment"]
[null,3,"Mid-cap Intra","For Intraday trading in Mid-cap stocks"]
[null,4,"Bulk Deals","Reveals Bulk Deals carried on NSE & BSE"]
[null,5,"Call Tracker"]
{"$rows_empty":9}
[{"$nulls":10},"`"]

{"sheet":"Future Intra","index":1,"n_rows":225,"n_cols":16,"rows_kept":225,"merged":[[8,0,9,0],[8,1,9,1],[8,2,9,2],[8,3,9,3],[8,6,8,8],[8,9,8,11]]}
[]
[]
[]
[]
[{"$nulls":12},"Back to Main Page"]
["FOR INTRA DAY TRADING",{"$nulls":10},{"$f":"Main!B10","v":"2024-08-20"}]
[]
[]
["Sr.no","Sector","Scrip","Expiry Date","CLOSE RATE","Pivot Point","Supports",null,null,"Resistances"]
[{"$nulls":4},"Point","Point","S1","S2","S3","R1","R2","R3","HIGH","LOW","OI","% Change in OI"]
[1,"Index","NIFTY","2024-08-29",24595.75,{"v":24596.833333333332,"d":"24596.83"},{"v":24531.916666666664,"d":"24531.92"},{"v":24468.083333333332,"d":"24468.08"},{"v":24403.166666666664,"d":"24403.17"},{"v":24660.666666666664,"d":"24660.67"},{"v":24725.58333333333,"d":"24725.58"},{"v":24789.416666666664,"d":"24789.42"},24661.75,24533,12911175,{"v":-0.019749379332336215,"d":"-1.97%"}]
[2,"Index","BANKNIFTY","2024-08-28",50485.25,{"v":50575.666666666664,"d":"50575.67"},{"v":50336.58333333333,"d":"50336.58"},{"v":50187.916666666664,"d":"50187.92"},{"v":49948.83333333333,"d":"49948.83"},{"v":50724.33333333333,"d":"50724.33"},{"v":50963.41666666666,"d":"50963.42"},{"v":51112.08333333333,"d":"51112.08"},50814.75,50427,3796935,{"v":0.053413734841485844,"d":"5.34%"}]
[3,"Index","FINNIFTY","2024-08-27",22975.35,{"v":23000.399999999998,"d":"23000.40"},{"v":22891.049999999996,"d":"22891.05"},{"v":22806.749999999996,"d":"22806.75"},{"v":22697.399999999994,"d":"22697.40"},{"v":23084.699999999997,"d":"23084.70"},{"v":23194.049999999996,"d":"23194.05"},23278.35,23109.75,22916.1,94300,{"v":-0.07594316511513964,"d":"-7.59%"}]
[4,"Index","MIDCPNIFTY","2024-08-26",12757.45,{"v":12754.050000000001,"d":"12754.05"},{"v":12681.600000000002,"d":"12681.60"},{"v":12605.750000000002,"d":"12605.75"},{"v":12533.300000000003,"d":"12533.30"},{"v":12829.900000000001,"d":"12829.90"},{"v":12902.350000000002,"d":"12902.35"},{"v":12978.2,"d":"12978.20"},12826.5,12678.2,2399150,{"v":0.010083361401145166,"d":"1.01%"}]
[5,"Index","NIFTYNXT50","2024-08-30",73469.05,{"v":73444.98333333334,"d":"73444.98"},{"v":73225.11666666667,"d":"73225.12"},{"v":72981.18333333333,"d":"72981.18"},{"v":72761.31666666667,"d":"72761.32"},{"v":73688.91666666667,"d":"73688.92"},{"v":73908.78333333334,"d":"73908.78"},{"v":74152.71666666667,"d":"74152.72"},73664.85,73201.05,12610,{"v":-0.023993808049535603,"d":"-2.40%"}]
[6,"Chemicals","AARTIIND","2024-08-29",{"v":621.4,"d":"621.40"},{"v":612.9166666666666,"d":"612.92"},{"v":600.8333333333333,"d":"600.83"},{"v":580.2666666666667,"d":"580.27"},{"v":568.1833333333333,"d":"568.18"},{"v":633.4833333333332,"d":"633.48"},{"v":645.5666666666665,"d":"645.57"},{"v":666.1333333333332,"d":"666.13"},625,592.35,16019000,{"v":-0.0451239866475918,"d":"-4.51%"}]
[7,"Capital_Goods","ABB","2024-08-29",7834.65,{"v":7881.2,"d":"7881.20"},{"v":7769,"d":"7769.00"},7703.35,{"v":7591.150000000001,"d":"7591.15"},{"v":7946.849999999999,"d":"7946.85"},{"v":8059.049999999998,"d":"8059.05"},{"v":8124.699999999999,"d":"8124.70"},7993.4,7815.55,1840500,{"v":0.013142503268423587,"d":"1.31%"}]
[8,"Pharma","ABBOTINDIA","2024-08-29",{"v":28097.1,"d":"28097.10"},{"v":28003.7,"d":"28003.70"},{"v":27711.5,"d":"27711.50"},{"v":27325.899999999998,"d":"27325.90"},{"v":27033.699999999997,"d":"27033.70"},{"v":28389.300000000003,"d":"28389.30"},{"v":28681.500000000007,"d":"28681.50"},{"v":29067.100000000006,"d":"29067.10"},28295.9,27618.1,140400,{"v":-0.008614602457280044,"d":"-0.86%"}]
[9,"Finance","ABCAPITAL","2024-08-29",{"v":213.6,"d":"213.60"},{"v":215.01666666666665,"d":"215.02"},{"v":211.1833333333333,"d":"211.18"},{"v":208.76666666666665,"d":"208.77"},{"v":204.9333333333333,"d":"204.93"},{"v":217.4333333333333,"d":"217.43"},{"v":221.26666666666668,"d":"221.27"},{"v":223.6833333333333,"d":"223.68"},218.85,212.6,77830200,{"v":0.007972585495489196,"d":"0.80%"}]
[10,"Textile","ABFRL","2024-08-29",322.05,{"v":321.5833333333333,"d":"321.58"},{"v":319.66666666666663,"d":"319.67"},{"v":317.2833333333333,"d":"317.28"},{"v":315.3666666666666,"d":"315.37"},{"v":323.96666666666664,"d":"323.97"},{"v":325.88333333333327,"d":"325.88"},{"v":328.26666666666665,"d":"328.27"},323.5,319.2,48128600,{"v":-3.8745089598019697E-3,"d":"-0.39%"}]
{"$rows_left_out":194}
{"sheet":"Cash Intra","index":2,"n_rows":243,"n_cols":13,"rows_kept":243,"merged":[[7,0,8,0],[7,1,8,1],[7,2,8,2],[7,3,8,3],[7,4,7,6],[7,7,7,9]]}
[]
[]
[]
[]
[{"$nulls":12},"Back to Main Page"]
["FOR INTRA DAY TRADING",{"$nulls":9},{"$f":"Main!B10","v":"2024-08-20"}]
[]
["Sr.no",null,"CLOSE RATE","Pivot Point","Supports",null,null,"Resistances"]
[{"$nulls":4},"S1","S2","S3","R1","R2","R3","HIGH","LOW","Total Trade Quanity in Lakhs"]
[1,"Nifty 50",24572.65,{"v":24578.13333333333,"d":"24578.13"},{"v":24517.466666666664,"d":"24517.47"},{"v":24462.283333333333,"d":"24462.28"},{"v":24401.616666666665,"d":"24401.62"},{"v":24633.316666666662,"d":"24633.32"},{"v":24693.983333333334,"d":"24693.98"},{"v":24749.16666666666,"d":"24749.17"},{"v":24638.8,"d":"24638.80"},24522.95]
[2,"Nifty Bank",50368.35,{"v":50460.05000000001,"d":"50460.05"},{"v":50191.85000000002,"d":"50191.85"},{"v":50015.35000000001,"d":"50015.35"},{"v":49747.15000000002,"d":"49747.15"},{"v":50636.55000000002,"d":"50636.55"},{"v":50904.750000000015,"d":"50904.75"},{"v":51081.250000000015,"d":"51081.25"},50728.25,50283.55]
[3,"Nifty CPSE",7376.75,{"v":7380.283333333333,"d":"7380.28"},{"v":7353.166666666666,"d":"7353.17"},{"v":7329.583333333333,"d":"7329.58"},{"v":7302.466666666666,"d":"7302.47"},{"v":7403.866666666666,"d":"7403.87"},{"v":7430.983333333333,"d":"7430.98"},{"v":7454.566666666666,"d":"7454.57"},{"v":7407.4,"d":"7407.40"},{"v":7356.7,"d":"7356.70"}]
[4,"Nifty Infra",{"v":9182.7,"d":"9182.70"},{"v":9194.966666666667,"d":"9194.97"},{"v":9154.133333333335,"d":"9154.13"},{"v":9125.566666666668,"d":"9125.57"},{"v":9084.733333333335,"d":"9084.73"},{"v":9223.533333333335,"d":"9223.53"},{"v":9264.366666666667,"d":"9264.37"},{"v":9292.933333333334,"d":"9292.93"},{"v":9235.8,"d":"9235.80"},{"v":9166.4,"d":"9166.40"}]
[5,"Nifty IT",41236.85,{"v":41081.666666666664,"d":"41081.67"},{"v":40891.73333333333,"d":"40891.73"},{"v":40546.61666666667,"d":"40546.62"},{"v":40356.683333333334,"d":"40356.68"},{"v":41426.783333333326,"d":"41426.78"},{"v":41616.71666666666,"d":"41616.72"},{"v":41961.83333333332,"d":"41961.83"},{"v":41271.6,"d":"41271.60"},40736.55]
[6,"Nifty PSE",{"v":11314.6,"d":"11314.60"},{"v":11315.4,"d":"11315.40"},{"v":11264.949999999999,"d":"11264.95"},{"v":11215.3,"d":"11215.30"},{"v":11164.849999999999,"d":"11164.85"},11365.05,{"v":11415.5,"d":"11415.50"},11465.15,11365.85,11265.75]
[7,"Nifty Midcap 50",16260.05,{"v":16276.950000000003,"d":"16276.95"},{"v":16184.800000000005,"d":"16184.80"},{"v":16109.550000000003,"d":"16109.55"},{"v":16017.400000000005,"d":"16017.40"},{"v":16352.200000000004,"d":"16352.20"},{"v":16444.350000000002,"d":"16444.35"},{"v":16519.600000000006,"d":"16519.60"},{"v":16369.1,"d":"16369.10"},{"v":16201.7,"d":"16201.70"}]
[8,"ABB",7822.6,{"v":7871.983333333334,"d":"7871.98"},{"v":7759.5666666666675,"d":"7759.57"},{"v":7696.533333333334,"d":"7696.53"},{"v":7584.116666666668,"d":"7584.12"},{"v":7935.016666666667,"d":"7935.02"},{"v":8047.433333333333,"d":"8047.43"},{"v":8110.466666666667,"d":"8110.47"},7984.4,7808.95,1.40445]
[9,"ACC",2347.45,{"v":2343.7999999999997,"d":"2343.80"},{"v":2332.6499999999996,"d":"2332.65"},2317.85,{"v":2306.7,"d":"2306.70"},{"v":2358.5999999999995,"d":"2358.60"},2369.75,{"v":2384.5499999999993,"d":"2384.55"},2354.95,2329,1.7048]
[10,"APLAPOLLO",1357,{"v":1372.1833333333334,"d":"1372.18"},{"v":1336.8166666666668,"d":"1336.82"},{"v":1316.6333333333334,"d":"1316.63"},{"v":1281.2666666666669,"d":"1281.27"},{"v":1392.3666666666668,"d":"1392.37"},{"v":1427.7333333333336,"d":"1427.73"},{"v":1447.9166666666667,"d":"1447.92"},1407.55,1352,10.03809]
[11,"AUBANK",615.25,{"v":615.9333333333333,"d":"615.93"},{"v":609.3166666666666,"d":"609.32"},{"v":603.3833333333333,"d":"603.38"},{"v":596.7666666666667,"d":"596.77"},{"v":621.8666666666666,"d":"621.87"},{"v":628.4833333333331,"d":"628.48"},{"v":634.4166666666665,"d":"634.42"},622.55,610,22.73232]
{"$rows_left_out":224}
{"sheet":"MidCap Intra","index":3,"n_rows":533,"n_cols":13,"rows_kept":533,"merged":[[0,0,0,1],[8,0,9,0],[8,1,9,1],[8,2,9,2],[8,3,9,3],[8,4,8,6],[8,7,8,9]]}
[]
[]
[]
[]
[{"$nulls":11},"Back To Main Page"]
["FOR INTRA DAY TRADING",{"$nulls":9},{"$f":"Main!B10","v":"2024-08-20"}]
[null,null," "]
[]
["Sr.no","Scrip","CLOSE RATE","Pivot Point","Supports",null,null,"Resistances"]
[{"$nulls":4},"S1","S2","S3","R1","R2","R3","HIGH","LOW","Total Trade Quanity in Lakhs"]
[1,"360ONE",1098.05,{"v":1092.1000000000001,"d":"1092.10"},{"v":1084.2000000000003,"d":"1084.20"},{"v":1070.3500000000001,"d":"1070.35"},{"v":1062.4500000000003,"d":"1062.45"},{"v":1105.9500000000003,"d":"1105.95"},{"v":1113.8500000000004,"d":"1113.85"},{"v":1127.7000000000003,"d":"1127.70"},1100,1078.25,8.40353]
[2,"3MINDIA",35426.45,{"v":35665.5,"d":"35665.50"},{"v":34971,"d":"34971.00"},34515.55,33821.05,36120.95,36815.45,{"v":37270.899999999994,"d":"37270.90"},36360,35210.05,0.05834]
[3,"ABB",7822.6,{"v":7871.983333333334,"d":"7871.98"},{"v":7759.5666666666675,"d":"7759.57"},{"v":7696.533333333334,"d":"7696.53"},{"v":7584.116666666668,"d":"7584.12"},{"v":7935.016666666667,"d":"7935.02"},{"v":8047.433333333333,"d":"8047.43"},{"v":8110.466666666667,"d":"8110.47"},7984.4,7808.95,1.40445]
[4,"ACC",2347.45,{"v":2343.7999999999997,"d":"2343.80"},{"v":2332.6499999999996,"d":"2332.65"},2317.85,{"v":2306.7,"d":"2306.70"},{"v":2358.5999999999995,"d":"2358.60"},2369.75,{"v":2384.5499999999993,"d":"2384.55"},2354.95,2329,1.7048]
[5,"AIAENG",4595.9,{"v":4604.3,"d":"4604.30"},4567.35,{"v":4538.8,"d":"4538.80"},4501.85,4632.85,{"v":4669.799999999999,"d":"4669.80"},4698.35,4641.25,4575.75,0.52405]
[6,"APLAPOLLO",1357,{"v":1372.1833333333334,"d":"1372.18"},{"v":1336.8166666666668,"d":"1336.82"},{"v":1316.6333333333334,"d":"1316.63"},{"v":1281.2666666666669,"d":"1281.27"},{"v":1392.3666666666668,"d":"1392.37"},{"v":1427.7333333333336,"d":"1427.73"},{"v":1447.9166666666667,"d":"1447.92"},1407.55,1352,10.03809]
[7,"AUBANK",615.25,{"v":615.9333333333333,"d":"615.93"},{"v":609.3166666666666,"d":"609.32"},{"v":603.3833333333333,"d":"603.38"},{"v":596.7666666666667,"d":"596.77"},{"v":621.8666666666666,"d":"621.87"},{"v":628.4833333333331,"d":"628.48"},{"v":634.4166666666665,"d":"634.42"},622.55,610,22.73232]
[8,"AARTIIND",617.5,{"v":615.4666666666667,"d":"615.47"},{"v":606.0333333333334,"d":"606.03"},{"v":594.5666666666667,"d":"594.57"},{"v":585.1333333333334,"d":"585.13"},{"v":626.9333333333334,"d":"626.93"},{"v":636.3666666666668,"d":"636.37"},{"v":647.8333333333334,"d":"647.83"},624.9,604,26.7027]
[9,"AAVAS",1661.85,{"v":1671.8500000000001,"d":"1671.85"},{"v":1641.7500000000002,"d":"1641.75"},1621.65,{"v":1591.5500000000002,"d":"1591.55"},{"v":1691.9500000000003,"d":"1691.95"},{"v":1722.0500000000002,"d":"1722.05"},{"v":1742.1500000000003,"d":"1742.15"},1701.95,1651.75,1.87682]
[10,"ABBOTINDIA",28098.6,{"v":28004.183333333334,"d":"28004.18"},{"v":27738.416666666668,"d":"27738.42"},{"v":27378.233333333334,"d":"27378.23"},{"v":27112.466666666667,"d":"27112.47"},{"v":28364.36666666667,"d":"28364.37"},{"v":28630.13333333333,"d":"28630.13"},{"v":28990.31666666667,"d":"28990.32"},28269.95,27644,0.12331]
{"$rows_left_out":508}
{"sheet":"Bulk Deals","index":4,"n_rows":274,"n_cols":8,"rows_kept":274,"merged":[[4,0,4,1],[4,2,4,3],[6,1,6,2]]}
[" "]
[]
[]
[]
[]
[{"$nulls":4},"Back To Main Page"]
["Subject :","BULK DEAL",null,{"$f":"Main!B10","v":"2024-08-20"}]
[]
["Date","Scrip code","Scrip Name","Client Name","Buy / Sell","Quantity Traded","Trade Price / Wt.Avg.trade price","Exchange  "]
["2024-08-19",539661,"ACEMEN","GREEN PEAKS ENTERPRISES LLP","BUY",{"v":20000,"d":"20,000"},74.21,"BSE"]
["2024-08-19",531525,"ACESOFT","ACE TECHNOLOGIES","SELL",{"v":105000,"d":"105,000"},346,"BSE"]
["2024-08-19",531525,"ACESOFT","SHANKAR SHARMA","BUY",{"v":34000,"d":"34,000"},346,"BSE"]
["2024-08-19",538351,"AFEL","KAUSHAL HITESHBHAI PARIKH","SELL",{"v":122000,"d":"122,000"},14.28,"BSE"]
["2024-08-19",540829,"CHANDRIMA","PACE STOCK BROKING SERVICES PVT LTD","SELL",{"v":12328,"d":"12,328"},29.51,"BSE"]
["2024-08-19",534691,"COMCL","RAJEEV PERIWAL","BUY",{"v":60000,"d":"60,000"},36.71,"BSE"]
["2024-08-19",530755,"CORNE","URMIL SATISHKUMAR SHAH","BUY",{"v":27921,"d":"27,921"},10.83,"BSE"]
["2024-08-19",543595,"EPBIO","ANKITAGUPTA","BUY",{"v":10000,"d":"10,000"},204.75,"BSE"]
["2024-08-19",543595,"EPBIO","ANKITAGUPTA","SELL",500,200.05,"BSE"]
["2024-08-19",531035,"ERAAYA","BAL KRISHEN","BUY",{"v":112500,"d":"112,500"},800,"BSE"]
["2024-08-19",522195,"FRONTSP","COUNTER CYCLICAL INVESTMENTS PRIVATE LIMITED","SELL",{"v":22754,"d":"22,754"},2125.35,"BSE"]
{"$rows_left_out":255}
{"sheet":"Call Tracker (Equity)","index":5,"n_rows":292,"n_cols":18,"rows_kept":292}
[]
[]
[]
[]
[{"$nulls":12},"Back To Main Page"]
["Retail Research Technical Calls & Fundamental Performance Report for the month of July-2024"]
[{"$nulls":12},{"$f":"Main!B10","v":"2024-08-20"}]
["Positional  Call"]
["Sr.no","Date",null,"Company","Rec","Rec Price","Stop Loss***","Call Closed At","Target","Remark","Profit / Loss per Share","All charges","Net Gain / Loss  %","Status","Closed Date","Market Closing Price","Second Buying Date"]
[1,"2024-06-25",null,"HAPPSTMNDS","Accu",830,795,780,"900-950","Loss of Rs.50/-",{"$f":"H10-F10","v":-50},{"$f":"(F10*-0.3)/100","v":-2.49},{"$f":"(K10+L10)/F10","v":{"v":-0.06324096385542169,"d":"-6.32%"}},"Unsuccessful","2024-08-05",null,null,"H"]
[2,"2024-06-27",null,"BAJAJ-AUTO","Accu",9325,8900,9825,"10000-10400","Profit of Rs.500/-",{"$f":"H11-F11","v":500},{"$f":"(F11*-0.3)/100","v":{"v":-27.975,"d":"-27.98"}},{"$f":"(K11+L11)/F11","v":{"v":0.05061930294906166,"d":"5.06%"}},"Successful","2024-08-01",null,null,"H"]
[3,"2024-07-01",null,"RELIANCE","Accu",3075,2940,2900,"3300-3500","Loss of Rs.175/-",-175,{"v":-9.225,"d":"-9.23"},{"v":-0.05991056910569106,"d":"-5.99%"},"Unsuccessful","2024-08-05",null,null,"H"]
[4,"2024-07-19",null,"BAJAJFINSV","Accu",1617,1560,1555,"1720-1800","Loss of Rs.62/-",{"$f":"H13-F13","v":-62},{"$f":"(F13*-0.3)/100","v":{"v":-4.851,"d":"-4.85"}},{"$f":"(K13+L13)/F13","v":{"v":-0.0413426097711812,"d":"-4.13%"}},"Unsuccessful","2024-08-08",null,null,"H"]
[5,"2024-07-25",null,"NESTLEIND","Accu","2390-2470",2330,null,"2650-2800","Open",{"$nulls":5},{"$f":"VLOOKUP(D14,'MidCap Intra'!$B$11:$C$571,2,0)","v":2503.15},null,"H"]
[6,"2024-07-26",null,"LTF","Accu",173.5,164,163.5,"195-205","Loss of Rs.10/-",{"$f":"H15-F15","v":-10},{"$f":"(F15*-0.3)/100","v":{"v":-0.5205,"d":"-0.52"}},{"$f":"(K15+L15)/F15","v":{"v":-0.060636887608069165,"d":"-6.06%"}},"Unsuccessful","2024-08-13",null,null,"H"]
[7,"2024-07-26",null,"RKFORGE","Accu",840,790,882,"900-950","Profit of Rs.42/-",{"$f":"H16-F16","v":42},{"$f":"(F16*-0.3)/100","v":-2.52},{"$f":"(K16+L16)/F16","v":{"v":0.04699999999999999,"d":"4.70%"}},"Successful","2024-08-02",null,null,"H"]
[8,"2024-07-29",null,"CARBORUNIV","Accu",1710,1645,1605,"1840-1940","Loss of Rs.105/-",-105,-5.13,{"v":-0.06440350877192982,"d":"-6.44%"},"Unsuccessful","2024-08-05",null,null,"H"]
[9,"2024-07-30",null,"LTTS","Accu","5040-5170",4800,null,"5540-5900","Open",{"$nulls":5},{"$f":"VLOOKUP(D18,'MidCap Intra'!$B$11:$C$571,2,0)","v":5284.05},null,"K"]
[10,"2024-07-30",null,"VBL","Accu",1565,1495,1490,"1700-1800","Loss of Rs.75/-",{"$f":"H19-F19","v":-75},{"$f":"(F19*-0.3)/100","v":{"v":-4.695,"d":"-4.70"}},{"$f":"(K19+L19)/F19","v":{"v":-0.050923322683706064,"d":"-5.09%"}},"Unsuccessful","2024-08-06",null,null,"H"]
[11,"2024-07-30",null,"IOC","Accu",177.5,167,167,"195-210","Loss of Rs.10.5/-",{"$f":"H20-F20","v":-10.5},{"$f":"(F20*-0.3)/100","v":{"v":-0.5325,"d":"-0.53"}},{"$f":"(K20+L20)/F20","v":{"v":-0.06215492957746479,"d":"-6.22%"}},"Unsuccessful","2024-08-06",null,null,"H"]
{"$rows_left_out":273}
{"sheet":"Call Tracker (F&O)","index":6,"n_rows":14,"n_cols":16,"rows_kept":14,"merged":[[12,0,13,0],[12,1,13,1],[12,9,13,9],[12,12,13,12],[12,13,13,13],[12,14,13,14],[12,15,13,15]]}
[]
["Master Trade High Risk"]
["Sr.no","Date",null,"Company","Rec","Rec Price","Stop Loss","Call Closed At","Target","Remark","Profit / Loss per share","All charges","Gain / Loss  per Lot","Lot","Status","Closed Date"]
[1,"2024-08-19",null,"ICICIBANK 29AUG FUT","BUY",1180,1158,null,1220,"Open"]
[]
[]
[]
["Master Trade Medium Risk "]
["Sr.no","Date",null,"Company","Rec","Rec Price","Stop Loss","Call Closed At","Target","Remark","Profit/ Loss per lot ","All charges","Gain / Loss  per Lot","Lot","Status","Closed Date"]
[1,"2024-08-09",null,"BANKNIFTY 50800 CE 14 AUG","Buy",285,180,202.5,"280-290","Loss of Rs.82.5/-",{"$f":"H10-F10","v":-82.5},{"v":50,"d":"50.00"},{"$f":"(K10*N10)-L10","v":-1287.5},15,"Unsuccessful","2024-08-09"]
[2,"2024-08-13",null,"BANKNIFTY 50200 PE 14 AUG","Buy",175,100,265,280,"Profit of Rs.90/-",{"$f":"H11-F11","v":90},{"v":50,"d":"50.00"},{"v":1300,"d":"1300.0"},15,"Successful","2024-08-13"]
[3,"2024-08-14",null,"BANKNIFTY 49800 PE 14 AUG","Buy",92.5,45,70,265,"Loss of Rs.22.5/-",{"$f":"H12-F12","v":-22.5},{"v":50,"d":"50.00"},-387.5,15,"Unsuccessful","2024-08-14"]
[4,"2024-08-16",null,"BANKNIFTY 50200 CE 21 AUG","BUY",245,null,322.5,null,"Profit of Rs.45/-",{"$f":"H13-F13","v":77.5},{"v":51,"d":"51.00"},{"v":572,"d":"572.0"},15,"Successful","2024-08-16"]
[{"$nulls":3},"BANKNIFTY 50600 CE 21 AUG","SELL",120,null,152.5,null,null,{"$f":"F14-H14","v":-32.5},{"v":52,"d":"52.00"}]