{"text_format":"3","workbook":"xlsx","n_sheets":11,"sheets":["Main","Future Intra","Cash Intra","MidCap Intra","Bulk Deals","Call Tracker (Equity & F&O)","Sheet2","Sheet1","Sheet3","Sheet4","Sheet5"],"not_rendered":{"images":4,"defined_names":5},"read":"whole","date_system":"1900"}

{"sheet":"Main","index":0,"n_rows":27,"n_cols":11,"rows_kept":27}
[null,"                                                                                                 "]
{"$rows_empty":8}
[null,"2019-12-19"]
[]
[null,"Sheet No.","Template Name","Summary"]
[null,1,"Future Intra","For Intraday trading in F&O segment"]
[null,2,"Cash Intra","For Intraday trading in cash market segment"]
[null,3,"Mid-cap Intra","For Intraday trading in Mid-cap stocks"]
[null,4,"Bulk Deals","Reveals Bulk Deals carried on NSE & BSE"]
[null,5,"Call Tracker"]
{"$rows_empty":9}
[{"$nulls":10},"`"]

{"sheet":"Future Intra","index":1,"n_rows":193,"n_cols":15,"rows_kept":193,"merged":[[8,0,9,0],[8,1,9,1],[8,2,9,2],[8,5,8,7],[8,8,8,10]]}
[]
[]
[]
[]
[{"$nulls":12},"Back to Main Page"]
["FOR INTRA DAY TRADING",{"$nulls":10},{"$f":"Main!B10","v":"2019-12-19"}]
[]
[]
["Sr.no","Sector","Scrip","CLOSE RATE","Pivot Point","Supports",null,null,"Resistances"]
[null,"Sector",null,"Point","Point","S1","S2","S3","R1","R2","R3","HIGH","LOW","OI","% Change in OI"]
[1,"Index","BANKNIFTY",{"v":32279.3,"d":"32279.30"},{"v":32226.083333333332,"d":"32226.08"},{"v":32108.216666666664,"d":"32108.22"},{"v":31937.13333333333,"d":"31937.13"},{"v":31819.266666666663,"d":"31819.27"},{"v":32397.166666666664,"d":"32397.17"},{"v":32515.033333333333,"d":"32515.03"},{"v":32686.116666666665,"d":"32686.12"},32343.95,32055,1478580,{"v":0.038037068239258634,"d":"3.80%"}]
[2,"Index","NIFTY",12243.15,{"v":12222.633333333333,"d":"12222.63"},{"v":12192.166666666666,"d":"12192.17"},{"v":12141.183333333332,"d":"12141.18"},{"v":12110.716666666665,"d":"12110.72"},{"v":12273.616666666667,"d":"12273.62"},{"v":12304.083333333334,"d":"12304.08"},{"v":12355.066666666668,"d":"12355.07"},12253.1,12171.65,15645825,{"v":0.018434349598457293,"d":"1.84%"}]
[3,"Index","NIFTYIT",{"v":15730,"d":"15730.00"},{"v":15756.666666666666,"d":"15756.67"},{"v":15673.333333333332,"d":"15673.33"},{"v":15616.666666666666,"d":"15616.67"},{"v":15533.333333333332,"d":"15533.33"},{"v":15813.333333333332,"d":"15813.33"},{"v":15896.666666666664,"d":"15896.67"},{"v":15953.333333333332,"d":"15953.33"},15840,15700,5600,{"v":0,"d":"0.00%"}]
[4,"Cement","ACC",1453.55,{"v":1456.4833333333333,"d":"1456.48"},{"v":1438.1666666666667,"d":"1438.17"},{"v":1422.7833333333333,"d":"1422.78"},{"v":1404.4666666666667,"d":"1404.47"},{"v":1471.8666666666668,"d":"1471.87"},{"v":1490.1833333333334,"d":"1490.18"},{"v":1505.5666666666668,"d":"1505.57"},1474.8,1441.1,3414400,{"v":0.013054830287206266,"d":"1.31%"}]
[5,"Others","ADANIENT",208.35,{"v":208.96666666666667,"d":"208.97"},{"v":205.13333333333333,"d":"205.13"},{"v":201.91666666666666,"d":"201.92"},{"v":198.08333333333331,"d":"198.08"},{"v":212.18333333333334,"d":"212.18"},{"v":216.01666666666665,"d":"216.02"},{"v":219.23333333333335,"d":"219.23"},212.8,205.75,29696000,{"v":-0.007751937984496124,"d":"-0.78%"}]
[6,"Others","ADANIPORTS",374.95,{"v":373.7666666666667,"d":"373.77"},{"v":371.2833333333334,"d":"371.28"},{"v":367.61666666666673,"d":"367.62"},{"v":365.13333333333344,"d":"365.13"},{"v":377.4333333333334,"d":"377.43"},{"v":379.91666666666663,"d":"379.92"},{"v":383.58333333333337,"d":"383.58"},376.25,370.1,33147500,{"v":7.36970065339614E-3,"d":"0.74%"}]
[7,"Power","ADANIPOWER",{"v":61.3,"d":"61.30"},{"v":61.31666666666666,"d":"61.32"},{"v":60.23333333333333,"d":"60.23"},{"v":59.166666666666664,"d":"59.17"},{"v":58.08333333333333,"d":"58.08"},{"v":62.383333333333326,"d":"62.38"},{"v":63.46666666666667,"d":"63.47"},{"v":64.53333333333333,"d":"64.53"},62.4,60.25,81110000,{"v":0.07061774023231257,"d":"7.06%"}]
[8,"Automobile","AMARAJABAT",742.45,{"v":744.3666666666667,"d":"744.37"},{"v":737.0833333333334,"d":"737.08"},{"v":731.7166666666667,"d":"731.72"},{"v":724.4333333333334,"d":"724.43"},{"v":749.7333333333333,"d":"749.73"},{"v":757.0166666666667,"d":"757.02"},{"v":762.3833333333333,"d":"762.38"},751.65,739,1357000,{"v":-0.022545559317150472,"d":"-2.25%"}]
[9,"Cement","AMBUJACEM",{"v":196.7,"d":"196.70"},{"v":197.08333333333334,"d":"197.08"},{"v":193.86666666666667,"d":"193.87"},{"v":191.03333333333333,"d":"191.03"},{"v":187.81666666666666,"d":"187.82"},{"v":199.91666666666669,"d":"199.92"},{"v":203.13333333333333,"d":"203.13"},{"v":205.9666666666667,"d":"205.97"},200.3,194.25,19047500,{"v":0.02709625235912645,"d":"2.71%"}]
[10,"Others","APOLLOHOSP",1385.65,{"v":1385.1833333333334,"d":"1385.18"},{"v":1375.4666666666667,"d":"1375.47"},{"v":1365.2833333333333,"d":"1365.28"},{"v":1355.5666666666666,"d":"1355.57"},{"v":1395.3666666666668,"d":"1395.37"},{"v":1405.0833333333335,"d":"1405.08"},{"v":1415.2666666666669,"d":"1415.27"},1394.9,1375,2206500,{"v":-0.10577507598784194,"d":"-10.58%"}]
{"$rows_left_out":159}
{"sheet":"Cash Intra","index":2,"n_rows":247,"n_cols":13,"rows_kept":247,"merged":[[7,0,8,0],[7,1,8,1],[7,2,8,2],[7,3,8,3],[7,4,7,6],[7,7,7,9]]}
[]
[]
[]
[]
[{"$nulls":12},"Back to Main Page"]
["FOR INTRA DAY TRADING",{"$nulls":9},{"$f":"Main!B10","v":"2019-12-19"}]
[]
["Sr.no","Scrip","CLOSE RATE","Pivot Point","Supports",null,null,"Resistances"]
[null,null,"Point",null,"S1","S2","S3","R1","R2","R3","HIGH","LOW","Total Trade Quanity in Lakhs"]
[1,"Nifty 50",12221.65,{"v":12207.6,"d":"12207.60"},{"v":12177.5,"d":"12177.50"},12133.35,12103.25,12251.75,{"v":12281.850000000002,"d":"12281.85"},{"v":12326,"d":"12326.00"},12237.7,12163.45]
[2,"Nifty Bank",32244.25,{"v":32185.066666666666,"d":"32185.07"},{"v":32076.48333333333,"d":"32076.48"},{"v":31908.716666666664,"d":"31908.72"},{"v":31800.133333333328,"d":"31800.13"},{"v":32352.833333333332,"d":"32352.83"},{"v":32461.416666666668,"d":"32461.42"},{"v":32629.183333333334,"d":"32629.18"},32293.65,32017.3]
[3,"Nifty CPSE",1877.8,{"v":1875.8,"d":"1875.80"},1869.55,{"v":1861.3,"d":"1861.30"},1855.05,1884.05,{"v":1890.3,"d":"1890.30"},1898.55,1882.05,1867.55]
[4,"Nifty Infra",3263.45,{"v":3264.5500000000006,"d":"3264.55"},{"v":3251.700000000001,"d":"3251.70"},{"v":3239.9500000000007,"d":"3239.95"},{"v":3227.1000000000013,"d":"3227.10"},{"v":3276.300000000001,"d":"3276.30"},{"v":3289.1500000000005,"d":"3289.15"},{"v":3300.900000000001,"d":"3300.90"},3277.4,3252.8]
[5,"Nifty IT",15710.65,{"v":15731.866666666667,"d":"15731.87"},{"v":15627.933333333334,"d":"15627.93"},{"v":15545.216666666667,"d":"15545.22"},{"v":15441.283333333335,"d":"15441.28"},{"v":15814.583333333334,"d":"15814.58"},{"v":15918.516666666665,"d":"15918.52"},{"v":16001.233333333334,"d":"16001.23"},15835.8,15649.15]
[6,"Nifty PSE",3152.9,{"v":3155.716666666667,"d":"3155.72"},{"v":3139.883333333334,"d":"3139.88"},{"v":3126.866666666667,"d":"3126.87"},{"v":3111.0333333333338,"d":"3111.03"},{"v":3168.7333333333345,"d":"3168.73"},{"v":3184.5666666666675,"d":"3184.57"},{"v":3197.583333333335,"d":"3197.58"},3171.55,3142.7]
[7,"Nifty Midcap 50",4620.8,{"v":4623.349999999999,"d":"4623.35"},{"v":4595.649999999999,"d":"4595.65"},{"v":4570.499999999999,"d":"4570.50"},{"v":4542.799999999998,"d":"4542.80"},{"v":4648.499999999999,"d":"4648.50"},{"v":4676.2,"d":"4676.20"},{"v":4701.349999999999,"d":"4701.35"},4651.05,4598.2]
[8,"ACC",1450.4,{"v":1453.1833333333334,"d":"1453.18"},{"v":1435.9666666666667,"d":"1435.97"},{"v":1421.5333333333333,"d":"1421.53"},{"v":1404.3166666666666,"d":"1404.32"},{"v":1467.6166666666668,"d":"1467.62"},{"v":1484.8333333333335,"d":"1484.83"},{"v":1499.2666666666669,"d":"1499.27"},1470.4,1438.75,4.8128]
[9,"AUBANK",794.2,{"v":791.0666666666666,"d":"791.07"},{"v":784.1333333333332,"d":"784.13"},{"v":774.0666666666666,"d":"774.07"},{"v":767.1333333333332,"d":"767.13"},{"v":801.1333333333332,"d":"801.13"},{"v":808.0666666666666,"d":"808.07"},{"v":818.1333333333332,"d":"818.13"},798,781,2.87842]
[10,"ADANIPORTS",374.5,{"v":373.1333333333334,"d":"373.13"},{"v":370.46666666666675,"d":"370.47"},{"v":366.4333333333334,"d":"366.43"},{"v":363.76666666666677,"d":"363.77"},{"v":377.16666666666674,"d":"377.17"},{"v":379.83333333333337,"d":"379.83"},{"v":383.86666666666673,"d":"383.87"},375.8,369.1,39.60881]
[11,"ADANIPOWER",61.25,61.25,60.25,59.25,58.25,62.25,63.25,64.25,62.25,60.25,54.25898]
{"$rows_left_out":228}
{"sheet":"MidCap Intra","index":3,"n_rows":545,"n_cols":13,"rows_kept":545,"merged":[[0,0,0,1],[8,0,9,0],[8,1,9,1],[8,2,9,2],[8,3,9,3],[8,4,8,6],[8,7,8,9]]}
[]
[]
[]
[]
[{"$nulls":11},"Back To Main Page"]
["FOR INTRA DAY TRADING",{"$nulls":9},{"$f":"Main!B10","v":"2019-12-19"}]
[null,null," "]
[]
["Sr.no","Scrip","CLOSE RATE","Pivot Point","Supports",null,null,"Resistances"]
[null,null,"Point",null,"S1","S2","S3","R1","R2","R3","HIGH","LOW","Total Trade Quanity in Lakhs"]
[1,"3MINDIA",20844.85,20914.95,{"v":20679.9,"d":"20679.90"},20514.95,{"v":20279.9,"d":"20279.90"},{"v":21079.9,"d":"21079.90"},{"v":21314.949999999997,"d":"21314.95"},{"v":21479.9,"d":"21479.90"},21150,20750,0.0093]
[2,"ACC",1450.4,{"v":1453.1833333333334,"d":"1453.18"},{"v":1435.9666666666667,"d":"1435.97"},{"v":1421.5333333333333,"d":"1421.53"},{"v":1404.3166666666666,"d":"1404.32"},{"v":1467.6166666666668,"d":"1467.62"},{"v":1484.8333333333335,"d":"1484.83"},{"v":1499.2666666666669,"d":"1499.27"},1470.4,1438.75,4.8128]
[3,"AIAENG",1620.4,{"v":1624.9000000000003,"d":"1624.90"},{"v":1609.1000000000006,"d":"1609.10"},{"v":1597.8000000000002,"d":"1597.80"},{"v":1582.0000000000005,"d":"1582.00"},{"v":1636.2000000000007,"d":"1636.20"},{"v":1652.0000000000005,"d":"1652.00"},{"v":1663.3000000000009,"d":"1663.30"},1640.7,1613.6,0.1205]
[4,"APLAPOLLO",1626.6,{"v":1635.8333333333333,"d":"1635.83"},{"v":1603.8666666666666,"d":"1603.87"},{"v":1581.1333333333332,"d":"1581.13"},{"v":1549.1666666666665,"d":"1549.17"},{"v":1658.5666666666666,"d":"1658.57"},{"v":1690.5333333333333,"d":"1690.53"},{"v":1713.2666666666667,"d":"1713.27"},1667.8,1613.1,0.15218]
[5,"AUBANK",794.2,{"v":791.0666666666666,"d":"791.07"},{"v":784.1333333333332,"d":"784.13"},{"v":774.0666666666666,"d":"774.07"},{"v":767.1333333333332,"d":"767.13"},{"v":801.1333333333332,"d":"801.13"},{"v":808.0666666666666,"d":"808.07"},{"v":818.1333333333332,"d":"818.13"},798,781,2.87842]
[6,"AAVAS",1876.5,{"v":1881.6499999999999,"d":"1881.65"},{"v":1864.8499999999997,"d":"1864.85"},{"v":1853.1999999999998,"d":"1853.20"},{"v":1836.3999999999996,"d":"1836.40"},{"v":1893.2999999999997,"d":"1893.30"},{"v":1910.1,"d":"1910.10"},{"v":1921.7499999999998,"d":"1921.75"},1898.45,1870,0.2114]
[7,"ABBOTINDIA",13190.9,{"v":13238.716666666667,"d":"13238.72"},{"v":13067.433333333334,"d":"13067.43"},{"v":12943.966666666667,"d":"12943.97"},{"v":12772.683333333334,"d":"12772.68"},{"v":13362.183333333334,"d":"13362.18"},{"v":13533.466666666667,"d":"13533.47"},{"v":13656.933333333334,"d":"13656.93"},13410,13115.25,0.0545]
[8,"ADANIGAS",150.75,{"v":151.04999999999998,"d":"151.05"},{"v":150.19999999999996,"d":"150.20"},{"v":149.64999999999998,"d":"149.65"},{"v":148.79999999999995,"d":"148.80"},{"v":151.59999999999997,"d":"151.60"},152.45,{"v":152.99999999999997,"d":"153.00"},151.9,150.5,3.80427]
[9,"ADANIGREEN",135.1,{"v":135.46666666666667,"d":"135.47"},{"v":133.63333333333333,"d":"133.63"},{"v":132.16666666666666,"d":"132.17"},{"v":130.33333333333331,"d":"130.33"},{"v":136.93333333333334,"d":"136.93"},{"v":138.76666666666665,"d":"138.77"},{"v":140.23333333333335,"d":"140.23"},137.3,134,6.90735]
[10,"ADANIPORTS",374.5,{"v":373.1333333333334,"d":"373.13"},{"v":370.46666666666675,"d":"370.47"},{"v":366.4333333333334,"d":"366.43"},{"v":363.76666666666677,"d":"363.77"},{"v":377.16666666666674,"d":"377.17"},{"v":379.83333333333337,"d":"379.83"},{"v":383.86666666666673,"d":"383.87"},375.8,369.1,39.60881]
{"$rows_left_out":513}
{"sheet":"Bulk Deals","index":4,"n_rows":51,"n_cols":8,"rows_kept":51,"merged":[[4,0,4,1],[4,2,4,3],[6,1,6,2]]}
[" "]
[]
[]
[]
[]
[{"$nulls":4},"Back To Main Page"]
["Subject :","BULK DEAL",null,{"$f":"Main!B10","v":"2019-12-19"}]
[]
["Date","Scrip code","Scrip Name","Client Name","Buy / Sell","Quantity Traded","Trade Price / Wt.Avg.trade price","Exchange  "]
["2019-12-18",538812,"AANCHALISP","YMD FINANCIAL CONSULTANCY PRIVATE LIMITED","BUY",{"v":104167,"d":"104,167"},{"v":12.8,"d":"12.80"},"BSE"]
["2019-12-18",538812,"AANCHALISP","YMD FINANCIAL CONSULTANCY PRIVATE LIMITED","SELL",{"v":129167,"d":"129,167"},13.61,"BSE"]
["2019-12-18",538778,"AKASHDEEP","SIRIUS ADVISORS PRIVATE LIMITED.","SELL",{"v":112022,"d":"112,022"},19.84,"BSE"]
["2019-12-18",538778,"AKASHDEEP","ARNOLD HOLDINGS LIMITED","SELL",{"v":75000,"d":"75,000"},18.9,"BSE"]
["2019-12-18",541702,"ASHNI","MOHAN LAKSHMI","SELL",{"v":25000,"d":"25,000"},3.82,"BSE"]
["2019-12-18",541702,"ASHNI","HANSABEN HASMUKHBHAI AMIN","BUY",{"v":26356,"d":"26,356"},3.82,"BSE"]
["2019-12-18",539274,"BLFL","KALPESH ANILBHAI MALVI","SELL",{"v":41985,"d":"41,985"},2.89,"BSE"]
["2019-12-18",530249,"BRIDGESE","HEMVIN CONSTRUCTION LIMITED","SELL",{"v":90000,"d":"90,000"},3.96,"BSE"]
["2019-12-18",530249,"BRIDGESE","VISHAL PRAGNESHBHAI SHAH","BUY",{"v":90500,"d":"90,500"},3.96,"BSE"]
["2019-12-18",530643,"ECORECO","BRIJKISHOR KISHANGOPAL SONI","BUY",{"v":100000,"d":"100,000"},{"v":30,"d":"30.00"},"BSE"]
["2019-12-18",530643,"ECORECO","FIRST ONLINE COMTRADES PRIVATE LIMITED","SELL",{"v":100000,"d":"100,000"},30,"BSE"]
{"$rows_left_out":32}
{"sheet":"Call Tracker (Equity & F&O)","index":5,"n_rows":342,"n_cols":18,"rows_kept":342,"merged":[[122,0,123,0],[122,1,123,1],[122,9,123,9],[122,11,123,11],[122,12,123,12],[122,13,123,13],[122,14,123,14],[124,0,125,0],[124,1,125,1],[124,9,125,9],[124,11,125,11],[124,12,125,12],[124,13,125,13],[124,14,125,14],[126,0,127,0],[126,1,127,1],[126,9,127,9],[126,11,127,11],[126,12,127,12],[126,13,127,13],[126,14,127,14],[128,0,129,0],[128,1,129,1],[128,9,129,9],[128,11,129,11],[128,12,129,12],[128,13,129,13],[128,14,129,14],[130,0,131,0],[130,1,131,1],[130,9,131,9],[130,11,131,11],[130,12,131,12],[130,13,131,13],[130,14,131,14],[132,0,133,0],[132,1,133,1],[132,9,133,9],[132,11,133,11],[132,12,133,12],[132,13,133,13],[132,14,133,14],[134,0,135,0],[134,1,135,1],[134,9,135,9],[134,11,135,11],[134,12,135,12],[134,13,135,13],[134,14,135,14],[136,0,137,0],[136,1,137,1],[136,9,137,9],[136,11,137,11],[136,12,137,12],[136,13,137,13],[136,14,137,14],[156,0,157,0],[156,1,157,1],[156,9,157,9],[156,11,157,11],[156,12,157,12],[156,13,157,13],[156,14,157,14],[158,0,159,0],[158,1,159,1],[158,9,159,9],[158,11,159,11],[158,12,159,12],[158,13,159,13],[158,14,159,14]]}
[]
[]
[]
[]
[{"$nulls":12},"Back To Main Page"]
["Retail Research Technical Calls & Fundamental Performance Report for the month of December-2019 "]
[{"$nulls":12},{"$f":"Main!B10","v":"2019-12-19"}]
[null,"Positional  Call"]
["Sr.no","Date",null,"Company","Rec","Rec Price","Stop Loss***","Call Closed At","Target","Remark","Profit / Loss per Share","Gain / Loss  %","Status","Closed Date","NSE Closed Price"]
[1,"2019-10-07",null,"PIDILITIND","Buy{}",1367.5,1297,1413.5,"1500-1520","Part Profit of Rs.46/-",{"$f":"H10-F10","v":46},{"$f":"K10/F10","v":{"v":0.03363802559414991,"d":"3.36%"}},"Successful","2019-10-31",{"$f":"VLOOKUP(D10,Sheet2!A51:M1690,6,0)","v":1364.7},null,null,"R"]
[2,"2019-11-11",null,"POWERGRID","Buy{}",192,183,190,"208-212","Loss of Rs.2/-",{"$f":"H11-F11","v":-2},{"$f":"K11/F11","v":{"v":-0.010416666666666666,"d":"-1.04%"}},"Unsuccessful","2019-12-11",{"$nulls":3},"R"]
[3,"2019-11-14",null,"HEIDELBERG","Buy{}",186.5,174,194.5,"205-210","Part Profit of Rs.8/-",{"$f":"H12-F12","v":8},{"$f":"K12/F12","v":{"v":0.04289544235924933,"d":"4.29%"}},"Successful","2019-11-20",{"$f":"VLOOKUP(D12,Sheet2!A71:M1710,6,0)","v":177.8},null,null,"H"]
[4,"2019-11-18",null,"BAJAJ-AUTO","Sell","3180-3200",3356.7,null,"2900-2850","Open",{"$nulls":4},{"$f":"VLOOKUP(D13,Sheet2!A74:M1713,6,0)","v":3213.65},null,null,"R"]
[5,"2019-11-18",null,"THERMAX","Buy","1025-1035",977,null,"1120-1140","Open",{"$nulls":4},{"$f":"VLOOKUP(D14,Sheet2!A75:M1714,6,0)","v":1056.5},null,null,"H"]
[6,"2019-11-20",null,"BRITANNIA","Buy","3075-3100",2930,null,"3380-3420","Open",{"$nulls":4},{"$f":"VLOOKUP(D15,Sheet2!A76:M1715,6,0)","v":3099.2},null,null,"H"]
[7,"2019-11-21",null,"HINDUNILVR","Buy",2020,1917,2082,"2200-2250","Part Profit of Rs.62/-",{"$f":"H16-F16","v":62},{"$f":"K16/F16","v":{"v":0.030693069306930693,"d":"3.07%"}},"Successful","2019-11-27",{"$f":"VLOOKUP(D16,Sheet2!A77:M1716,6,0)","v":1928.55},null,null,"H"]
[8,"2019-11-22",null,"GODREJPROP","Buy",885,837.7,932.5,"965-985","Profit of Rs.47.50/-",{"$f":"H17-F17","v":47.5},{"$f":"K17/F17","v":{"v":0.05367231638418079,"d":"5.37%"}},"Successful","2019-12-12",{"$nulls":3},"R"]
[9,"2019-11-27",null,"LT","Buy","1330-1340",1270,null,"1450-1500","Open",{"$nulls":4},{"$f":"VLOOKUP(D18,Sheet2!A80:M1719,6,0)","v":1319.35},null,null,"H"]
[10,"2019-12-02",null,"TCS","Buy",2030,1895,2110,"2200-2250","Profit of Rs.80/-",{"$f":"H19-F19","v":80},{"$f":"K19/F19","v":{"v":0.03940886699507389,"d":"3.94%"}},"Successful","2019-12-16",{"$nulls":3},"H"]
[11,"2019-12-02",null,"HAVELLS","Buy","662-667",632.7,null,"725-735","Open",{"$nulls":4},{"$f":"VLOOKUP(D20,Sheet2!A82:M1721,6,0)","v":652.05},null,null,"R"]
{"$rows_left_out":282}
{"sheet":"Sheet2","index":6,"n_rows":1899,"n_cols":14,"rows_kept":1899,"hidden":true}
["SYMBOL","SERIES","OPEN","HIGH","LOW","CLOSE","LAST","PREVCLOSE","TOTTRDQTY","TOTTRDVAL","TIMESTAMP","TOTALTRADES","ISIN","ISIN"]
["20MICRONS","EQ",32,32.2,31.75,31.9,31.75,31.9,13814,441398.95,"2019-12-18",112,"INE144J01027"]
["21STCENMGM","EQ",13.55,13.55,13.3,13.3,13.3,13.55,5,67,"2019-12-18",3,"INE253B01015"]
["3IINFOTECH","EQ",2.05,2.05,2,2,2.05,2.05,597570,1210533,"2019-12-18",474,"INE748C01020"]
["3MINDIA","EQ",20997.1,21150,20750,20844.85,20899.9,20967.3,930,19434215,"2019-12-18",405,"INE470A01017"]
["3PLAND","EQ",5.65,5.65,5.65,5.65,5.65,5.75,3021,17068.65,"2019-12-18",2,"INE105C01023"]
["5PAISA","EQ",180.1,181,177.05,178.8,181,180.65,889,158792.8,"2019-12-18",114,"INE618L01018"]
["63MOONS","EQ",102.35,107.5,101.55,103.85,104,102.1,194287,20340627,"2019-12-18",6107,"INE111B01023"]
["A2ZINFRA","EQ",8.05,8.1,7.15,7.65,7.7,8.05,442840,3356411.5,"2019-12-18",800,"INE619I01012"]
["AARTIDRUGS","EQ",498,505.9,495.35,503.6,505.9,495.2,9257,4651018.7,"2019-12-18",1064,"INE767A01016"]
["AARTIIND","EQ",774,778.65,761,768.3,769.05,768.7,58145,44758446.65,"2019-12-18",4890,"INE769A01020"]
["AARVEEDEN","EQ",11.7,11.7,11.15,11.3,11.55,11.45,3020,34159.05,"2019-12-18",81,"INE273D01019"]
["AAVAS","EQ",1898.45,1898.45,1870,1876.5,1870,1898.45,21140,39765000.75,"2019-12-18",5550,"INE216P01012"]
["ABAN","EQ",26.65,26.75,25.7,26.05,25.85,26.65,26978,706393.15,"2019-12-18",552,"INE421A01028"]
["ABB","EQ",1467.55,1474.9,1442.25,1451.45,1454,1474.4,120958,175853971.75,"2019-12-18",3822,"INE117A01022"]
["ABBOTINDIA","EQ",13370,13410,13115.25,13190.9,13168,13381.8,5450,72220617.6,"2019-12-18",2279,"INE358A01014"]
["ABCAPITAL","EQ",98.95,99.9,96.8,97.55,97.6,98.9,1145998,112616230.1,"2019-12-18",12094,"INE674K01013"]
["ABFRL","EQ",235.25,239.9,233.3,239.15,239,234,557471,132402088.25,"2019-12-18",11132,"INE647O01011"]
["ABSLBANETF","EQ",319.52,320.12,319.52,320.12,320.12,319.52,25,7997.6,"2019-12-18",2,"INF209KB1O58"]
["ACC","EQ",1462.1,1470.4,1438.75,1450.4,1450,1462.3,481280,700662341.1,"2019-12-18",17728,"INE012A01025"]
{"$rows_left_out":1699}
{"sheet":"Sheet1","index":7,"n_rows":0,"n_cols":0,"rows_kept":0,"hidden":true}

{"sheet":"Sheet3","index":8,"n_rows":0,"n_cols":0,"rows_kept":0,"hidden":true}

{"sheet":"Sheet4","index":9,"n_rows":0,"n_cols":0,"rows_kept":0,"hidden":true}

{"sheet":"Sheet5","index":10,"n_rows":0,"n_cols":0,"rows_kept":0,"hidden":true}