{"text_format":"3","workbook":"xlsx","n_sheets":11,"sheets":["Main","Future Intra","Cash Intra","MidCap Intra","Bulk Deals","Call Tracker (Equity & F&O)","Sheet2","Sheet1","Sheet3","Sheet4","Sheet5"],"not_rendered":{"images":4,"defined_names":5},"read":"whole","date_system":"1900"}

{"sheet":"Main","index":0,"n_rows":27,"n_cols":11,"rows_kept":27}
[null,"                                                                                                 "]
{"$rows_empty":8}
[null,"2019-11-15"]
[]
[null,"Sheet No.","Template Name","Summary"]
[null,1,"Future Intra","For Intraday trading in F&O segment"]
[null,2,"Cash Intra","For Intraday trading in cash market segment"]
[null,3,"Mid-cap Intra","For Intraday trading in Mid-cap stocks"]
[null,4,"Bulk Deals","Reveals Bulk Deals carried on NSE & BSE"]
[null,5,"Call Tracker"]
{"$rows_empty":9}
[{"$nulls":10},"`"]

{"sheet":"Future Intra","index":1,"n_rows":193,"n_cols":15,"rows_kept":193,"merged":[[8,0,9,0],[8,1,9,1],[8,2,9,2],[8,5,8,7],[8,8,8,10]]}
[]
[]
[]
[]
[{"$nulls":12},"Back to Main Page"]
["FOR INTRA DAY TRADING",{"$nulls":10},{"$f":"Main!B10","v":"2019-11-15"}]
[]
[]
["Sr.no","Sector","Scrip","CLOSE RATE","Pivot Point","Supports",null,null,"Resistances"]
[null,"Sector",null,"Point","Point","S1","S2","S3","R1","R2","R3","HIGH","LOW","OI","% Change in OI"]
[1,"Index","BANKNIFTY",30770.55,{"v":30653.966666666664,"d":"30653.97"},{"v":30477.933333333327,"d":"30477.93"},{"v":30185.316666666662,"d":"30185.32"},{"v":30009.283333333326,"d":"30009.28"},{"v":30946.58333333333,"d":"30946.58"},{"v":31122.61666666666,"d":"31122.62"},{"v":31415.23333333333,"d":"31415.23"},30830,30361.35,1803600,{"v":0.01668545659526494,"d":"1.67%"}]
[2,"Index","NIFTY",11899.65,{"v":11883.166666666666,"d":"11883.17"},{"v":11841.933333333332,"d":"11841.93"},{"v":11784.216666666667,"d":"11784.22"},{"v":11742.983333333334,"d":"11742.98"},{"v":11940.883333333331,"d":"11940.88"},{"v":11982.116666666665,"d":"11982.12"},{"v":12039.83333333333,"d":"12039.83"},11924.4,11825.45,16197825,{"v":-0.01036506852767455,"d":"-1.04%"}]
[3,"Index","NIFTYIT",{"v":15457,"d":"15457.00"},{"v":15409.666666666666,"d":"15409.67"},{"v":15348.333333333332,"d":"15348.33"},{"v":15239.666666666666,"d":"15239.67"},{"v":15178.333333333332,"d":"15178.33"},{"v":15518.333333333332,"d":"15518.33"},{"v":15579.666666666664,"d":"15579.67"},{"v":15688.333333333332,"d":"15688.33"},15471,15301,8800,{"v":-0.1497584541062802,"d":"-14.98%"}]
[4,"Cement","ACC",{"v":1492.2,"d":"1492.20"},1492.25,1474.95,{"v":1457.7,"d":"1457.70"},{"v":1440.4,"d":"1440.40"},{"v":1509.5,"d":"1509.50"},{"v":1526.8000000000002,"d":"1526.80"},1544.05,1509.55,1475,2784000,{"v":-0.007274283269148481,"d":"-0.73%"}]
[5,"Others","ADANIENT",{"v":202.8,"d":"202.80"},{"v":200.4,"d":"200.40"},{"v":197,"d":"197.00"},{"v":191.2,"d":"191.20"},{"v":187.79999999999998,"d":"187.80"},{"v":206.20000000000002,"d":"206.20"},{"v":209.60000000000005,"d":"209.60"},{"v":215.40000000000003,"d":"215.40"},203.8,194.6,30916000,{"v":3.3753083214332078E-3,"d":"0.34%"}]
[6,"Others","ADANIPORTS",{"v":370.4,"d":"370.40"},{"v":370.6666666666667,"d":"370.67"},{"v":366.9333333333334,"d":"366.93"},{"v":363.4666666666667,"d":"363.47"},{"v":359.7333333333334,"d":"359.73"},{"v":374.1333333333334,"d":"374.13"},{"v":377.8666666666666,"d":"377.87"},{"v":381.33333333333337,"d":"381.33"},374.4,367.2,18130000,{"v":0.019541684240123716,"d":"1.95%"}]
[7,"Power","ADANIPOWER",61.85,{"v":61.73333333333333,"d":"61.73"},{"v":60.11666666666665,"d":"60.12"},{"v":58.383333333333326,"d":"58.38"},{"v":56.76666666666665,"d":"56.77"},{"v":63.466666666666654,"d":"63.47"},{"v":65.08333333333333,"d":"65.08"},{"v":66.81666666666666,"d":"66.82"},63.35,60,79860000,{"v":0.034724021767297227,"d":"3.47%"}]
[8,"Automobile","AMARAJABAT",742.95,{"v":735.9666666666666,"d":"735.97"},{"v":727.0333333333332,"d":"727.03"},{"v":711.1166666666666,"d":"711.12"},{"v":702.1833333333332,"d":"702.18"},{"v":751.8833333333332,"d":"751.88"},{"v":760.8166666666666,"d":"760.82"},{"v":776.7333333333332,"d":"776.73"},744.9,720.05,1649400,{"v":-0.01257183908045977,"d":"-1.26%"}]
[9,"Cement","AMBUJACEM",{"v":200.5,"d":"200.50"},{"v":198.1833333333333,"d":"198.18"},{"v":195.61666666666662,"d":"195.62"},{"v":190.73333333333332,"d":"190.73"},{"v":188.16666666666663,"d":"188.17"},{"v":203.0666666666666,"d":"203.07"},{"v":205.63333333333327,"d":"205.63"},{"v":210.5166666666666,"d":"210.52"},200.75,193.3,18940000,{"v":-0.00564378527365796,"d":"-0.56%"}]
[10,"Others","APOLLOHOSP",{"v":1426.8,"d":"1426.80"},{"v":1420.8166666666668,"d":"1420.82"},{"v":1394.8833333333337,"d":"1394.88"},{"v":1362.966666666667,"d":"1362.97"},{"v":1337.0333333333338,"d":"1337.03"},{"v":1452.7333333333336,"d":"1452.73"},{"v":1478.6666666666665,"d":"1478.67"},{"v":1510.5833333333335,"d":"1510.58"},1446.75,1388.9,1970000,{"v":0.11773049645390071,"d":"11.77%"}]
{"$rows_left_out":159}
{"sheet":"Cash Intra","index":2,"n_rows":247,"n_cols":13,"rows_kept":247,"merged":[[7,0,8,0],[7,1,8,1],[7,2,8,2],[7,3,8,3],[7,4,7,6],[7,7,7,9]]}
[]
[]
[]
[]
[{"$nulls":12},"Back to Main Page"]
["FOR INTRA DAY TRADING",{"$nulls":9},{"$f":"Main!B10","v":"2019-11-15"}]
[]
["Sr.no","Scrip","CLOSE RATE","Pivot Point","Supports",null,null,"Resistances"]
[null,null,"Point",null,"S1","S2","S3","R1","R2","R3","HIGH","LOW","Total Trade Quanity in Lakhs"]
[1,"Nifty 50",11872.1,{"v":11856.800000000001,"d":"11856.80"},{"v":11817.950000000003,"d":"11817.95"},{"v":11763.800000000001,"d":"11763.80"},{"v":11724.950000000003,"d":"11724.95"},{"v":11910.950000000003,"d":"11910.95"},{"v":11949.800000000001,"d":"11949.80"},{"v":12003.950000000003,"d":"12003.95"},11895.65,11802.65]
[2,"Nifty Bank",30749.95,{"v":30625.833333333332,"d":"30625.83"},{"v":30462.466666666664,"d":"30462.47"},{"v":30174.98333333333,"d":"30174.98"},{"v":30011.61666666666,"d":"30011.62"},{"v":30913.316666666666,"d":"30913.32"},{"v":31076.683333333334,"d":"31076.68"},{"v":31364.166666666668,"d":"31364.17"},30789.2,30338.35]
[3,"Nifty CPSE",1978.6,{"v":1975.2833333333335,"d":"1975.28"},{"v":1960.916666666667,"d":"1960.92"},{"v":1943.2333333333333,"d":"1943.23"},{"v":1928.8666666666668,"d":"1928.87"},{"v":1992.9666666666672,"d":"1992.97"},{"v":2007.3333333333335,"d":"2007.33"},{"v":2025.0166666666673,"d":"2025.02"},1989.65,1957.6]
[4,"Nifty Infra",3219.1,{"v":3220.7000000000003,"d":"3220.70"},{"v":3203.4000000000005,"d":"3203.40"},{"v":3187.7000000000003,"d":"3187.70"},{"v":3170.4000000000005,"d":"3170.40"},{"v":3236.4000000000005,"d":"3236.40"},{"v":3253.7000000000007,"d":"3253.70"},{"v":3269.4000000000005,"d":"3269.40"},3238,3205]
[5,"Nifty IT",15388.75,{"v":15338.783333333333,"d":"15338.78"},{"v":15267.266666666666,"d":"15267.27"},{"v":15145.783333333333,"d":"15145.78"},{"v":15074.266666666666,"d":"15074.27"},{"v":15460.266666666666,"d":"15460.27"},{"v":15531.783333333333,"d":"15531.78"},{"v":15653.266666666666,"d":"15653.27"},15410.3,15217.3]
[6,"Nifty PSE",3275.8,{"v":3275.566666666667,"d":"3275.57"},{"v":3254.633333333334,"d":"3254.63"},{"v":3233.466666666667,"d":"3233.47"},{"v":3212.533333333334,"d":"3212.53"},{"v":3296.733333333334,"d":"3296.73"},{"v":3317.6666666666674,"d":"3317.67"},{"v":3338.833333333334,"d":"3338.83"},3296.5,3254.4]
[7,"Nifty Midcap 50",4572.25,{"v":4562.133333333333,"d":"4562.13"},{"v":4537.216666666666,"d":"4537.22"},{"v":4502.183333333333,"d":"4502.18"},{"v":4477.266666666666,"d":"4477.27"},{"v":4597.166666666666,"d":"4597.17"},{"v":4622.083333333334,"d":"4622.08"},{"v":4657.116666666666,"d":"4657.12"},4587.05,4527.1]
[8,"ACC",1486.9,{"v":1489.6833333333334,"d":"1489.68"},{"v":1470.7666666666669,"d":"1470.77"},{"v":1454.6333333333334,"d":"1454.63"},{"v":1435.716666666667,"d":"1435.72"},{"v":1505.8166666666668,"d":"1505.82"},{"v":1524.7333333333333,"d":"1524.73"},{"v":1540.8666666666668,"d":"1540.87"},1508.6,1473.55,7.37571]
[9,"AUBANK",836.05,{"v":820.4166666666666,"d":"820.42"},{"v":792.1333333333332,"d":"792.13"},{"v":748.2166666666666,"d":"748.22"},{"v":719.9333333333332,"d":"719.93"},{"v":864.3333333333333,"d":"864.33"},{"v":892.6166666666668,"d":"892.62"},{"v":936.5333333333333,"d":"936.53"},848.7,776.5,26.97966]
[10,"ADANIPORTS",369.1,{"v":369.6833333333334,"d":"369.68"},{"v":365.26666666666677,"d":"365.27"},{"v":361.4333333333334,"d":"361.43"},{"v":357.01666666666677,"d":"357.02"},{"v":373.51666666666677,"d":"373.52"},{"v":377.9333333333334,"d":"377.93"},{"v":381.76666666666677,"d":"381.77"},374.1,365.85,26.62084]
[11,"ADANIPOWER",61.8,{"v":61.633333333333326,"d":"61.63"},{"v":59.966666666666654,"d":"59.97"},{"v":58.133333333333326,"d":"58.13"},{"v":56.466666666666654,"d":"56.47"},{"v":63.466666666666654,"d":"63.47"},{"v":65.13333333333333,"d":"65.13"},{"v":66.96666666666665,"d":"66.97"},63.3,59.8,225.41888]
{"$rows_left_out":228}
{"sheet":"MidCap Intra","index":3,"n_rows":545,"n_cols":13,"rows_kept":545,"merged":[[0,0,0,1],[8,0,9,0],[8,1,9,1],[8,2,9,2],[8,3,9,3],[8,4,8,6],[8,7,8,9]]}
[]
[]
[]
[]
[{"$nulls":11},"Back To Main Page"]
["FOR INTRA DAY TRADING",{"$nulls":9},{"$f":"Main!B10","v":"2019-11-15"}]
[null,null," "]
[]
["Sr.no","Scrip","CLOSE RATE","Pivot Point","Supports",null,null,"Resistances"]
[null,null,"Point",null,"S1","S2","S3","R1","R2","R3","HIGH","LOW","Total Trade Quanity in Lakhs"]
[1,"3MINDIA",22269.55,{"v":22297.850000000002,"d":"22297.85"},{"v":22131.700000000004,"d":"22131.70"},{"v":21993.850000000002,"d":"21993.85"},{"v":21827.700000000004,"d":"21827.70"},{"v":22435.700000000004,"d":"22435.70"},{"v":22601.850000000006,"d":"22601.85"},{"v":22739.700000000004,"d":"22739.70"},22464,22160,0.0146]
[2,"ACC",1486.9,{"v":1489.6833333333334,"d":"1489.68"},{"v":1470.7666666666669,"d":"1470.77"},{"v":1454.6333333333334,"d":"1454.63"},{"v":1435.716666666667,"d":"1435.72"},{"v":1505.8166666666668,"d":"1505.82"},{"v":1524.7333333333333,"d":"1524.73"},{"v":1540.8666666666668,"d":"1540.87"},1508.6,1473.55,7.37571]
[3,"AIAENG",1641.8,{"v":1659.9833333333333,"d":"1659.98"},{"v":1621.7666666666667,"d":"1621.77"},{"v":1601.7333333333333,"d":"1601.73"},{"v":1563.5166666666667,"d":"1563.52"},{"v":1680.0166666666667,"d":"1680.02"},{"v":1718.2333333333333,"d":"1718.23"},{"v":1738.2666666666667,"d":"1738.27"},1698.2,1639.95,0.84255]
[4,"APLAPOLLO",1493.1,{"v":1497.7,"d":"1497.70"},{"v":1465.4,"d":"1465.40"},{"v":1437.7,"d":"1437.70"},{"v":1405.4,"d":"1405.40"},{"v":1525.4,"d":"1525.40"},{"v":1557.6999999999998,"d":"1557.70"},{"v":1585.4,"d":"1585.40"},1530,1470,0.26115]
[5,"AUBANK",836.05,{"v":820.4166666666666,"d":"820.42"},{"v":792.1333333333332,"d":"792.13"},{"v":748.2166666666666,"d":"748.22"},{"v":719.9333333333332,"d":"719.93"},{"v":864.3333333333333,"d":"864.33"},{"v":892.6166666666668,"d":"892.62"},{"v":936.5333333333333,"d":"936.53"},848.7,776.5,26.97966]
[6,"AAVAS",1596.15,{"v":1574.3833333333332,"d":"1574.38"},{"v":1533.7666666666664,"d":"1533.77"},{"v":1471.3833333333332,"d":"1471.38"},{"v":1430.7666666666664,"d":"1430.77"},{"v":1636.7666666666664,"d":"1636.77"},{"v":1677.3833333333332,"d":"1677.38"},{"v":1739.7666666666664,"d":"1739.77"},1615,1512,0.54799]
[7,"ABBOTINDIA",12043.25,{"v":12078.449999999999,"d":"12078.45"},{"v":11863.799999999997,"d":"11863.80"},{"v":11684.349999999999,"d":"11684.35"},{"v":11469.699999999997,"d":"11469.70"},{"v":12257.899999999998,"d":"12257.90"},12472.55,{"v":12651.999999999998,"d":"12652.00"},12293.1,11899,0.32851]
[8,"ADANIGAS",147.4,{"v":147.8166666666667,"d":"147.82"},{"v":146.73333333333338,"d":"146.73"},{"v":146.0666666666667,"d":"146.07"},{"v":144.98333333333338,"d":"144.98"},{"v":148.48333333333338,"d":"148.48"},{"v":149.5666666666667,"d":"149.57"},{"v":150.23333333333338,"d":"150.23"},148.9,147.15,5.4643]
[9,"ADANIGREEN",95.05,{"v":95.68333333333334,"d":"95.68"},{"v":92.86666666666667,"d":"92.87"},{"v":90.68333333333334,"d":"90.68"},{"v":87.86666666666667,"d":"87.87"},{"v":97.86666666666667,"d":"97.87"},{"v":100.68333333333334,"d":"100.68"},{"v":102.86666666666667,"d":"102.87"},98.5,93.5,16.11104]
[10,"ADANIPORTS",369.1,{"v":369.6833333333334,"d":"369.68"},{"v":365.26666666666677,"d":"365.27"},{"v":361.4333333333334,"d":"361.43"},{"v":357.01666666666677,"d":"357.02"},{"v":373.51666666666677,"d":"373.52"},{"v":377.9333333333334,"d":"377.93"},{"v":381.76666666666677,"d":"381.77"},374.1,365.85,26.62084]
{"$rows_left_out":513}
{"sheet":"Bulk Deals","index":4,"n_rows":79,"n_cols":8,"rows_kept":79,"merged":[[4,0,4,1],[4,2,4,3],[6,1,6,2]]}
[" "]
[]
[]
[]
[]
[{"$nulls":4},"Back To Main Page"]
["Subject :","BULK DEAL",null,{"$f":"Main!B10","v":"2019-11-15"}]
[]
["Date","Scrip code","Scrip Name","Client Name","Buy / Sell","Quantity Traded","Trade Price / Wt.Avg.trade price","Exchange  "]
["2019-11-14",532172,"ADROITINFO","SUDHAKIRAN REDDY SUNKERNENI","BUY",{"v":160000,"d":"160,000"},8.19,"BSE"]
["2019-11-14",532172,"ADROITINFO","JOKEMAN MEDIA AND ENTERTAINMENT PRIVATE LIMITED","SELL",{"v":160000,"d":"160,000"},8.19,"BSE"]
["2019-11-14",539872,"BAJAJHCARE","SHASHANK PRAVINCHANDRA DOSHI","BUY",{"v":97200,"d":"97,200"},172,"BSE"]
["2019-11-14",539660,"BESTAGRO","RESONANCE OPPORTUNITIES FUND","BUY",{"v":50000,"d":"50,000"},264.19,"BSE"]
["2019-11-14",532413,"CEREBRAINT","NOMURA SINGAPORE LIMITED","BUY",{"v":1699000,"d":"1,699,000"},18.5,"BSE"]
["2019-11-14",507515,"CJGEL","JASPAL RAGHUBIR SINGH","BUY",{"v":40000,"d":"40,000"},8.21,"BSE"]
["2019-11-14",507515,"CJGEL","USHA PANDE","SELL",{"v":41374,"d":"41,374"},8.22,"BSE"]
["2019-11-14",533144,"COX&KINGS","ALPHA LEON ENTERPRISES LLP","BUY",{"v":1439006,"d":"1,439,006"},{"v":1.5,"d":"1.50"},"BSE"]
["2019-11-14",533144,"COX&KINGS","ALPHA LEON ENTERPRISES LLP","SELL",{"v":925546,"d":"925,546"},1.52,"BSE"]
["2019-11-14",539527,"CREATIVE","KHANDWALA SECURITIES LIMITED","BUY",{"v":7850,"d":"7,850"},{"v":365,"d":"365.00"},"BSE"]
["2019-11-14",539527,"CREATIVE","KHANDWALA COMMODITY AND DERIVATIVES PVT. LTD. .","SELL",{"v":7850,"d":"7,850"},365,"BSE"]
{"$rows_left_out":60}
{"sheet":"Call Tracker (Equity & F&O)","index":5,"n_rows":316,"n_cols":18,"rows_kept":316,"merged":[[91,0,92,0],[91,1,92,1],[91,9,92,9],[91,11,92,11],[91,12,92,12],[91,13,92,13],[91,14,92,14],[93,0,94,0],[93,1,94,1],[93,9,94,9],[93,11,94,11],[93,12,94,12],[93,13,94,13],[93,14,94,14],[95,0,96,0],[95,1,96,1],[95,9,96,9],[95,11,96,11],[95,12,96,12],[95,13,96,13],[95,14,96,14],[97,0,98,0],[97,1,98,1],[97,9,98,9],[97,11,98,11],[97,12,98,12],[97,13,98,13],[97,14,98,14],[99,0,100,0],[99,1,100,1],[99,9,100,9],[99,11,100,11],[99,12,100,12],[99,13,100,13],[99,14,100,14],[101,0,102,0],[101,1,102,1],[101,9,102,9],[101,11,102,11],[101,12,102,12],[101,13,102,13],[101,14,102,14],[103,0,104,0],[103,1,104,1],[103,9,104,9],[103,11,104,11],[103,12,104,12],[103,13,104,13],[103,14,104,14],[105,0,106,0],[105,1,106,1],[105,9,106,9],[105,11,106,11],[105,12,106,12],[105,13,106,13],[105,14,106,14],[107,0,108,0],[107,1,108,1],[107,9,108,9],[107,11,108,11],[107,12,108,12],[107,13,108,13],[107,14,108,14],[109,0,110,0],[109,1,110,1],[109,9,110,9],[109,11,110,11],[109,12,110,12],[109,13,110,13],[109,14,110,14],[111,0,112,0],[111,1,112,1],[111,9,112,9],[111,11,112,11],[111,12,112,12],[111,13,112,13],[111,14,112,14],[113,0,114,0],[113,1,114,1],[113,9,114,9],[113,11,114,11],[113,12,114,12],[113,13,114,13],[113,14,114,14],[115,0,116,0],[115,1,116,1],[115,9,116,9],[115,11,116,11],[115,12,116,12],[115,13,116,13],[115,14,116,14],[117,0,118,0],[117,1,118,1],[117,9,118,9],[117,11,118,11],[117,12,118,12],[117,13,118,13],[117,14,118,14],[119,0,120,0],[119,1,120,1],[119,9,120,9],[119,11,120,11],[119,12,120,12],[119,13,120,13],[119,14,120,14],[131,0,132,0],[131,1,132,1],[131,9,132,9],[131,11,132,11],[131,12,132,12],[131,13,132,13],[131,14,132,14],[133,0,134,0],[133,1,134,1],[133,9,134,9],[133,11,134,11],[133,12,134,12],[133,13,134,13],[133,14,134,14],[136,0,137,0],[136,1,137,1],[136,9,137,9],[136,11,137,11],[136,12,137,12],[136,13,137,13],[136,14,137,14],[138,0,139,0],[138,1,139,1],[138,9,139,9],[138,11,139,11],[138,12,139,12],[138,13,139,13],[138,14,139,14],[140,0,141,0],[140,1,141,1],[140,9,141,9],[140,11,141,11],[140,12,141,12],[140,13,141,13],[140,14,141,14],[142,0,143,0],[142,1,143,1],[142,9,143,9],[142,11,143,11],[142,12,143,12],[142,13,143,13],[142,14,143,14],[144,0,145,0],[144,1,145,1],[144,9,145,9],[144,11,145,11],[144,12,145,12],[144,13,145,13],[144,14,145,14]]}
[]
[]
[]
[]
[{"$nulls":12},"Back To Main Page"]
["Retail Research Technical Calls & Fundamental Performance Report for the month of November-2019 "]
[{"$nulls":12},{"$f":"Main!B10","v":"2019-11-15"}]
[null,"Positional  Call"]
["Sr.no","Date",null,"Company","Rec","Rec Price","Stop Loss***","Call Closed At","Target","Remark","Profit / Loss per Share","Gain / Loss  %","Status","Closed Date","NSE Closed Price"]
[1,"2019-09-26",null,"HDFC","Buy",2070,1940,2165,"2250-2300","Profit of Rs.95/-",{"$f":"H10-F10","v":95},{"$f":"K10/F10","v":{"v":0.04589371980676329,"d":"4.59%"}},"Successful","2019-11-01",{"$nulls":3},"H"]
[2,"2019-10-01",null,"UPL","Buy{}",595,564,599.5,"650-660","Profit of Rs.4.50/-",4.5,{"v":0.007563025210084034,"d":"0.76%"},"Neutral","2019-11-07",{"$nulls":3},"R"]
[3,"2019-10-07",null,"PIDILITIND","Buy{}",1367.5,1297,1413.5,"1500-1520","Part Profit of Rs.46/-",{"$f":"H12-F12","v":46},{"$f":"K12/F12","v":{"v":0.03363802559414991,"d":"3.36%"}},"Successful","2019-10-31",{"$f":"VLOOKUP(D12,Sheet2!A51:M1690,6,0)","v":1344.4},null,null,"R"]
[4,"2019-10-22",null,"HEIDELBERG","Buy",188.5,178,199,"205-210","Profit of Rs.10.50/-",10.5,{"v":0.05570291777188329,"d":"5.57%"},"Successful","2019-11-05",{"$nulls":3},"H"]
[5,"2019-10-27",null,"AMBUJACEM","Buy{}",197,185.4,203.5,"216-220","Part Profit of Rs.6.5/-",{"$f":"H14-F14","v":6.5},{"$f":"K14/F14","v":{"v":0.03299492385786802,"d":"3.30%"}},"Successful","2019-10-30",{"$f":"VLOOKUP(D14,Sheet2!A60:M1699,6,0)","v":200.55},null,null,"R"]
[6,"2019-11-04",null,"UBL","Buy{}",1240,1178,1292.5,"1340-1360","Profit of Rs.52.5/-",{"$f":"H15-F15","v":52.5},{"$f":"K15/F15","v":{"v":0.04233870967741935,"d":"4.23%"}},"Successful","2019-11-08",{"$nulls":3},"H"]
[7,"2019-11-05",null,"TATAMOTORS","Sell",173,183.3,166.5,"158-155","Part Profit of Rs.6.5/-",{"$f":"F16-H16","v":6.5},{"v":0.03757225433526012,"d":"3.76%"},"Successful","2019-11-14",{"$f":"VLOOKUP(D16,Sheet2!A62:M1701,6,0)","v":167.05},null,null,"R"]
[8,"2019-11-06",null,"BANDHANBNK","Buy",572.5,538,547,"630-650","Loss of Rs.25.5/-",-25.5,{"$f":"K17/F17","v":{"v":-0.0445414847161572,"d":"-4.45%"}},"Unsuccessful","2019-11-11",{"$nulls":3},"H"]
[9,"2019-11-07",null,"PRESTIGE","Buy","310-314",288,null,"340-360","Open",{"$nulls":4},{"$f":"VLOOKUP(D18,Sheet2!A64:M1703,6,0)","v":300.4},null,null,"H"]
[10,"2019-11-07",null,"JINDALSTEL","Sell",138,148.3,143,"120-117","Loss of Rs.5/-",{"$f":"F19-H19","v":-5},{"$f":"K19/F19","v":{"v":-0.036231884057971016,"d":"-3.62%"}},"Unsuccessful","2019-11-07",{"$nulls":3},"R"]
[11,"2019-11-08",null,"CIPLA","Sell",465,491.3,450,"425-418","Part Profit of Rs.15/-",{"$f":"F20-H20","v":15},{"v":0.03225806451612903,"d":"3.23%"},"Successful","2019-11-13",{"$f":"VLOOKUP(D20,Sheet2!A66:M1705,6,0)","v":451.4},null,null,"R"]
{"$rows_left_out":290}
{"sheet":"Sheet2","index":6,"n_rows":1899,"n_cols":14,"rows_kept":1899,"hidden":true}
["SYMBOL","SERIES","OPEN","HIGH","LOW","CLOSE","LAST","PREVCLOSE","TOTTRDQTY","TOTTRDVAL","TIMESTAMP","TOTALTRADES","ISIN","ISIN"]
["20MICRONS","EQ",36.6,36.85,35.8,35.9,36,36.4,24275,876390.65,"2019-11-14",566,"INE144J01027"]
["21STCENMGM","EQ",13.7,13.95,13.7,13.95,13.95,13.95,1007,14022.15,"2019-11-14",11,"INE253B01015"]
["3IINFOTECH","EQ",1.95,1.95,1.9,1.9,1.95,1.9,629699,1203037.85,"2019-11-14",434,"INE748C01020"]
["3MINDIA","EQ",22160,22464,22160,22269.55,22165.05,22258.2,1460,32597748.4,"2019-11-14",619,"INE470A01017"]
["3PLAND","EQ",6.25,6.45,6.25,6.45,6.45,6.55,55,346.75,"2019-11-14",2,"INE105C01023"]
["5PAISA","EQ",156.35,157.15,149,155.3,156.8,156.35,6849,1068625.6,"2019-11-14",198,"INE618L01018"]
["63MOONS","EQ",114.05,117,113.1,113.7,113.85,114.05,122789,14074512.4,"2019-11-14",1787,"INE111B01023"]
["A2ZINFRA","EQ",10.15,10.15,9.8,9.8,9.85,9.95,246671,2440653.85,"2019-11-14",321,"INE619I01012"]
["AARTIDRUGS","EQ",522,533,519.5,527.75,530,528.2,9945,5230947.9,"2019-11-14",1056,"INE767A01016"]
["AARTIIND","EQ",807.3,809.95,791.1,799,799,814.45,139999,112515309.65,"2019-11-14",4778,"INE769A01020"]
["AARVEEDEN","EQ",13.7,13.8,12.6,13.05,13.15,14.2,15192,199973.35,"2019-11-14",182,"INE273D01019"]
["AAVAS","EQ",1528,1615,1512,1596.15,1615,1528.45,54799,86188687.8,"2019-11-14",3924,"INE216P01012"]
["ABAN","BE",28.5,28.9,27.6,28.1,28.4,28.85,35642,997509.6,"2019-11-14",218,"INE421A01028"]
["ABB","EQ",1495,1495,1465,1468.9,1465,1497.65,197909,292350216.2,"2019-11-14",5384,"INE117A01022"]
["ABBOTINDIA","EQ",11899,12293.1,11899,12043.25,12035,11794.6,32851,396348949.35,"2019-11-14",5711,"INE358A01014"]
["ABCAPITAL","EQ",83,83.85,79,80.25,80.15,83.4,2579465,208378458.1,"2019-11-14",16745,"INE674K01013"]
["ABFRL","EQ",211,211.9,204.75,208,210,210.4,702009,145082585.45,"2019-11-14",7263,"INE647O01011"]
["ABSLBANETF","EQ",324.9,324.9,324.9,324.9,324.9,309,5,1624.5,"2019-11-14",1,"INF209KB1O58"]
["ABSLNN50ET","EQ",286.7,286.7,283.95,283.95,283.95,287.96,138,39223.2,"2019-11-14",6,"INF209KB1B87"]
{"$rows_left_out":1701}
{"sheet":"Sheet1","index":7,"n_rows":0,"n_cols":0,"rows_kept":0,"hidden":true}

{"sheet":"Sheet3","index":8,"n_rows":0,"n_cols":0,"rows_kept":0,"hidden":true}

{"sheet":"Sheet4","index":9,"n_rows":0,"n_cols":0,"rows_kept":0,"hidden":true}

{"sheet":"Sheet5","index":10,"n_rows":0,"n_cols":0,"rows_kept":0,"hidden":true}