{"text_format":"3","workbook":"xlsx","n_sheets":8,"sheets":["Main","Future Intra","Cash Intra","MidCap Intra","Bulk Deals","Call Tracker (Equity & F&O)","Call Tracker (Currency)","Sheet2"],"not_rendered":{"images":4,"defined_names":4},"read":"whole","date_system":"1900"}

{"sheet":"Main","index":0,"n_rows":17,"n_cols":4,"rows_kept":17}
[null,"                                                                                                 "]
{"$rows_empty":8}
[null,"2018-04-19"]
[]
[null,"Sheet No.","Template Name","Summary"]
[null,1,"Future Intra","For Intraday trading in F&O segment"]
[null,2,"Cash Intra","For Intraday trading in cash market segment"]
[null,3,"Mid-cap Intra","For Intraday trading in Mid-cap stocks"]
[null,4,"Bulk Deals","Reveals Bulk Deals carried on NSE & BSE"]
[null,5,"Call Tracker"]

{"sheet":"Future Intra","index":1,"n_rows":251,"n_cols":15,"rows_kept":251,"merged":[[8,0,9,0],[8,1,9,1],[8,2,9,2],[8,5,8,7],[8,8,8,10]]}
[]
[]
[]
[]
[{"$nulls":12},"Back to Main Page"]
["FOR INTRA DAY TRADING",{"$nulls":10},{"$f":"Main!B10","v":"2018-04-19"}]
[]
[]
["Sr.no","Sector","Scrip","CLOSE RATE","Pivot Point","Supports",null,null,"Resistances"]
[null,"Sector",null,"Point","Point","S1","S2","S3","R1","R2","R3","HIGH","LOW","OI","% Change in OI"]
[1,"Index","BANKNIFTY",25124.85,{"v":25217.783333333336,"d":"25217.78"},{"v":24987.066666666673,"d":"24987.07"},{"v":24849.283333333336,"d":"24849.28"},{"v":24618.566666666673,"d":"24618.57"},{"v":25355.566666666673,"d":"25355.57"},{"v":25586.28333333334,"d":"25586.28"},{"v":25724.066666666673,"d":"25724.07"},25448.5,25080,1950240,{"v":-0.03805859721811187,"d":"-3.81%"}]
[2,"Index","NIFTY",10538.85,{"v":10551.866666666667,"d":"10551.87"},{"v":10507.183333333334,"d":"10507.18"},{"v":10475.516666666668,"d":"10475.52"},{"v":10430.833333333336,"d":"10430.83"},{"v":10583.533333333333,"d":"10583.53"},{"v":10628.216666666664,"d":"10628.22"},{"v":10659.883333333331,"d":"10659.88"},10596.55,10520.2,28701075,{"v":0.020033851771887035,"d":"2.00%"}]
[3,"Index","NIFTYCPSE",2827.05,942.35,{"v":1884.7,"d":"1884.70"},942.35,{"v":1884.7,"d":"1884.70"},{"v":1884.7,"d":"1884.70"},942.35,{"v":1884.7,"d":"1884.70"},0,0,0,{"v":0,"d":"0.00%"}]
[4,"Index","NIFTYINFRA",{"v":3716.6,"d":"3716.60"},{"v":1238.8666666666666,"d":"1238.87"},{"v":2477.733333333333,"d":"2477.73"},{"v":1238.8666666666666,"d":"1238.87"},{"v":2477.733333333333,"d":"2477.73"},{"v":2477.733333333333,"d":"2477.73"},{"v":1238.8666666666666,"d":"1238.87"},{"v":2477.733333333333,"d":"2477.73"},0,0,0,{"v":0,"d":"0.00%"}]
[5,"Index","NIFTYIT",{"v":13134,"d":"13134.00"},{"v":13155.333333333334,"d":"13155.33"},{"v":13092.666666666668,"d":"13092.67"},{"v":13051.333333333334,"d":"13051.33"},{"v":12988.666666666668,"d":"12988.67"},{"v":13196.666666666668,"d":"13196.67"},{"v":13259.333333333336,"d":"13259.33"},{"v":13300.666666666668,"d":"13300.67"},13218,13114,36550,{"v":1.3698630136986301E-3,"d":"0.14%"}]
[6,"Index","NIFTYMID50",{"v":5429.9,"d":"5429.90"},{"v":1809.9666666666665,"d":"1809.97"},{"v":3619.933333333333,"d":"3619.93"},{"v":1809.9666666666665,"d":"1809.97"},{"v":3619.933333333333,"d":"3619.93"},{"v":3619.933333333333,"d":"3619.93"},{"v":1809.9666666666665,"d":"1809.97"},{"v":3619.933333333333,"d":"3619.93"},0,0,591600,{"v":0,"d":"0.00%"}]
[7,"Index","NIFTYPSE",{"v":4380.6,"d":"4380.60"},{"v":1460.2,"d":"1460.20"},{"v":2920.4,"d":"2920.40"},{"v":1460.2,"d":"1460.20"},{"v":2920.4,"d":"2920.40"},{"v":2920.4,"d":"2920.40"},{"v":1460.2,"d":"1460.20"},{"v":2920.4,"d":"2920.40"},0,0,0,{"v":0,"d":"0.00%"}]
[8,"Cement","ACC",1569.45,{"v":1577,"d":"1577.00"},{"v":1555.2,"d":"1555.20"},1540.95,1519.15,1591.25,{"v":1613.0500000000002,"d":"1613.05"},{"v":1627.3,"d":"1627.30"},1598.8,1562.75,1550800,{"v":-0.041058619836754885,"d":"-4.11%"}]
[9,"Others","ADANIENT",137.25,138.25,{"v":135.1,"d":"135.10"},132.95,{"v":129.79999999999998,"d":"129.80"},{"v":140.4,"d":"140.40"},{"v":143.54999999999998,"d":"143.55"},{"v":145.70000000000002,"d":"145.70"},141.4,136.1,15628000,{"v":0.04437316225608126,"d":"4.44%"}]
[10,"Others","ADANIPORTS",{"v":386.3,"d":"386.30"},{"v":385.2,"d":"385.20"},382.25,{"v":378.2,"d":"378.20"},375.25,389.25,{"v":392.19999999999993,"d":"392.20"},396.25,388.15,381.15,14430000,{"v":0.01263157894736842,"d":"1.26%"}]
{"$rows_left_out":225}
{"sheet":"Cash Intra","index":2,"n_rows":251,"n_cols":13,"rows_kept":251,"merged":[[7,0,8,0],[7,1,8,1],[7,2,8,2],[7,3,8,3],[7,4,7,6],[7,7,7,9]]}
[]
[]
[]
[]
[{"$nulls":12},"Back to Main Page"]
["FOR INTRA DAY TRADING",{"$nulls":9},{"$f":"Main!B10","v":"2018-04-19"}]
[]
["Sr.no","Scrip","CLOSE RATE","Pivot Point","Supports",null,null,"Resistances"]
[null,null,"Point",null,"S1","S2","S3","R1","R2","R3","HIGH","LOW","Total Trade Quanity in Lakhs"]
[1,"Nifty 50",10526.2,{"v":10543.366666666667,"d":"10543.37"},{"v":10492.533333333333,"d":"10492.53"},{"v":10458.866666666667,"d":"10458.87"},{"v":10408.033333333333,"d":"10408.03"},{"v":10577.033333333333,"d":"10577.03"},{"v":10627.866666666665,"d":"10627.87"},{"v":10661.533333333333,"d":"10661.53"},10594.2,10509.7]
[2,"Nifty Bank",25102.3,{"v":25195.933333333334,"d":"25195.93"},{"v":24965.11666666667,"d":"24965.12"},{"v":24827.933333333334,"d":"24827.93"},{"v":24597.11666666667,"d":"24597.12"},{"v":25333.11666666667,"d":"25333.12"},{"v":25563.933333333334,"d":"25563.93"},{"v":25701.11666666667,"d":"25701.12"},25426.75,25058.75]
[3,"Nifty CPSE",2423.8,{"v":2426.483333333333,"d":"2426.48"},{"v":2417.2666666666664,"d":"2417.27"},{"v":2410.733333333333,"d":"2410.73"},{"v":2401.5166666666664,"d":"2401.52"},{"v":2433.0166666666664,"d":"2433.02"},{"v":2442.2333333333327,"d":"2442.23"},{"v":2448.7666666666664,"d":"2448.77"},2435.7,2419.95]
[4,"Nifty Infra",3464,{"v":3465.4833333333336,"d":"3465.48"},{"v":3454.5166666666673,"d":"3454.52"},{"v":3445.0333333333338,"d":"3445.03"},{"v":3434.0666666666675,"d":"3434.07"},{"v":3474.966666666667,"d":"3474.97"},{"v":3485.9333333333334,"d":"3485.93"},{"v":3495.416666666667,"d":"3495.42"},3476.45,3456]
[5,"Nifty IT",13124,{"v":13149.583333333334,"d":"13149.58"},{"v":13080.716666666667,"d":"13080.72"},{"v":13037.433333333332,"d":"13037.43"},{"v":12968.566666666666,"d":"12968.57"},{"v":13192.866666666669,"d":"13192.87"},{"v":13261.733333333334,"d":"13261.73"},{"v":13305.01666666667,"d":"13305.02"},13218.45,13106.3]
[6,"Nifty PSE",3898.2,{"v":3901.9166666666665,"d":"3901.92"},{"v":3887.733333333333,"d":"3887.73"},{"v":3877.2666666666664,"d":"3877.27"},{"v":3863.083333333333,"d":"3863.08"},{"v":3912.383333333333,"d":"3912.38"},{"v":3926.5666666666666,"d":"3926.57"},{"v":3937.0333333333333,"d":"3937.03"},3916.1,3891.45]
[7,"Nifty Midcap 50",5361.95,{"v":5369.7,"d":"5369.70"},{"v":5338,"d":"5338.00"},5314.05,5282.35,5393.65,{"v":5425.3499999999985,"d":"5425.35"},{"v":5449.299999999999,"d":"5449.30"},5401.4,5345.75]
[8,"ABB",1255.65,{"v":1261.2,"d":"1261.20"},1248.45,1241.25,{"v":1228.5,"d":"1228.50"},{"v":1268.4,"d":"1268.40"},1281.15,{"v":1288.3500000000001,"d":"1288.35"},1273.95,1254,0.2694]
[9,"ACC",1573.5,{"v":1579.3833333333332,"d":"1579.38"},{"v":1556.0666666666664,"d":"1556.07"},{"v":1538.6333333333332,"d":"1538.63"},{"v":1515.3166666666664,"d":"1515.32"},{"v":1596.8166666666664,"d":"1596.82"},{"v":1620.133333333333,"d":"1620.13"},{"v":1637.5666666666664,"d":"1637.57"},1602.7,1561.95,4.89407]
[10,"AIAENG",1413.55,{"v":1410.8500000000001,"d":"1410.85"},{"v":1391.7000000000003,"d":"1391.70"},{"v":1369.8500000000001,"d":"1369.85"},{"v":1350.7000000000003,"d":"1350.70"},{"v":1432.7000000000003,"d":"1432.70"},{"v":1451.8500000000004,"d":"1451.85"},{"v":1473.7000000000003,"d":"1473.70"},1430,1389,0.48552]
[11,"AUBANK",657.7,{"v":659.2,"d":"659.20"},650.95,{"v":644.2,"d":"644.20"},635.95,665.95,{"v":674.2,"d":"674.20"},680.95,667.45,652.45,1.55593]
{"$rows_left_out":225}
{"sheet":"MidCap Intra","index":3,"n_rows":512,"n_cols":13,"rows_kept":512,"merged":[[0,0,0,1],[8,0,9,0],[8,1,9,1],[8,2,9,2],[8,3,9,3],[8,4,8,6],[8,7,8,9]]}
[]
[]
[]
[]
[{"$nulls":11},"Back To Main Page"]
["FOR INTRA DAY TRADING",{"$nulls":9},{"$f":"Main!B10","v":"2018-04-19"}]
[null,null," "]
[]
["Sr.no","Scrip","CLOSE RATE","Pivot Point","Supports",null,null,"Resistances"]
[null,null,"Point",null,"S1","S2","S3","R1","R2","R3","HIGH","LOW","Total Trade Quanity in Lakhs"]
[1,"3MINDIA",20629.5,{"v":20608.766666666666,"d":"20608.77"},{"v":20417.533333333333,"d":"20417.53"},{"v":20205.566666666666,"d":"20205.57"},{"v":20014.333333333332,"d":"20014.33"},{"v":20820.733333333334,"d":"20820.73"},{"v":21011.966666666664,"d":"21011.97"},{"v":21223.933333333334,"d":"21223.93"},20800,20396.8,0.00456]
[2,"8KMILES",749.25,{"v":751.1999999999999,"d":"751.20"},{"v":736.6999999999998,"d":"736.70"},{"v":724.1499999999999,"d":"724.15"},{"v":709.6499999999997,"d":"709.65"},{"v":763.7499999999999,"d":"763.75"},{"v":778.2500000000001,"d":"778.25"},{"v":790.8,"d":"790.80"},765.7,738.65,2.27247]
[3,"ABB",1255.65,{"v":1261.2,"d":"1261.20"},1248.45,1241.25,{"v":1228.5,"d":"1228.50"},{"v":1268.4,"d":"1268.40"},1281.15,{"v":1288.3500000000001,"d":"1288.35"},1273.95,1254,0.2694]
[4,"ACC",1573.5,{"v":1579.3833333333332,"d":"1579.38"},{"v":1556.0666666666664,"d":"1556.07"},{"v":1538.6333333333332,"d":"1538.63"},{"v":1515.3166666666664,"d":"1515.32"},{"v":1596.8166666666664,"d":"1596.82"},{"v":1620.133333333333,"d":"1620.13"},{"v":1637.5666666666664,"d":"1637.57"},1602.7,1561.95,4.89407]
[5,"AIAENG",1413.55,{"v":1410.8500000000001,"d":"1410.85"},{"v":1391.7000000000003,"d":"1391.70"},{"v":1369.8500000000001,"d":"1369.85"},{"v":1350.7000000000003,"d":"1350.70"},{"v":1432.7000000000003,"d":"1432.70"},{"v":1451.8500000000004,"d":"1451.85"},{"v":1473.7000000000003,"d":"1473.70"},1430,1389,0.48552]
[6,"APLAPOLLO",2131.05,{"v":2146.366666666667,"d":"2146.37"},{"v":2105.7833333333338,"d":"2105.78"},{"v":2080.516666666667,"d":"2080.52"},{"v":2039.9333333333338,"d":"2039.93"},{"v":2171.6333333333337,"d":"2171.63"},{"v":2212.2166666666667,"d":"2212.22"},{"v":2237.4833333333336,"d":"2237.48"},2186.95,2121.1,0.12345]
[7,"AUBANK",657.7,{"v":659.2,"d":"659.20"},650.95,{"v":644.2,"d":"644.20"},635.95,665.95,{"v":674.2,"d":"674.20"},680.95,667.45,652.45,1.55593]
[8,"AARTIIND",1327.7,{"v":1317.5666666666666,"d":"1317.57"},{"v":1298.1333333333332,"d":"1298.13"},{"v":1268.5666666666666,"d":"1268.57"},{"v":1249.1333333333332,"d":"1249.13"},{"v":1347.1333333333332,"d":"1347.13"},{"v":1366.5666666666666,"d":"1366.57"},{"v":1396.1333333333332,"d":"1396.13"},1337,1288,0.71564]
[9,"ABAN",172.4,173.15,170.55,{"v":168.70000000000002,"d":"168.70"},{"v":166.10000000000002,"d":"166.10"},{"v":175,"d":"175.00"},{"v":177.59999999999997,"d":"177.60"},179.45,175.75,171.3,9.24824]
[10,"ADANIENT",136.75,{"v":137.81666666666666,"d":"137.82"},{"v":134.63333333333333,"d":"134.63"},{"v":132.51666666666665,"d":"132.52"},{"v":129.33333333333331,"d":"129.33"},{"v":139.93333333333334,"d":"139.93"},{"v":143.11666666666667,"d":"143.12"},{"v":145.23333333333335,"d":"145.23"},141,135.7,32.9772]
{"$rows_left_out":493}
{"sheet":"Bulk Deals","index":4,"n_rows":78,"n_cols":8,"rows_kept":78,"merged":[[4,0,4,1],[4,2,4,3],[6,1,6,2]]}
[" "]
[]
[]
[]
[]
[{"$nulls":4},"Back To Main Page"]
["Subject :","BULK DEAL",null,{"$f":"Main!B10","v":"2018-04-19"}]
[]
["Date","Scrip code","Scrip Name","Client Name","Buy / Sell","Quantity Traded","Trade Price / Wt.Avg.trade price","Exchange  "]
["2018-04-18",537766,"BCP","SURESH PANNALAL JAIN","SELL",500,164.1,"BSE"]
["2018-04-18",537766,"BCP","SURESH PANNALAL JAIN","BUY",{"v":64900,"d":"64,900"},164.26,"BSE"]
["2018-04-18",538566,"BESTSTEEL","GURMEET SINGH","SELL",{"v":240464,"d":"240,464"},147,"BSE"]
["2018-04-18",537326,"CHEMTECH","KAMLESH BHAGWANDAS BATHIJA","SELL",{"v":110000,"d":"110,000"},15.45,"BSE"]
["2018-04-18",532183,"GAYATRI","SHOAIB S KHAN","SELL",{"v":361934,"d":"361,934"},13.55,"BSE"]
["2018-04-18",532183,"GAYATRI","SHOAIB S KHAN","BUY",{"v":360726,"d":"360,726"},13.55,"BSE"]
["2018-04-18",532183,"GAYATRI","MOHAN PROJECT CONTRACTORS P LTD","SELL",{"v":489000,"d":"489,000"},13.51,"BSE"]
["2018-04-18",532183,"GAYATRI","VISHWAMURTE TRAD INVEST PE LTD","SELL",{"v":724163,"d":"724,163"},13.72,"BSE"]
["2018-04-18",532183,"GAYATRI","VISHWAMURTE TRAD INVEST PE LTD","BUY",{"v":25000,"d":"25,000"},13.38,"BSE"]
["2018-04-18",540266,"GLCL","HIMANSHU CHANDRAKANT BHANSALI","BUY",{"v":33200,"d":"33,200"},34.2,"BSE"]
["2018-04-18",540266,"GLCL","KAMLESH MOTTYBHAI PATEL","SELL",{"v":9300,"d":"9,300"},34.2,"BSE"]
{"$rows_left_out":59}
{"sheet":"Call Tracker (Equity & F&O)","index":5,"n_rows":288,"n_cols":19,"rows_kept":288,"merged":[[8,9,8,10],[9,9,9,10],[10,9,10,10],[11,9,11,10],[12,9,12,10],[13,9,13,10],[14,9,14,10],[15,9,15,10],[16,9,16,10],[17,9,17,10],[18,9,18,10],[19,9,19,10],[20,9,20,10],[21,9,21,10],[22,9,22,10],[23,9,23,10],[24,9,24,10],[25,9,25,10],[26,9,26,10],[27,9,27,10],[28,9,28,10],[29,9,29,10],[30,9,30,10],[33,9,33,10],[34,9,34,10],[39,9,39,10],[40,9,40,10],[41,0,42,0],[41,1,42,1],[41,6,42,6],[41,8,42,8],[41,9,42,10],[41,13,42,13],[41,14,42,14],[41,15,42,15],[43,9,43,10],[44,9,44,10],[51,9,51,10],[52,0,53,0],[52,1,53,1],[52,6,53,6],[52,8,53,8],[52,9,53,10],[52,13,53,13],[52,14,53,14],[52,15,53,15],[54,9,54,10],[55,9,55,10],[56,9,56,10],[57,9,57,10],[58,9,58,10],[59,9,59,10],[60,9,60,10],[61,9,61,10],[63,9,63,10],[64,9,64,10],[65,9,65,10],[66,9,66,10],[67,9,67,10],[68,9,68,10],[69,9,69,10],[70,9,70,10],[71,9,71,10],[72,9,72,10],[73,9,73,10],[74,9,74,10],[75,9,75,10],[76,9,76,10],[77,9,77,10],[78,9,78,10],[79,9,79,10],[80,9,80,10],[81,9,81,10],[82,9,82,10],[83,9,83,10],[84,9,84,10],[85,9,85,10],[86,9,86,10],[87,9,87,10],[88,9,88,10],[89,9,89,10],[90,9,90,10],[96,9,96,10],[97,9,97,10],[98,9,98,10],[105,9,105,10],[106,9,106,10],[107,9,107,10],[108,9,108,10],[109,9,109,10],[110,9,110,10],[111,9,111,10],[112,9,112,10],[113,9,113,10],[114,9,114,10],[115,9,115,10],[116,9,116,10],[117,9,117,10],[118,9,118,10],[119,9,119,10],[120,9,120,10],[121,9,121,10],[122,9,122,10],[123,9,123,10],[124,9,124,10],[125,9,125,10],[126,9,126,10],[127,9,127,10],[128,9,128,10],[129,9,129,10],[130,9,130,10],[138,9,138,10],[139,9,139,10],[140,9,140,10],[141,9,141,10],[142,9,142,10],[143,9,143,10],[144,9,144,10],[145,9,145,10],[146,9,146,10],[147,9,147,10],[148,9,148,10],[149,9,149,10],[150,9,150,10],[151,9,151,10],[152,9,152,10],[153,9,153,10],[154,9,154,10],[157,9,157,10],[158,9,158,10],[159,9,159,10],[160,9,160,10],[161,9,161,10],[162,9,162,10],[163,9,163,10],[164,9,164,10],[165,9,165,10],[166,9,166,10],[167,9,167,10],[168,9,168,10],[169,9,169,10],[170,9,170,10],[171,9,171,10],[172,9,172,10],[173,9,173,10],[174,9,174,10],[175,9,175,10],[176,9,176,10],[177,9,177,10],[178,9,178,10],[179,9,179,10],[180,9,180,10],[181,9,181,10],[182,9,182,10],[183,9,183,10],[184,9,184,10],[185,9,185,10],[186,9,186,10],[187,9,187,10],[188,9,188,10],[189,9,189,10],[190,9,190,10],[191,9,191,10],[192,9,192,10],[193,9,193,10],[194,9,194,10],[195,9,195,10],[196,9,196,10],[197,9,197,10],[198,9,198,10],[199,9,199,10],[200,9,200,10],[201,9,201,10],[202,9,202,10],[203,9,203,10],[204,9,204,10],[205,9,205,10],[206,9,206,10],[207,9,207,10],[208,9,208,10],[209,9,209,10],[210,9,210,10],[211,9,211,10],[212,9,212,10],[213,9,213,10],[214,9,214,10],[215,9,215,10],[216,9,216,10],[217,9,217,10],[218,9,218,10],[219,9,219,10],[220,9,220,10],[221,9,221,10],[222,9,222,10],[223,9,223,10],[225,9,225,10],[226,9,226,10],[227,9,227,10],[228,9,228,10],[229,9,229,10],[230,9,230,10],[231,9,231,10],[232,9,232,10],[233,9,233,10],[234,9,234,10],[235,9,235,10],[236,9,236,10],[237,9,237,10],[238,9,238,10],[239,9,239,10],[240,9,240,10],[241,9,241,10],[242,9,242,10],[243,9,243,10],[244,9,244,10],[245,9,245,10],[246,9,246,10],[247,9,247,10],[248,9,248,10],[249,9,249,10],[250,9,250,10],[251,9,251,10],[252,9,252,10],[253,9,253,10],[254,9,254,10],[255,9,255,10],[256,9,256,10],[257,9,257,10],[258,9,258,10],[259,9,259,10],[260,9,260,10],[261,9,261,10],[262,9,262,10],[263,9,263,10],[264,9,264,10],[265,9,265,10],[266,9,266,10],[267,9,267,10],[268,9,268,10],[269,9,269,10],[270,9,270,10],[271,9,271,10],[272,9,272,10],[273,9,273,10],[275,10,275,11]]}
[]
[]
[]
[]
[{"$nulls":13},"Back To Main Page"]
["Retail Research Technical Calls & Fundamental Performance Report for the month of April -2018 "]
[{"$nulls":13},{"$f":"Main!B10","v":"2018-04-19"}]
[null,"Positional  Call"]
["Sr.no","Date",null,"Company","Rec","Rec Price","Stop Loss***","Call Closed At","Target","Remark",null,"Profit / Loss per Share","Gain / Loss  %","Status","Closed Date","NSE Closed Price"]
[1,"2018-02-09",null,"HINDUNILVR","Buy",1332,1275,1375,1450,"Profit of Rs.43/-",null,{"$f":"H10-F10-K10","v":43},{"$f":"L10/F10","v":{"v":0.03228228228228228,"d":"3.23%"}},"Successful","2018-04-05",{"$nulls":3},"A"]
[2,"2018-02-12",null,"ITC","Buy","271-272",250,null,310,"Open",{"$nulls":5},{"$f":"VLOOKUP(D11,Sheet2!$A$1:M2109,6,0)","v":275.35},null,null,"P"]
[3,"2018-03-08",null,"CADILAHC","Buy",385,367,397.5,420,"Profit of Rs.12.5/-",null,{"$f":"H12-F12-K12","v":12.5},{"$f":"L12/F12","v":{"v":0.032467532467532464,"d":"3.25%"}},"Successful","2018-04-04",{"$nulls":3},"R"]
[4,"2018-03-13",null,"LUPIN","Buy",772,732,802.75,850,"Profit of Rs.30.75/-",null,30.75,{"$f":"L13/F13","v":{"v":0.03983160621761658,"d":"3.98%"}},"Successful","2018-04-06",{"$nulls":3},"R"]
[5,"2018-03-16",null,"TATACHEM","Buy",686.5,658,714.5,"730-750","Profit of Rs.28/-",null,28,{"$f":"L14/F14","v":{"v":0.04078659868900218,"d":"4.08%"}},"Successful","2018-04-03",{"$nulls":3},"H"]
[6,"2018-03-19",null,"TCS","Buy",2842.5,2720,2937.5,3050,"Profit of Rs.95/-",null,95,{"v":0.03342128408091469,"d":"3.34%"},"Successful","2018-04-05",{"$nulls":3},"A"]
[7,"2018-03-27",null,"KPIT","Buy",219.5,210,226.4,240,"Profit of Rs.6.9/-",null,6.900000000000006,{"$f":"L16/F16","v":{"v":0.03143507972665151,"d":"3.14%"}},"Successful","2018-04-06",{"$nulls":3},"R"]
[8,"2018-03-27",null,"ICICIBANK","Buy",283,268,262.5,310,"Loss of Rs.20.5/-",null,-20.5,{"v":-0.07243816254416961,"d":"-7.24%"},"Unsuccessful","2018-04-02",{"$nulls":3},"R"]
[9,"2018-03-28",null,"LT","Buy",1292.5,1245,1334.5,"1375-1395","Profit of Rs.42/-",null,42,{"$f":"L18/F18","v":{"v":0.03249516441005803,"d":"3.25%"}},"Successful","2018-04-03",{"$nulls":3},"H"]
[10,"2018-04-02",null,"AMBUJACEM","Buy",232,219,239.75,"250-255","Profit of Rs.7.75/-",null,7.75,{"$f":"L19/F19","v":{"v":0.0334051724137931,"d":"3.34%"}},"Successful","2018-04-03",{"$nulls":3},"H"]
[11,"2018-04-02",null,"COLPAL","Buy",1050,998,1087,"1140-1160","Profit of Rs.37/-",null,37,{"v":0.035238095238095235,"d":"3.52%"},"Successful","2018-04-04",{"$nulls":3},"H"]
{"$rows_left_out":269}
{"sheet":"Call Tracker (Currency)","index":6,"n_rows":58,"n_cols":18,"rows_kept":58,"merged":[[1,8,1,9],[2,8,2,9],[3,8,3,9],[4,8,4,9],[5,8,5,9],[6,8,6,9],[7,8,7,9],[8,8,8,9],[9,8,9,9],[10,8,10,9],[11,8,11,9],[12,8,12,9],[13,8,13,9],[14,8,14,9],[15,8,15,9],[16,8,16,9],[17,8,17,9],[18,8,18,9],[19,8,19,9],[20,8,20,9],[21,8,21,9],[22,8,22,9],[23,8,23,9],[24,8,24,9],[25,8,25,9],[26,8,26,9],[27,8,27,9],[28,8,28,9],[29,8,29,9],[30,8,30,9],[31,8,31,9],[32,8,32,9],[33,8,33,9],[34,8,34,9],[35,8,35,9],[36,8,36,9],[37,8,37,9],[38,8,38,9],[39,8,39,9],[40,8,40,9],[41,8,41,9],[42,8,42,9],[43,8,43,9],[44,8,44,9],[45,8,45,9],[46,8,46,9],[47,8,47,9],[48,8,48,9],[49,8,49,9],[50,8,50,9],[51,8,51,9],[52,8,52,9],[53,8,53,9],[54,8,54,9],[55,8,55,9],[56,8,56,9],[57,8,57,9],[58,8,58,9],[59,8,59,9],[60,8,60,9],[61,8,61,9],[62,8,62,9],[63,8,63,9],[64,8,64,9],[65,8,65,9],[66,8,66,9],[67,8,67,9],[68,8,68,9],[69,8,69,9],[70,8,70,9],[71,8,71,9],[72,8,72,9],[73,8,73,9],[74,8,74,9],[75,8,75,9],[76,8,76,9],[77,8,77,9],[78,8,78,9],[79,8,79,9],[80,8,80,9],[81,8,81,9],[82,8,82,9],[83,8,83,9],[84,8,84,9],[85,8,85,9],[86,8,86,9],[87,8,87,9],[88,8,88,9],[89,8,89,9],[90,8,90,9],[91,8,91,9],[92,8,92,9],[93,8,93,9],[94,8,94,9],[95,8,95,9],[96,8,96,9],[97,8,97,9],[98,8,98,9],[99,8,99,9],[100,8,100,9],[101,8,101,9],[102,8,102,9],[103,8,103,9],[104,8,104,9],[105,8,105,9],[106,8,106,9],[107,8,107,9],[108,8,108,9],[109,8,109,9],[110,8,110,9],[111,8,111,9],[112,8,112,9],[113,8,113,9],[114,8,114,9],[115,8,115,9],[116,8,116,9],[117,8,117,9],[118,8,118,9],[119,8,119,9],[120,8,120,9],[121,8,121,9],[122,8,122,9],[123,8,123,9],[124,8,124,9]]}
["Master Trade High Risk"]
["Sr.no","Date","Company","Rec","Rec Price","Stop Loss","Call Closed At","Target","Remark",null,"Profit / Loss per share","Gain / Loss  per Lot","Lot","Status","Closed Date"]
[1,"2017-05-08","USDINR MAY FUT","Buy",64.3935,64.29,64.66,64.59,"Profit of Rs.0.27/-",null,{"v":0.2664999999999935,"d":"0.27"},266.4999999999935,1000,"Successful","2017-05-09",null,null,"P"]
[2,"2017-05-08","USDINR JUN FUT","Buy",64.6535,64.45,64.965,65.05,"Profit of Rs 0.31/-",null,{"v":0.31150000000000944,"d":"0.31"},311.50000000000944,1000,"Successful","2017-05-09",null,null,"P"]
[3,"2017-05-09","EUROINR MAY FUT","Sell",70.65,70.8,70.07,70.4,"Profit of Rs 0.58/-",null,{"v":0.580000000000013,"d":"0.58"},580.00000000001,1000,"Successful","2017-05-12",null,null,"P"]
[4,"2017-05-09","GBPINR MAY FUT","Buy",83.774,83.37,83.37,84.77,"Loss of Rs 0.40/-",null,{"v":-0.40399999999999636,"d":"-0.40"},-403.99999999999636,1000,"Unsuccessful","2017-05-11",null,null,"P"]
[5,"2017-05-11","USDINR MAY FUT","Buy",64.6555,64.55,64.55,64.86,"Loss of Rs.0.1055/-",null,-0.10550000000000637,{"$f":"K7*M7","v":{"v":-105.50000000000637,"d":"-105.50"}},1000,"Unsuccessful","2017-05-11",null,null,"P"]
[6,"2017-05-15","USDINR MAY FUT","Buy",64.2275,64.08,64.46,64.48,"Profit of Rs 0.23/-",null,{"v":0.2324999999999875,"d":"0.23"},232.4999999999875,1000,"Successful","2017-05-18",null,null,"P"]
[7,"2017-05-19","USDINR MAY FUT","Sell",64.83,65,65,64.5,"Loss of Rs.0.17/-",null,{"v":-0.1700000000000017,"d":"-0.17"},-170.0000000000017,1000,"Unsuccessful","2017-05-19",null,null,"P"]
[8,"2017-05-23","USDINR MAY FUT","Buy",64.83,64.62,64.95,65.2,"Profit of Rs 0.12/-",null,{"v":0.12000000000000455,"d":"0.12"},120.00000000000455,1000,"Successful","2017-05-24",null,null,"P"]
[9,"2017-05-25","USDINR MAY FUT","Buy",64.57,64.25,64.56,65,"Loss of Rs.0.01/-",null,-0.009999999999990905,-9.999999999990905,1000,"Neutral","2017-05-29",null,null,"P"]
[10,"2017-05-30","USDINR JUN FUT","Buy",64.9125,64.71,64.71,65.31,"Loss of Rs.0.20/-",null,{"v":-0.20250000000000057,"d":"-0.20"},-202.50000000000057,1000,"Unsuccessful","2017-05-31",null,null,"P"]
[11,"2017-06-01","USDINR JUN FUT","Buy",64.655,64.45,64.45,65.05,"Loss of Rs.0.20/-",null,{"$f":"G13-E13","v":{"v":-0.2049999999999983,"d":"-0.20"}},{"$f":"K13*M13","v":-204.9999999999983},{"v":1000,"d":"1000.00"},"Unsuccessful","2017-06-08",null,null,"P"]
[12,"2017-06-12","USDINR JUN FUT","Buy",64.45,64,64.7625,65.2,"Profit of Rs 0.31/-",null,{"v":0.3125,"d":"0.31"},312.5,1000,"Successful","2017-06-16"]
[13,"2017-06-16","USDINR JUN FUT","Buy",64.51,64.2,64.7,65.11,"Profit of Rs 0.19/-",null,{"v":0.18999999999999773,"d":"0.19"},189.99999999999773,1000,"Successful","2017-06-21"]
[14,"2017-06-22","USDINR JUN FUT","Buy",64.56,64.2,64.2,65.1,"Loss of Rs.0.36/-",null,{"v":-0.35999999999999943,"d":"-0.36"},-359.99999999999943,{"v":1000,"d":"1000.00"},"Unsuccessful","2017-06-30"]
[15,"2017-07-10","USDINR JUL FUT","Buy",64.67,64.4,64.4,65.15,"Loss of Rs.0.27/-",null,{"v":-0.269999999999996,"d":"-0.27"},-269.999999999996,{"v":1000,"d":"1000.00"},"Unsuccessful","2017-07-31"]
[16,"2017-08-02","USDINR AUG FUT","Buy",64.235,63.98,63.98,64.75,"Loss of Rs.0.26/-",null,{"v":-0.25500000000000256,"d":"-0.26"},-255.00000000000256,{"v":1000,"d":"1000.00"},"Unsuccessful","2017-08-02"]
[17,"2017-08-08","USDINR AUG FUT","Buy",63.9425,63.6,64.15,64.5,"Profit of Rs 0.21/-",null,{"v":0.20750000000000313,"d":"0.21"},207.50000000000313,1000,"Successful","2017-08-10"]
[18,"2017-08-22","USDINR AUG FUT","Buy",64.1175,63.9,64.01,64.5,"Loss of Rs.0.11/-",null,{"$f":"G20-E20","v":{"v":-0.1075000000000017,"d":"-0.11"}},{"$f":"K20*M20","v":-107.5000000000017},{"v":1000,"d":"1000.00"},"Unsuccessful","2017-08-29"]
{"$rows_left_out":39}
{"sheet":"Sheet2","index":7,"n_rows":1865,"n_cols":13,"rows_kept":1865,"hidden":true}
["SYMBOL","SERIES","OPEN","HIGH","LOW","CLOSE","LAST","PREVCLOSE","TOTTRDQTY","TOTTRDVAL","TIMESTAMP","TOTALTRADES","ISIN"]
["20MICRONS","EQ",52.45,53.1,51,51.95,52,51.85,93422,4862650.15,"2018-04-18",825,"INE144J01027"]
["21STCENMGM","EQ",38.35,38.35,38.35,38.35,38.35,37.6,200,7670,"2018-04-18",2,"INE253B01015"]
["3IINFOTECH","EQ",5.3,5.3,5.2,5.2,5.25,5.25,1660932,8687239.05,"2018-04-18",701,"INE748C01020"]
["3MINDIA","EQ",20630.75,20800,20396.8,20629.5,20600,20590.6,456,9407303.8,"2018-04-18",248,"INE470A01017"]
["63MOONS","EQ",98.4,98.7,95.6,96.25,96,97.55,148281,14372200.35,"2018-04-18",1998,"INE111B01023"]
["8KMILES","EQ",748.7,765.7,738.65,749.25,748,743.85,227247,170891741,"2018-04-18",6681,"INE650K01021"]
["A2ZINFRA","EQ",29,29,28.2,28.35,28.35,28.9,418990,11977820,"2018-04-18",1861,"INE619I01012"]
["AARTIDRUGS","EQ",562.8,569.65,555,560,564,567.4,2748,1538954.85,"2018-04-18",644,"INE767A01016"]
["AARTIIND","EQ",1300.65,1337,1288,1327.7,1333.9,1296.6,71564,94555426.05,"2018-04-18",6254,"INE769A01020"]
["AARVEEDEN","EQ",47,48,46.2,46.35,46.35,47.3,6682,315206.7,"2018-04-18",62,"INE273D01019"]
["ABAN","EQ",172.9,175.75,171.3,172.4,172.8,172.3,924824,160215926.05,"2018-04-18",10609,"INE421A01028"]
["ABB","EQ",1273.95,1273.95,1254,1255.65,1255,1264.5,26940,33968807.75,"2018-04-18",2223,"INE117A01022"]
["ABBOTINDIA","EQ",6375,6385,6140.05,6171.75,6170,6293.1,3860,24039375.95,"2018-04-18",870,"INE358A01014"]
["ABCAPITAL","EQ",159,159.1,156.65,157.05,156.95,158.25,791778,124883400.55,"2018-04-18",7923,"INE674K01013"]
["ABFRL","EQ",151,151,146.55,147.1,146.6,150.8,324944,47968007.7,"2018-04-18",3557,"INE647O01011"]
["ACC","EQ",1599,1602.7,1561.95,1573.5,1570,1586.95,489407,775619576.95,"2018-04-18",14949,"INE012A01025"]
["ACCELYA","EQ",1345,1365,1332,1353.75,1354,1345.2,7715,10461015.5,"2018-04-18",793,"INE793A01012"]
["ACE","EQ",173.4,175.75,171.25,172.7,172.65,172.35,429450,74519952.4,"2018-04-18",4565,"INE731H01025"]
["ADANIENT","EQ",141,141,135.7,136.75,137.15,139.5,3297720,455689338.15,"2018-04-18",19271,"INE423A01024"]
{"$rows_left_out":1845}