{"text_format":"3","workbook":"xlsx","n_sheets":6,"sheets":["Main","Future Intra","Cash Intra","MidCap Intra","Bulk Deals","Call Tracker (Equity & F&O)"],"not_rendered":{"images":4,"defined_names":1},"read":"whole","date_system":"1900"}

{"sheet":"Main","index":0,"n_rows":27,"n_cols":11,"rows_kept":27}
[null,"                                                                                                 "]
[]
[]
[]
[]
[{"$nulls":6}," "]
[]
[]
[]
[null,"2024-06-14"]
[]
[null,"Sheet No.","Template Name","Summary"]
[null,1,"Future Intra","For Intraday trading in F&O segment"]
[null,2,"Cash Intra","For Intraday trading in cash market segment"]
[null,3,"Mid-cap Intra","For Intraday trading in Mid-cap stocks"]
[null,4,"Bulk Deals","Reveals Bulk Deals carried on NSE & BSE"]
[null,5,"Call Tracker"]
{"$rows_empty":9}
[{"$nulls":10},"`"]

{"sheet":"Future Intra","index":1,"n_rows":225,"n_cols":16,"rows_kept":225,"merged":[[8,0,9,0],[8,1,9,1],[8,2,9,2],[8,3,9,3],[8,6,8,8],[8,9,8,11]]}
[]
[]
[]
[]
[{"$nulls":12},"Back to Main Page"]
["FOR INTRA DAY TRADING",{"$nulls":10},{"$f":"Main!B10","v":"2024-06-14"}]
[]
[]
["Sr.no","Sector","Scrip","Expiry Date","CLOSE RATE","Pivot Point","Supports",null,null,"Resistances"]
[{"$nulls":4},"Point","Point","S1","S2","S3","R1","R2","R3","HIGH","LOW","OI","% Change in OI"]
[1,"Index","NIFTY","2024-06-27",23399.25,{"v":23417.533333333336,"d":"23417.53"},{"v":23353.066666666673,"d":"23353.07"},{"v":23306.883333333335,"d":"23306.88"},{"v":23242.41666666667,"d":"23242.42"},{"v":23463.716666666674,"d":"23463.72"},{"v":23528.18333333334,"d":"23528.18"},{"v":23574.366666666676,"d":"23574.37"},23482,23371.35,14439700,{"v":-0.008613024925936224,"d":"-0.86%"}]
[2,"Index","BANKNIFTY","2024-06-26",49912.65,{"v":49972.950000000004,"d":"49972.95"},{"v":49790.100000000006,"d":"49790.10"},49667.55,{"v":49484.700000000004,"d":"49484.70"},{"v":50095.50000000001,"d":"50095.50"},50278.35,{"v":50400.90000000001,"d":"50400.90"},50155.8,49850.4,2686665,{"v":-0.008941663392852203,"d":"-0.89%"}]
[3,"Index","FINNIFTY","2024-06-25",{"v":22337.7,"d":"22337.70"},{"v":22352.63333333333,"d":"22352.63"},{"v":22296.066666666662,"d":"22296.07"},{"v":22254.43333333333,"d":"22254.43"},{"v":22197.86666666666,"d":"22197.87"},{"v":22394.266666666663,"d":"22394.27"},{"v":22450.83333333333,"d":"22450.83"},{"v":22492.466666666664,"d":"22492.47"},22409.2,22311,56985,{"v":1.4938488576449911E-3,"d":"0.15%"}]
[4,"Index","MIDCPNIFTY","2024-06-24",11945.95,{"v":11941.116666666667,"d":"11941.12"},{"v":11901.083333333334,"d":"11901.08"},{"v":11856.216666666667,"d":"11856.22"},{"v":11816.183333333334,"d":"11816.18"},{"v":11985.983333333334,"d":"11985.98"},{"v":12026.016666666666,"d":"12026.02"},{"v":12070.883333333333,"d":"12070.88"},11981.15,11896.25,1669775,{"v":0.016961797889672184,"d":"1.70%"}]
[5,"Index","NIFTYNXT50","2024-06-28",70852.55,{"v":70683.86666666665,"d":"70683.87"},{"v":70418.73333333331,"d":"70418.73"},{"v":69984.91666666666,"d":"69984.92"},{"v":69719.78333333331,"d":"69719.78"},{"v":71117.6833333333,"d":"71117.68"},{"v":71382.81666666664,"d":"71382.82"},{"v":71816.6333333333,"d":"71816.63"},70949,70250.05,7300,{"v":0.18892508143322476,"d":"18.89%"}]
[6,"Chemicals","AARTIIND","2024-06-27",677.35,674.85,{"v":669.7,"d":"669.70"},{"v":662.0500000000001,"d":"662.05"},{"v":656.9000000000001,"d":"656.90"},{"v":682.5,"d":"682.50"},{"v":687.6499999999999,"d":"687.65"},{"v":695.3,"d":"695.30"},680,667.2,11430000,{"v":-0.01499482936918304,"d":"-1.50%"}]
[7,"Capital_Goods","ABB","2024-06-27",{"v":8480.7,"d":"8480.70"},{"v":8443.6,"d":"8443.60"},8362.25,{"v":8243.8,"d":"8243.80"},{"v":8162.449999999999,"d":"8162.45"},{"v":8562.050000000001,"d":"8562.05"},{"v":8643.400000000003,"d":"8643.40"},{"v":8761.850000000002,"d":"8761.85"},8524.95,8325.15,1146625,{"v":0.015948610034333812,"d":"1.59%"}]
[8,"Pharma","ABBOTINDIA","2024-06-27",27642.35,{"v":27652.983333333334,"d":"27652.98"},{"v":27530.966666666667,"d":"27530.97"},{"v":27419.583333333332,"d":"27419.58"},{"v":27297.566666666666,"d":"27297.57"},{"v":27764.36666666667,"d":"27764.37"},{"v":27886.38333333334,"d":"27886.38"},{"v":27997.76666666667,"d":"27997.77"},27775,27541.6,151360,{"v":-0.003161222339304531,"d":"-0.32%"}]
[9,"Finance","ABCAPITAL","2024-06-27",239.85,{"v":238.83333333333334,"d":"238.83"},{"v":235.86666666666667,"d":"235.87"},{"v":231.88333333333333,"d":"231.88"},{"v":228.91666666666666,"d":"228.92"},{"v":242.8166666666667,"d":"242.82"},{"v":245.78333333333333,"d":"245.78"},{"v":249.7666666666667,"d":"249.77"},241.8,234.85,67532400,{"v":-2.2339237274613052E-3,"d":"-0.22%"}]
[10,"Textile","ABFRL","2024-06-27",327.55,{"v":327.8666666666667,"d":"327.87"},{"v":325.33333333333337,"d":"325.33"},{"v":323.1166666666667,"d":"323.12"},{"v":320.58333333333337,"d":"320.58"},{"v":330.08333333333337,"d":"330.08"},{"v":332.6166666666667,"d":"332.62"},{"v":334.83333333333337,"d":"334.83"},330.4,325.65,36098400,{"v":0.004703668861712135,"d":"0.47%"}]
{"$rows_left_out":195}
{"sheet":"Cash Intra","index":2,"n_rows":243,"n_cols":13,"rows_kept":243,"merged":[[7,0,8,0],[7,1,8,1],[7,2,8,2],[7,3,8,3],[7,4,7,6],[7,7,7,9]]}
[]
[]
[]
[]
[{"$nulls":12},"Back to Main Page"]
["FOR INTRA DAY TRADING",{"$nulls":9},{"$f":"Main!B10","v":"2024-06-14"}]
[]
["Sr.no",null,"CLOSE RATE","Pivot Point","Supports",null,null,"Resistances"]
[{"$nulls":4},"S1","S2","S3","R1","R2","R3","HIGH","LOW","Total Trade Quanity in Lakhs"]
[1,"Nifty 50",{"v":23398.9,"d":"23398.90"},{"v":23411.283333333336,"d":"23411.28"},{"v":23341.516666666674,"d":"23341.52"},{"v":23284.13333333334,"d":"23284.13"},{"v":23214.366666666676,"d":"23214.37"},{"v":23468.66666666667,"d":"23468.67"},{"v":23538.433333333334,"d":"23538.43"},{"v":23595.81666666667,"d":"23595.82"},23481.05,{"v":23353.9,"d":"23353.90"}]
[2,"Nifty Bank",{"v":49846.7,"d":"49846.70"},{"v":49944.26666666666,"d":"49944.27"},{"v":49702.08333333333,"d":"49702.08"},{"v":49557.46666666667,"d":"49557.47"},{"v":49315.28333333333,"d":"49315.28"},{"v":50088.883333333324,"d":"50088.88"},{"v":50331.06666666666,"d":"50331.07"},{"v":50475.68333333332,"d":"50475.68"},50186.45,49799.65]
[3,"Nifty CPSE",{"v":6735.7,"d":"6735.70"},{"v":6718.633333333334,"d":"6718.63"},{"v":6663.966666666668,"d":"6663.97"},{"v":6592.233333333334,"d":"6592.23"},{"v":6537.5666666666675,"d":"6537.57"},{"v":6790.366666666669,"d":"6790.37"},{"v":6845.033333333335,"d":"6845.03"},{"v":6916.766666666669,"d":"6916.77"},{"v":6773.3,"d":"6773.30"},{"v":6646.9,"d":"6646.90"}]
[4,"Nifty Infra",{"v":8978.1,"d":"8978.10"},{"v":8974.9,"d":"8974.90"},8939.65,{"v":8901.2,"d":"8901.20"},8865.95,{"v":9013.349999999999,"d":"9013.35"},{"v":9048.599999999999,"d":"9048.60"},{"v":9087.049999999997,"d":"9087.05"},9010.15,8936.45]
[5,"Nifty IT",34902.05,{"v":34908.26666666667,"d":"34908.27"},{"v":34776.98333333334,"d":"34776.98"},{"v":34651.916666666664,"d":"34651.92"},{"v":34520.63333333333,"d":"34520.63"},{"v":35033.33333333334,"d":"35033.33"},{"v":35164.61666666668,"d":"35164.62"},{"v":35289.68333333335,"d":"35289.68"},35039.55,{"v":34783.2,"d":"34783.20"}]
[6,"Nifty PSE",10710.15,{"v":10666.583333333334,"d":"10666.58"},{"v":10606.816666666668,"d":"10606.82"},{"v":10503.483333333334,"d":"10503.48"},{"v":10443.716666666667,"d":"10443.72"},{"v":10769.916666666668,"d":"10769.92"},{"v":10829.683333333334,"d":"10829.68"},{"v":10933.016666666668,"d":"10933.02"},10726.35,10563.25]
[7,"Nifty Midcap 50",15378.35,{"v":15349.616666666667,"d":"15349.62"},{"v":15312.083333333334,"d":"15312.08"},{"v":15245.816666666668,"d":"15245.82"},{"v":15208.283333333335,"d":"15208.28"},{"v":15415.883333333333,"d":"15415.88"},{"v":15453.416666666666,"d":"15453.42"},{"v":15519.683333333332,"d":"15519.68"},15387.15,15283.35]
[8,"ABB",8446.6,8413.85,{"v":8337.800000000001,"d":"8337.80"},{"v":8229,"d":"8229.00"},{"v":8152.950000000001,"d":"8152.95"},{"v":8522.650000000001,"d":"8522.65"},{"v":8598.7,"d":"8598.70"},{"v":8707.500000000002,"d":"8707.50"},8489.9,8305.05,3.86195]
[9,"ACC",2635.8,{"v":2630.133333333333,"d":"2630.13"},{"v":2616.2666666666664,"d":"2616.27"},{"v":2596.733333333333,"d":"2596.73"},{"v":2582.8666666666663,"d":"2582.87"},{"v":2649.6666666666665,"d":"2649.67"},{"v":2663.5333333333333,"d":"2663.53"},{"v":2683.0666666666666,"d":"2683.07"},2644,2610.6,3.84618]
[10,"APLAPOLLO",1539.35,{"v":1559.7166666666665,"d":"1559.72"},{"v":1514.633333333333,"d":"1514.63"},{"v":1489.9166666666665,"d":"1489.92"},{"v":1444.833333333333,"d":"1444.83"},{"v":1584.433333333333,"d":"1584.43"},{"v":1629.5166666666664,"d":"1629.52"},{"v":1654.233333333333,"d":"1654.23"},1604.8,1535,7.05356]
[11,"AUBANK",668.15,{"v":671.0333333333333,"d":"671.03"},{"v":663.1166666666666,"d":"663.12"},{"v":658.0833333333333,"d":"658.08"},{"v":650.1666666666665,"d":"650.17"},{"v":676.0666666666666,"d":"676.07"},{"v":683.9833333333333,"d":"683.98"},{"v":689.0166666666667,"d":"689.02"},678.95,666,17.86679]
{"$rows_left_out":224}
{"sheet":"MidCap Intra","index":3,"n_rows":533,"n_cols":13,"rows_kept":533,"merged":[[0,0,0,1],[8,0,9,0],[8,1,9,1],[8,2,9,2],[8,3,9,3],[8,4,8,6],[8,7,8,9]]}
[]
[]
[]
[]
[{"$nulls":11},"Back To Main Page"]
["FOR INTRA DAY TRADING",{"$nulls":9},{"$f":"Main!B10","v":"2024-06-14"}]
[null,null," "]
[]
["Sr.no","Scrip","CLOSE RATE","Pivot Point","Supports",null,null,"Resistances"]
[{"$nulls":4},"S1","S2","S3","R1","R2","R3","HIGH","LOW","Total Trade Quanity in Lakhs"]
[1,"360ONE",782.15,{"v":793.9499999999999,"d":"793.95"},{"v":768.1999999999998,"d":"768.20"},{"v":754.2499999999999,"d":"754.25"},{"v":728.4999999999998,"d":"728.50"},{"v":807.8999999999999,"d":"807.90"},{"v":833.6500000000001,"d":"833.65"},{"v":847.5999999999999,"d":"847.60"},819.7,780,9.0065]
[2,"3MINDIA",36894.6,{"v":36599.56666666667,"d":"36599.57"},{"v":36099.133333333346,"d":"36099.13"},{"v":35303.66666666667,"d":"35303.67"},{"v":34803.233333333344,"d":"34803.23"},{"v":37395.03333333335,"d":"37395.03"},{"v":37895.46666666668,"d":"37895.47"},{"v":38690.93333333335,"d":"38690.93"},37100,35804.1,0.09335]
[3,"ABB",8446.6,8413.85,{"v":8337.800000000001,"d":"8337.80"},{"v":8229,"d":"8229.00"},{"v":8152.950000000001,"d":"8152.95"},{"v":8522.650000000001,"d":"8522.65"},{"v":8598.7,"d":"8598.70"},{"v":8707.500000000002,"d":"8707.50"},8489.9,8305.05,3.86195]
[4,"ACC",2635.8,{"v":2630.133333333333,"d":"2630.13"},{"v":2616.2666666666664,"d":"2616.27"},{"v":2596.733333333333,"d":"2596.73"},{"v":2582.8666666666663,"d":"2582.87"},{"v":2649.6666666666665,"d":"2649.67"},{"v":2663.5333333333333,"d":"2663.53"},{"v":2683.0666666666666,"d":"2683.07"},2644,2610.6,3.84618]
[5,"AIAENG",3825.8,{"v":3838.2833333333333,"d":"3838.28"},{"v":3799.5666666666666,"d":"3799.57"},{"v":3773.3333333333335,"d":"3773.33"},{"v":3734.616666666667,"d":"3734.62"},{"v":3864.5166666666664,"d":"3864.52"},{"v":3903.2333333333327,"d":"3903.23"},{"v":3929.4666666666662,"d":"3929.47"},3877,3812.05,0.28648]
[6,"APLAPOLLO",1539.35,{"v":1559.7166666666665,"d":"1559.72"},{"v":1514.633333333333,"d":"1514.63"},{"v":1489.9166666666665,"d":"1489.92"},{"v":1444.833333333333,"d":"1444.83"},{"v":1584.433333333333,"d":"1584.43"},{"v":1629.5166666666664,"d":"1629.52"},{"v":1654.233333333333,"d":"1654.23"},1604.8,1535,7.05356]
[7,"AUBANK",668.15,{"v":671.0333333333333,"d":"671.03"},{"v":663.1166666666666,"d":"663.12"},{"v":658.0833333333333,"d":"658.08"},{"v":650.1666666666665,"d":"650.17"},{"v":676.0666666666666,"d":"676.07"},{"v":683.9833333333333,"d":"683.98"},{"v":689.0166666666667,"d":"689.02"},678.95,666,17.86679]
[8,"AARTIIND",675.25,672.75,667.55,{"v":659.8499999999999,"d":"659.85"},{"v":654.6499999999999,"d":"654.65"},680.45,{"v":685.6500000000001,"d":"685.65"},{"v":693.3500000000001,"d":"693.35"},677.95,665.05,13.10157]
[9,"AAVAS",1837.6,{"v":1860.2333333333336,"d":"1860.23"},{"v":1799.516666666667,"d":"1799.52"},{"v":1761.4333333333336,"d":"1761.43"},{"v":1700.7166666666672,"d":"1700.72"},{"v":1898.316666666667,"d":"1898.32"},{"v":1959.0333333333333,"d":"1959.03"},{"v":1997.116666666667,"d":"1997.12"},1920.95,1822.15,3.96746]
[10,"ABBOTINDIA",27616.7,{"v":27610.916666666668,"d":"27610.92"},{"v":27509.333333333336,"d":"27509.33"},{"v":27401.966666666667,"d":"27401.97"},{"v":27300.383333333335,"d":"27300.38"},{"v":27718.283333333336,"d":"27718.28"},{"v":27819.866666666672,"d":"27819.87"},{"v":27927.233333333337,"d":"27927.23"},27712.5,27503.55,0.05056]
{"$rows_left_out":508}
{"sheet":"Bulk Deals","index":4,"n_rows":301,"n_cols":8,"rows_kept":301,"merged":[[4,0,4,1],[4,2,4,3],[6,1,6,2]]}
[" "]
[]
[]
[]
[]
[{"$nulls":4},"Back To Main Page"]
["Subject :","BULK DEAL",null,{"$f":"Main!B10","v":"2024-06-14"}]
[]
["Date","Scrip code","Scrip Name","Client Name","Buy / Sell","Quantity Traded","Trade Price / Wt.Avg.trade price","Exchange  "]
["2024-06-13",539562,"AARNAV","SUMIT CHAMPALAL AGARWAL","SELL",{"v":250000,"d":"250,000"},35.03,"BSE"]
["2024-06-13",539562,"AARNAV","CHAMPALAL GOPIRAM AGARWAL","SELL",{"v":250000,"d":"250,000"},35,"BSE"]
["2024-06-13",539661,"ACEMEN","ARDENT VENTURES LLP","BUY",{"v":25000,"d":"25,000"},44.75,"BSE"]
["2024-06-13",539506,"ADCON","HEMANTSINGH NAHARSINGH JHALA","SELL",{"v":1000000,"d":"1,000,000"},0.69,"BSE"]
["2024-06-13",538351,"AFEL","SEIFER RICHARD MASCARENHAS","BUY",{"v":500000,"d":"500,000"},9.3,"BSE"]
["2024-06-13",538351,"AFEL","MULTIPLIER SHARE & STOCK ADVISORS PRIVATE LIMITED","SELL",{"v":100000,"d":"100,000"},9.3,"BSE"]
["2024-06-13",538351,"AFEL","PARESH DHIRAJLAL SHAH","SELL",{"v":75000,"d":"75,000"},9.3,"BSE"]
["2024-06-13",538351,"AFEL","SHIVAM JINDAL","BUY",{"v":146213,"d":"146,213"},10.02,"BSE"]
["2024-06-13",538351,"AFEL","SHARE INDIA SECURITIES LIMITED","BUY",{"v":132071,"d":"132,071"},9.38,"BSE"]
["2024-06-13",538351,"AFEL","SHARE INDIA SECURITIES LIMITED","SELL",{"v":5000,"d":"5,000"},9.46,"BSE"]
["2024-06-13",538351,"AFEL","KAUSHAL HITESHBHAI PARIKH","BUY",{"v":100000,"d":"100,000"},9.3,"BSE"]
{"$rows_left_out":282}
{"sheet":"Call Tracker (Equity & F&O)","index":5,"n_rows":340,"n_cols":18,"rows_kept":340,"merged":[[74,0,75,0],[74,1,75,1],[74,9,75,9],[74,12,75,12],[74,13,75,13],[74,14,75,14],[74,15,75,15],[76,0,79,0],[76,1,79,1],[76,9,79,9],[76,12,79,12],[76,13,79,13],[76,14,79,14],[76,15,79,15],[80,0,81,0],[80,1,81,1],[80,9,81,9],[80,12,81,12],[80,13,81,13],[80,14,81,14],[80,15,81,15],[82,0,83,0],[82,1,83,1],[82,9,83,9],[82,12,83,12],[82,13,83,13],[82,14,83,14],[82,15,83,15],[84,0,85,0],[84,1,85,1],[84,9,85,9],[84,12,85,12],[84,14,85,14],[84,15,85,15],[87,0,88,0],[87,1,88,1],[87,9,88,9],[87,12,88,12],[87,14,88,14],[87,15,88,15],[89,0,90,0],[89,1,90,1],[89,9,90,9],[89,12,90,12],[89,14,90,14],[89,15,90,15],[91,0,92,0],[91,1,92,1],[91,9,92,9],[91,12,92,12],[91,14,92,14],[91,15,92,15],[95,0,96,0],[95,1,96,1],[95,9,96,9],[98,0,99,0],[98,1,99,1],[98,9,99,9],[98,12,99,12],[98,14,99,14],[98,15,99,15]]}
[]
[]
[]
[]
[{"$nulls":12},"Back To Main Page"]
["Retail Research Technical Calls & Fundamental Performance Report for the month of June-2024"]
[{"$nulls":12},{"$f":"Main!B10","v":"2024-06-14"}]
[null,"Positional  Call"]
["Sr.no","Date",null,"Company","Rec","Rec Price","Stop Loss***","Call Closed At","Target","Remark","Profit / Loss per Share","All charges","Net Gain / Loss  %","Status","Closed Date","Market Closing Price","Second Buying Date"]
[1,"2024-03-22",null,"TCS","Accu <>","3752-3852",3612,null,"4072-4172","Open",{"$nulls":5},{"$f":"VLOOKUP(D10,'MidCap Intra'!$B$11:$C$571,2,0)","v":3878.15},null,"H"]
[2,"2024-05-02",null,"HCLTECH","Accu <>",1317,1267,1393,"1417-1492","Profit of Rs.76/-",{"$f":"H11-F11","v":76},{"$f":"(F11*-0.3)/100","v":{"v":-3.9509999999999996,"d":"-3.95"}},{"$f":"(K11+L11)/F11","v":{"v":0.054706909643128326,"d":"5.47%"}},"Successful","2024-06-06",null,null,"H"]
[3,"2024-05-07",null,"ITC","Accu","424.5-434.5",408.5,null,"468-495","Open",{"$nulls":5},{"$f":"VLOOKUP(D12,'MidCap Intra'!$B$11:$C$571,2,0)","v":{"v":430.3,"d":"430.30"}},null,"H"]
[4,"2024-05-16",null,"HINDUNILVR","Accu",2307.5,2185,2425,"2500-2600","Profit of Rs.117.5/-",{"$f":"H13-F13","v":117.5},{"$f":"(F13*-0.3)/100","v":{"v":-6.9225,"d":"-6.92"}},{"$f":"(K13+L13)/F13","v":{"v":0.04792091007583965,"d":"4.79%"}},"Successful","2024-06-04",null,null,"H"]
[5,"2024-05-22",null,"BPCL","Accu",628,588,662.5,"680-720","Profit of Rs.34.5/-",{"$f":"H14-F14","v":34.5},{"$f":"(F14*-0.3)/100","v":{"v":-1.8840000000000001,"d":"-1.88"}},{"$f":"(K14+L14)/F14","v":{"v":0.051936305732484075,"d":"5.19%"}},"Successful","2024-06-03",null,null,"H"]
[6,"2024-05-24",null,"ACC","Accu",2570,2460,2370,"2750-2850","Loss of Rs.200/-",-200,-7.71,{"v":-0.08082101167315175,"d":"-8.08%"},"Unsuccessful","2024-06-04",null,null,"H"]
[7,"2024-05-30",null,"ZYDUSLIFE","Accu",1022.5,965,1065,"1115-1200","Profit of Rs.42.5/-",42.5,{"$f":"(F16*-0.3)/100","v":{"v":-3.0675,"d":"-3.07"}},{"v":0.038564792176039114,"d":"3.86%"},"Successful","2024-06-10",null,null,"H"]
[8,"2024-05-30",null,"RELIANCE","Accu",2860,2720,2955,"3000-3150","Profit of Rs.95/-",{"$f":"H17-F17","v":95},{"$f":"(F17*-0.3)/100","v":-8.58},{"$f":"(K17+L17)/F17","v":{"v":0.030216783216783217,"d":"3.02%"}},"Successful","2024-06-03",null,null,"H"]
[9,"2024-05-30",null,"GAIL","Accu",199,185,216.5,"215-230","Profit of Rs.17.5/-",{"$f":"H18-F18","v":17.5},{"$f":"(F18*-0.3)/100","v":{"v":-0.597,"d":"-0.60"}},{"$f":"(K18+L18)/F18","v":{"v":0.0849396984924623,"d":"8.49%"}},"Successful","2024-06-03",null,null,"K"]
[10,"2024-06-03",null,"GUJGASLTD","Accu",561,534,530,"615-645","Loss of Rs.31/-",-31,{"v":-1.6829999999999998,"d":"-1.68"},{"v":-0.0582584670231729,"d":"-5.83%"},"Unsuccessful","2024-06-04",null,null,"H"]
[11,"2024-06-04",null,"RELIANCE","Accu","2815-2915",2740,null,"3100-3200","Open",{"$nulls":5},{"$f":"VLOOKUP(D20,'MidCap Intra'!$B$11:$C$571,2,0)","v":{"v":2930.5,"d":"2930.50"}},null,"H"]
{"$rows_left_out":313}