{"text_format":"3","workbook":"xlsx","n_sheets":11,"sheets":["Main","Future Intra","Cash Intra","MidCap Intra","Bulk Deals","Call Tracker (Equity & F&O)","Sheet2","Sheet1","Sheet3","Sheet4","Sheet5"],"not_rendered":{"images":4,"defined_names":5},"read":"whole","date_system":"1900"}

{"sheet":"Main","index":0,"n_rows":27,"n_cols":11,"rows_kept":27}
[null,"                                                                                                 "]
{"$rows_empty":8}
[null,"2020-02-17"]
[]
[null,"Sheet No.","Template Name","Summary"]
[null,1,"Future Intra","For Intraday trading in F&O segment"]
[null,2,"Cash Intra","For Intraday trading in cash market segment"]
[null,3,"Mid-cap Intra","For Intraday trading in Mid-cap stocks"]
[null,4,"Bulk Deals","Reveals Bulk Deals carried on NSE & BSE"]
[null,5,"Call Tracker"]
{"$rows_empty":9}
[{"$nulls":10},"`"]

{"sheet":"Future Intra","index":1,"n_rows":190,"n_cols":15,"rows_kept":190,"merged":[[8,0,9,0],[8,1,9,1],[8,2,9,2],[8,5,8,7],[8,8,8,10]]}
[]
[]
[]
[]
[{"$nulls":12},"Back to Main Page"]
["FOR INTRA DAY TRADING",{"$nulls":10},{"$f":"Main!B10","v":"2020-02-17"}]
[]
[]
["Sr.no","Sector","Scrip","CLOSE RATE","Pivot Point","Supports",null,null,"Resistances"]
[null,"Sector",null,"Point","Point","S1","S2","S3","R1","R2","R3","HIGH","LOW","OI","% Change in OI"]
[1,"Index","BANKNIFTY",{"v":30902.1,"d":"30902.10"},{"v":31049.149999999998,"d":"31049.15"},{"v":30627.449999999997,"d":"30627.45"},{"v":30352.8,"d":"30352.80"},{"v":29931.1,"d":"29931.10"},{"v":31323.799999999996,"d":"31323.80"},{"v":31745.5,"d":"31745.50"},{"v":32020.149999999994,"d":"32020.15"},31470.85,30774.5,1347180,{"v":-0.00785070405938844,"d":"-0.79%"}]
[2,"Index","NIFTY",12129.65,{"v":12163.683333333334,"d":"12163.68"},{"v":12066.966666666669,"d":"12066.97"},{"v":12004.283333333335,"d":"12004.28"},{"v":11907.56666666667,"d":"11907.57"},{"v":12226.366666666669,"d":"12226.37"},{"v":12323.083333333336,"d":"12323.08"},{"v":12385.766666666668,"d":"12385.77"},12260.4,12101,14181825,{"v":-0.014499173932757606,"d":"-1.45%"}]
[3,"Index","NIFTYIT",{"v":16612,"d":"16612.00"},{"v":16660.333333333332,"d":"16660.33"},{"v":16554.666666666664,"d":"16554.67"},{"v":16497.333333333332,"d":"16497.33"},{"v":16391.666666666664,"d":"16391.67"},{"v":16717.666666666664,"d":"16717.67"},{"v":16823.33333333333,"d":"16823.33"},{"v":16880.666666666664,"d":"16880.67"},16766,16603,8200,{"v":0.07894736842105263,"d":"7.89%"}]
[4,"Cement","ACC",{"v":1441.8,"d":"1441.80"},{"v":1444.5999999999997,"d":"1444.60"},{"v":1430.3499999999995,"d":"1430.35"},{"v":1418.8999999999999,"d":"1418.90"},{"v":1404.6499999999996,"d":"1404.65"},{"v":1456.0499999999993,"d":"1456.05"},{"v":1470.2999999999997,"d":"1470.30"},{"v":1481.749999999999,"d":"1481.75"},1458.85,1433.15,4657200,{"v":-0.021185372005044136,"d":"-2.12%"}]
[5,"Others","ADANIENT",{"v":255.8,"d":"255.80"},{"v":254.55000000000004,"d":"254.55"},{"v":250.75000000000006,"d":"250.75"},{"v":245.70000000000002,"d":"245.70"},{"v":241.90000000000003,"d":"241.90"},{"v":259.6000000000001,"d":"259.60"},{"v":263.4000000000001,"d":"263.40"},{"v":268.4500000000001,"d":"268.45"},258.35,249.5,29152000,{"v":-0.016198704103671708,"d":"-1.62%"}]
[6,"Others","ADANIPORTS",367.45,{"v":369.0166666666667,"d":"369.02"},{"v":365.0333333333334,"d":"365.03"},{"v":362.61666666666673,"d":"362.62"},{"v":358.63333333333344,"d":"358.63"},{"v":371.4333333333334,"d":"371.43"},{"v":375.41666666666663,"d":"375.42"},{"v":377.83333333333337,"d":"377.83"},373,366.6,27742500,{"v":0.010103768432550519,"d":"1.01%"}]
[7,"Power","ADANIPOWER",{"v":59.6,"d":"59.60"},{"v":59.699999999999996,"d":"59.70"},{"v":58.79999999999999,"d":"58.80"},{"v":57.99999999999999,"d":"58.00"},{"v":57.09999999999999,"d":"57.10"},{"v":60.49999999999999,"d":"60.50"},{"v":61.4,"d":"61.40"},{"v":62.199999999999996,"d":"62.20"},60.6,58.9,75890000,{"v":0.007567711099309612,"d":"0.76%"}]
[8,"Automobile","AMARAJABAT",758.75,{"v":762.8000000000001,"d":"762.80"},{"v":750.4500000000002,"d":"750.45"},{"v":742.1500000000001,"d":"742.15"},{"v":729.8000000000002,"d":"729.80"},{"v":771.1000000000001,"d":"771.10"},783.45,{"v":791.7500000000001,"d":"791.75"},775.15,754.5,1764000,{"v":-2.2624434389140274E-3,"d":"-0.23%"}]
[9,"Cement","AMBUJACEM",{"v":205.8,"d":"205.80"},{"v":207.63333333333335,"d":"207.63"},{"v":203.2166666666667,"d":"203.22"},{"v":200.63333333333335,"d":"200.63"},{"v":196.2166666666667,"d":"196.22"},{"v":210.2166666666667,"d":"210.22"},{"v":214.63333333333338,"d":"214.63"},{"v":217.2166666666667,"d":"217.22"},212.05,205.05,32992500,{"v":0.004032258064516129,"d":"0.40%"}]
[10,"Others","APOLLOHOSP",1706.95,{"v":1711.0833333333333,"d":"1711.08"},{"v":1676.1666666666665,"d":"1676.17"},{"v":1645.3833333333332,"d":"1645.38"},{"v":1610.4666666666665,"d":"1610.47"},{"v":1741.8666666666666,"d":"1741.87"},{"v":1776.783333333333,"d":"1776.78"},{"v":1807.5666666666666,"d":"1807.57"},1746,1680.3,2160000,{"v":0.03696591454632741,"d":"3.70%"}]
{"$rows_left_out":155}
{"sheet":"Cash Intra","index":2,"n_rows":247,"n_cols":13,"rows_kept":247,"merged":[[7,0,8,0],[7,1,8,1],[7,2,8,2],[7,3,8,3],[7,4,7,6],[7,7,7,9]]}
[]
[]
[]
[]
[{"$nulls":12},"Back to Main Page"]
["FOR INTRA DAY TRADING",{"$nulls":9},{"$f":"Main!B10","v":"2020-02-17"}]
[]
["Sr.no","Scrip","CLOSE RATE","Pivot Point","Supports",null,null,"Resistances"]
[null,null,"Point",null,"S1","S2","S3","R1","R2","R3","HIGH","LOW","Total Trade Quanity in Lakhs"]
[1,"Nifty 50",12113.45,{"v":12150.450000000003,"d":"12150.45"},{"v":12054.200000000004,"d":"12054.20"},{"v":11994.950000000003,"d":"11994.95"},{"v":11898.700000000004,"d":"11898.70"},{"v":12209.700000000004,"d":"12209.70"},12305.95,{"v":12365.200000000004,"d":"12365.20"},12246.7,12091.2]
[2,"Nifty Bank",30834.8,{"v":31015.849999999995,"d":"31015.85"},{"v":30595.04999999999,"d":"30595.05"},{"v":30355.299999999992,"d":"30355.30"},{"v":29934.499999999985,"d":"29934.50"},{"v":31255.59999999999,"d":"31255.60"},{"v":31676.4,"d":"31676.40"},{"v":31916.149999999994,"d":"31916.15"},31436.65,30776.1]
[3,"Nifty CPSE",1649.05,1663.05,1631.35,{"v":1613.6499999999999,"d":"1613.65"},{"v":1581.9499999999998,"d":"1581.95"},1680.75,{"v":1712.4500000000003,"d":"1712.45"},1730.15,1694.75,1645.35]
[4,"Nifty Infra",3279.9,{"v":3281.116666666667,"d":"3281.12"},{"v":3262.4333333333334,"d":"3262.43"},{"v":3244.9666666666667,"d":"3244.97"},{"v":3226.2833333333333,"d":"3226.28"},{"v":3298.5833333333335,"d":"3298.58"},{"v":3317.266666666667,"d":"3317.27"},{"v":3334.7333333333336,"d":"3334.73"},3299.8,3263.65]
[5,"Nifty IT",16642.75,{"v":16698.399999999998,"d":"16698.40"},{"v":16568.599999999995,"d":"16568.60"},{"v":16494.449999999997,"d":"16494.45"},{"v":16364.649999999994,"d":"16364.65"},{"v":16772.549999999996,"d":"16772.55"},16902.35,{"v":16976.499999999996,"d":"16976.50"},16828.2,16624.25]
[6,"Nifty PSE",2977.85,{"v":2999,"d":"2999.00"},2951.15,{"v":2924.4500000000003,"d":"2924.45"},{"v":2876.6000000000004,"d":"2876.60"},{"v":3025.7,"d":"3025.70"},3073.55,{"v":3100.2499999999995,"d":"3100.25"},3046.85,2972.3]
[7,"Nifty Midcap 50",4887.55,{"v":4910.666666666667,"d":"4910.67"},{"v":4854.883333333334,"d":"4854.88"},{"v":4822.216666666667,"d":"4822.22"},{"v":4766.433333333334,"d":"4766.43"},{"v":4943.333333333334,"d":"4943.33"},{"v":4999.116666666667,"d":"4999.12"},{"v":5031.783333333334,"d":"5031.78"},4966.45,4878]
[8,"ACC",1440.4,{"v":1442.6499999999999,"d":"1442.65"},{"v":1427.2999999999997,"d":"1427.30"},{"v":1414.1999999999998,"d":"1414.20"},{"v":1398.8499999999997,"d":"1398.85"},{"v":1455.7499999999998,"d":"1455.75"},{"v":1471.0999999999997,"d":"1471.10"},{"v":1484.1999999999998,"d":"1484.20"},1458,1429.55,5.14199]
[9,"AUBANK",1146.05,{"v":1148.1833333333332,"d":"1148.18"},{"v":1131.2166666666662,"d":"1131.22"},{"v":1116.383333333333,"d":"1116.38"},{"v":1099.416666666666,"d":"1099.42"},{"v":1163.0166666666664,"d":"1163.02"},{"v":1179.9833333333331,"d":"1179.98"},{"v":1194.8166666666666,"d":"1194.82"},1165.15,1133.35,4.21839]
[10,"ADANIPORTS",366.85,{"v":368.2833333333333,"d":"368.28"},{"v":364.5666666666666,"d":"364.57"},{"v":362.2833333333333,"d":"362.28"},{"v":358.5666666666666,"d":"358.57"},{"v":370.5666666666666,"d":"370.57"},{"v":374.2833333333333,"d":"374.28"},{"v":376.5666666666666,"d":"376.57"},372,366,29.12256]
[11,"ADANIPOWER",59.6,{"v":59.666666666666664,"d":"59.67"},{"v":58.83333333333333,"d":"58.83"},{"v":58.06666666666666,"d":"58.07"},{"v":57.23333333333333,"d":"57.23"},{"v":60.43333333333333,"d":"60.43"},{"v":61.26666666666666,"d":"61.27"},{"v":62.03333333333333,"d":"62.03"},60.5,58.9,57.54033]
{"$rows_left_out":228}
{"sheet":"MidCap Intra","index":3,"n_rows":545,"n_cols":13,"rows_kept":545,"merged":[[0,0,0,1],[8,0,9,0],[8,1,9,1],[8,2,9,2],[8,3,9,3],[8,4,8,6],[8,7,8,9]]}
[]
[]
[]
[]
[{"$nulls":11},"Back To Main Page"]
["FOR INTRA DAY TRADING",{"$nulls":9},{"$f":"Main!B10","v":"2020-02-17"}]
[null,null," "]
[]
["Sr.no","Scrip","CLOSE RATE","Pivot Point","Supports",null,null,"Resistances"]
[null,null,"Point",null,"S1","S2","S3","R1","R2","R3","HIGH","LOW","Total Trade Quanity in Lakhs"]
[1,"3MINDIA",22299.95,{"v":22468.983333333334,"d":"22468.98"},{"v":22037.966666666667,"d":"22037.97"},{"v":21775.983333333334,"d":"21775.98"},{"v":21344.966666666667,"d":"21344.97"},{"v":22730.966666666667,"d":"22730.97"},{"v":23161.983333333337,"d":"23161.98"},{"v":23423.966666666667,"d":"23423.97"},22900,22207,0.03653]
[2,"AARTIIND",1012.8,{"v":1004.8333333333334,"d":"1004.83"},{"v":984.7166666666667,"d":"984.72"},{"v":956.6333333333333,"d":"956.63"},{"v":936.5166666666667,"d":"936.52"},{"v":1032.9166666666667,"d":"1032.92"},{"v":1053.0333333333333,"d":"1053.03"},{"v":1081.1166666666668,"d":"1081.12"},1024.95,976.75,4.67116]
[3,"AAVAS",1890.25,{"v":1880.0833333333333,"d":"1880.08"},{"v":1865.1666666666665,"d":"1865.17"},{"v":1840.0833333333333,"d":"1840.08"},{"v":1825.1666666666665,"d":"1825.17"},{"v":1905.1666666666665,"d":"1905.17"},{"v":1920.083333333333,"d":"1920.08"},{"v":1945.1666666666665,"d":"1945.17"},1895,1855,0.59058]
[4,"ABBOTINDIA",14785.05,{"v":14799.883333333333,"d":"14799.88"},{"v":14710.766666666666,"d":"14710.77"},{"v":14636.483333333334,"d":"14636.48"},{"v":14547.366666666667,"d":"14547.37"},{"v":14874.166666666666,"d":"14874.17"},{"v":14963.283333333331,"d":"14963.28"},{"v":15037.566666666666,"d":"15037.57"},14889,14725.6,0.09285]
[5,"ABCAPITAL",89.85,91.05,{"v":88.3,"d":"88.30"},86.75,{"v":84,"d":"84.00"},{"v":92.6,"d":"92.60"},95.35,{"v":96.89999999999999,"d":"96.90"},93.8,89.5,17.52955]
[6,"ABFRL",265.5,{"v":268.8833333333334,"d":"268.88"},{"v":260.0666666666668,"d":"260.07"},{"v":254.63333333333338,"d":"254.63"},{"v":245.81666666666678,"d":"245.82"},{"v":274.3166666666668,"d":"274.32"},{"v":283.1333333333334,"d":"283.13"},{"v":288.5666666666668,"d":"288.57"},277.7,263.45,8.03676]
[7,"ACC",1440.4,{"v":1442.6499999999999,"d":"1442.65"},{"v":1427.2999999999997,"d":"1427.30"},{"v":1414.1999999999998,"d":"1414.20"},{"v":1398.8499999999997,"d":"1398.85"},{"v":1455.7499999999998,"d":"1455.75"},{"v":1471.0999999999997,"d":"1471.10"},{"v":1484.1999999999998,"d":"1484.20"},1458,1429.55,8.09439]
[8,"ADANIGAS",165,{"v":165.83333333333334,"d":"165.83"},{"v":163.16666666666669,"d":"163.17"},{"v":161.33333333333334,"d":"161.33"},{"v":158.66666666666669,"d":"158.67"},{"v":167.66666666666669,"d":"167.67"},{"v":170.33333333333337,"d":"170.33"},{"v":172.16666666666669,"d":"172.17"},168.5,164,5.39895]
[9,"ADANIGREEN",206.8,{"v":205.9,"d":"205.90"},{"v":201.9,"d":"201.90"},{"v":197,"d":"197.00"},{"v":193,"d":"193.00"},{"v":210.8,"d":"210.80"},{"v":214.8,"d":"214.80"},{"v":219.70000000000002,"d":"219.70"},209.9,201,14.74525]
[10,"ADANIPORTS",366.85,{"v":368.2833333333333,"d":"368.28"},{"v":364.5666666666666,"d":"364.57"},{"v":362.2833333333333,"d":"362.28"},{"v":358.5666666666666,"d":"358.57"},{"v":370.5666666666666,"d":"370.57"},{"v":374.2833333333333,"d":"374.28"},{"v":376.5666666666666,"d":"376.57"},372,366,10.12713]
{"$rows_left_out":514}
{"sheet":"Bulk Deals","index":4,"n_rows":52,"n_cols":8,"rows_kept":52,"merged":[[4,0,4,1],[4,2,4,3],[6,1,6,2]]}
[" "]
[]
[]
[]
[]
[{"$nulls":4},"Back To Main Page"]
["Subject :","BULK DEAL",null,{"$f":"Main!B10","v":"2020-02-17"}]
[]
["Date","Scrip code","Scrip Name","Client Name","Buy / Sell","Quantity Traded","Trade Price / Wt.Avg.trade price","Exchange  "]
["2020-02-14",532694,"BARTRONICS","ANSHUL KETAN KARANI","BUY",{"v":175000,"d":"175,000"},1.11,"BSE"]
["2020-02-14",542934,"CBPL","SUNNY KANTILAL SOLANKI (HUF)","BUY",{"v":96000,"d":"96,000"},51.84,"BSE"]
["2020-02-14",542934,"CBPL","FALAN TRADING CO.","BUY",{"v":96000,"d":"96,000"},51.9,"BSE"]
["2020-02-14",542934,"CBPL","SUFAL INVESTMENT","BUY",{"v":96000,"d":"96,000"},51.7,"BSE"]
["2020-02-14",542934,"CBPL","FALGUNI SUNNY FALGUNI SUNNY SOLANKI","BUY",{"v":96000,"d":"96,000"},51.8,"BSE"]
["2020-02-14",542934,"CBPL","SUNNY KANTILAL SOLANKI","BUY",{"v":96000,"d":"96,000"},51.89,"BSE"]
["2020-02-14",542934,"CBPL","ANKITKUMAR MULJIBHAI SOLANKI","BUY",{"v":96000,"d":"96,000"},51.7,"BSE"]
["2020-02-14",542934,"CBPL","ANSU INVESTMENT","BUY",{"v":192000,"d":"192,000"},51.77,"BSE"]
["2020-02-14",542934,"CBPL","JAYESH BHAGUBHAI GANDHI","SELL",{"v":48000,"d":"48,000"},51.82,"BSE"]
["2020-02-14",540743,"GODREJAGRO","VSCIENCES INVESTMENTS PTE LTD","SELL",{"v":1892369,"d":"1,892,369"},539.13,"BSE"]
["2020-02-14",540743,"GODREJAGRO","GODREJ INDUSTRIES LTD","BUY",{"v":1610000,"d":"1,610,000"},538.93,"BSE"]
{"$rows_left_out":33}
{"sheet":"Call Tracker (Equity & F&O)","index":5,"n_rows":290,"n_cols":18,"rows_kept":290,"merged":[[89,0,90,0],[89,1,90,1],[89,9,90,9],[89,11,90,11],[89,12,90,12],[89,13,90,13],[89,14,90,14],[100,0,101,0],[100,1,101,1],[100,9,101,9],[100,11,101,11],[100,12,101,12],[100,13,101,13],[100,14,101,14],[103,0,104,0],[103,1,104,1],[103,9,104,9],[103,11,104,11],[103,12,104,12],[103,13,104,13],[103,14,104,14],[105,0,106,0],[105,1,106,1],[105,9,106,9],[105,11,106,11],[105,12,106,12],[105,13,106,13],[105,14,106,14]]}
[]
[]
[]
[]
[{"$nulls":12},"Back To Main Page"]
["Retail Research Technical Calls & Fundamental Performance Report for the month of February-2020 "]
[{"$nulls":12},{"$f":"Main!B10","v":"2020-02-17"}]
[null,"Positional  Call"]
["Sr.no","Date",null,"Company","Rec","Rec Price","Stop Loss***","Call Closed At","Target","Remark","Profit / Loss per Share","Gain / Loss  %","Status","Closed Date","NSE Closed Price"]
[1,"2020-01-07",null,"ITC","Buy",237,222.2,220,"255-260","Loss of Rs.17/-",{"$f":"H10-F10","v":-17},{"$f":"K10/F10","v":{"v":-0.07172995780590717,"d":"-7.17%"}},"Unsuccessful","2020-02-01",{"$nulls":3},"R"]
[2,"2020-01-20",null,"IOC","Buy",117.5,114,117.25,130,"Loss of Rs.0.25/-",{"$f":"H11-F11","v":-0.25},{"$f":"K11/F11","v":{"v":-0.002127659574468085,"d":"-0.21%"}},"Neutral","2020-02-01",{"$nulls":3},"H"]
[3,"2020-02-03",null,"FINPIPE","Buy",552.5,518,567.5,"600-630","Profit of Rs.15/-",{"$f":"H12-F12","v":15},{"$f":"K12/F12","v":{"v":0.027149321266968326,"d":"2.71%"}},"Successful","2020-02-03",{"$nulls":3},"H"]
[4,"2020-02-03",null,"POWERGRID","Buy",183,169,190,"200-210","Profit of Rs.7/-",{"$f":"H13-F13","v":7},{"$f":"K13/F13","v":{"v":0.03825136612021858,"d":"3.83%"}},"Successful","2020-02-03",{"$nulls":3},"H"]
[5,"2020-02-04",null,"MARICO","Buy","306-308",287.8,null,"335-345","Open",{"$nulls":4},{"$f":"VLOOKUP(D14,Sheet2!A2:H1667,6,0)","v":302.2},null,null,"R"]
[6,"2020-02-04",null,"BAJAJFINSV","Sell","9500-9550",10100,null,"8500-8300","Open",{"$nulls":4},{"$f":"VLOOKUP(D15,Sheet2!A3:H1668,6,0)","v":9690.5},null,null,"H"]
[7,"2020-02-05",null,"INDHOTEL","Buy","140-141",132,null,"152-158","Open",{"$nulls":4},{"$f":"VLOOKUP(D16,Sheet2!A4:H1669,6,0)","v":134.05},null,null,"H"]
[8,"2020-02-05",null,"FINPIPE","Buy","550-554",518,null,"600-630","Open",{"$nulls":4},{"$f":"VLOOKUP(D17,Sheet2!A5:H1670,6,0)","v":539.95},null,null,"H"]
[9,"2020-02-05",null,"IOC","Buy",114,107,118,"124-128","Part Profit of Rs.4/-",{"$f":"H18-F18","v":4},{"$f":"K18/F18","v":{"v":0.03508771929824561,"d":"3.51%"}},"Successful","2020-02-10",{"$f":"VLOOKUP(D18,Sheet2!A6:H1671,6,0)","v":115.1},null,null,"H"]
[10,"2020-02-07",null,"LUPIN","Buy",700,668,721.5,"770-800","Part Profit of Rs.21.50/-",{"$f":"H19-F19","v":21.5},{"$f":"K19/F19","v":{"v":0.030714285714285715,"d":"3.07%"}},"Successful","2020-02-14",{"$f":"VLOOKUP(D19,Sheet2!A7:H1672,6,0)","v":717.65},null,null,"H"]
[11,"2020-02-10",null,"PRAJIND","Buy",105,98.7,108.5,"115-118","Part Profit of Rs.3.50/-",{"$f":"H20-F20","v":3.5},{"$f":"K20/F20","v":{"v":0.03333333333333333,"d":"3.33%"}},"Successful","2020-02-12",{"$f":"VLOOKUP(D20,Sheet2!A8:H1673,6,0)","v":103.2},null,null,"R"]
{"$rows_left_out":262}
{"sheet":"Sheet2","index":6,"n_rows":1899,"n_cols":14,"rows_kept":1899,"hidden":true}
["SYMBOL","SERIES","OPEN","HIGH","LOW","CLOSE","LAST","PREVCLOSE","TOTTRDQTY","TOTTRDVAL","TIMESTAMP","TOTALTRADES","ISIN","ISIN"]
["20MICRONS","EQ",35.95,35.95,34.7,34.8,35,35.35,16456,577198.95,"2020-02-14",250,"INE144J01027"]
["21STCENMGM","EQ",13.3,13.3,13.15,13.15,13.15,13.4,3,39.6,"2020-02-14",3,"INE253B01015"]
["3IINFOTECH","EQ",2.15,2.2,2.05,2.05,2.1,2.15,2015031,4249789.4,"2020-02-14",809,"INE748C01020"]
["3MINDIA","EQ",22760,22900,22207,22299.95,22260.7,22678.4,3653,82589056.35,"2020-02-14",1114,"INE470A01017"]
["3PLAND","EQ",5.2,5.2,5.2,5.2,5.2,5.4,5,26,"2020-02-14",1,"INE105C01023"]
["5PAISA","EQ",185.65,188,183,185.15,185,182.1,8560,1582458.45,"2020-02-14",272,"INE618L01018"]
["63MOONS","EQ",103,106.6,101.85,102.45,103,102.5,150900,15707429.85,"2020-02-14",3337,"INE111B01023"]
["A2ZINFRA","EQ",5.55,5.6,5.25,5.45,5.5,5.55,205224,1112511.65,"2020-02-14",369,"INE619I01012"]
["AARTIDRUGS","EQ",622.95,679.9,621.2,654.05,653,625.4,123975,81544353.55,"2020-02-14",7556,"INE767A01016"]
["AARTIIND","EQ",977,1024.95,976.75,1012.8,1003,970.95,467116,471714525.55,"2020-02-14",31471,"INE769A01020"]
["AARVEEDEN","EQ",14.5,14.5,13,13.3,13.55,14,19057,256867.9,"2020-02-14",173,"INE273D01019"]
["AAVAS","EQ",1875,1895,1855,1890.25,1894,1870.45,59058,110858484.3,"2020-02-14",3787,"INE216P01012"]
["ABAN","EQ",24.5,24.75,23.05,23.25,23.2,24.15,40887,977006.7,"2020-02-14",538,"INE421A01028"]
["ABB","EQ",1268.85,1280,1229.35,1233.1,1230,1268.65,56198,69930691.45,"2020-02-14",4186,"INE117A01022"]
["ABBOTINDIA","EQ",14790,14889,14725.6,14785.05,14756,14794.1,9285,137545283.85,"2020-02-14",3440,"INE358A01014"]
["ABCAPITAL","EQ",92.5,93.8,89.5,89.85,89.9,92.3,1752955,160232301.9,"2020-02-14",13385,"INE674K01013"]
["ABFRL","EQ",275.8,277.7,263.45,265.5,264.5,275.95,803676,215862243.85,"2020-02-14",13646,"INE647O01011"]
["ABSLBANETF","EQ",310,310,310,310,310,310.23,269,83390,"2020-02-14",2,"INF209KB1O58"]
["ABSLNN50ET","EQ",289.15,289.15,288.24,288.7,288.7,290.79,63,18174.14,"2020-02-14",4,"INF209KB1B87"]
{"$rows_left_out":1697}
{"sheet":"Sheet1","index":7,"n_rows":0,"n_cols":0,"rows_kept":0,"hidden":true}

{"sheet":"Sheet3","index":8,"n_rows":0,"n_cols":0,"rows_kept":0,"hidden":true}

{"sheet":"Sheet4","index":9,"n_rows":0,"n_cols":0,"rows_kept":0,"hidden":true}

{"sheet":"Sheet5","index":10,"n_rows":0,"n_cols":0,"rows_kept":0,"hidden":true}