{"text_format":"3","workbook":"xlsx","n_sheets":11,"sheets":["Main","Future Intra","Cash Intra","MidCap Intra","Bulk Deals","Call Tracker (Equity & F&O)","Sheet2","Sheet1","Sheet3","Sheet4","Sheet5"],"not_rendered":{"images":4,"defined_names":5},"read":"whole","date_system":"1900"}

{"sheet":"Main","index":0,"n_rows":27,"n_cols":11,"rows_kept":27}
[null,"                                                                                                 "]
{"$rows_empty":8}
[null,"2019-10-16"]
[]
[null,"Sheet No.","Template Name","Summary"]
[null,1,"Future Intra","For Intraday trading in F&O segment"]
[null,2,"Cash Intra","For Intraday trading in cash market segment"]
[null,3,"Mid-cap Intra","For Intraday trading in Mid-cap stocks"]
[null,4,"Bulk Deals","Reveals Bulk Deals carried on NSE & BSE"]
[null,5,"Call Tracker"]
{"$rows_empty":9}
[{"$nulls":10},"`"]

{"sheet":"Future Intra","index":1,"n_rows":193,"n_cols":15,"rows_kept":193,"merged":[[8,0,9,0],[8,1,9,1],[8,2,9,2],[8,5,8,7],[8,8,8,10]]}
[]
[]
[]
[]
[{"$nulls":12},"Back to Main Page"]
["FOR INTRA DAY TRADING",{"$nulls":10},{"$f":"Main!B10","v":"2019-10-16"}]
[]
[]
["Sr.no","Sector","Scrip","CLOSE RATE","Pivot Point","Supports",null,null,"Resistances"]
[null,"Sector",null,"Point","Point","S1","S2","S3","R1","R2","R3","HIGH","LOW","OI","% Change in OI"]
[1,"Index","BANKNIFTY",28618.65,{"v":28548.216666666664,"d":"28548.22"},{"v":28321.433333333327,"d":"28321.43"},{"v":28024.216666666664,"d":"28024.22"},{"v":27797.433333333327,"d":"27797.43"},{"v":28845.433333333327,"d":"28845.43"},{"v":29072.21666666666,"d":"29072.22"},{"v":29369.433333333327,"d":"29369.43"},28775,28251,1604420,{"v":-1.8911823622360744E-3,"d":"-0.19%"}]
[2,"Index","NIFTY",{"v":11439.4,"d":"11439.40"},{"v":11420.949999999999,"d":"11420.95"},{"v":11368.449999999997,"d":"11368.45"},{"v":11297.499999999998,"d":"11297.50"},{"v":11244.999999999996,"d":"11245.00"},{"v":11491.899999999998,"d":"11491.90"},{"v":11544.400000000001,"d":"11544.40"},{"v":11615.349999999999,"d":"11615.35"},11473.45,11350,16167675,{"v":0.03208740490359894,"d":"3.21%"}]
[3,"Index","NIFTYIT",{"v":15113,"d":"15113.00"},{"v":15129,"d":"15129.00"},{"v":15058,"d":"15058.00"},{"v":15003,"d":"15003.00"},{"v":14932,"d":"14932.00"},{"v":15184,"d":"15184.00"},{"v":15255,"d":"15255.00"},{"v":15310,"d":"15310.00"},15200,15074,13550,{"v":-0.045774647887323945,"d":"-4.58%"}]
[4,"Cement","ACC",1501.95,{"v":1491.1833333333334,"d":"1491.18"},{"v":1472.4166666666667,"d":"1472.42"},{"v":1442.8833333333334,"d":"1442.88"},{"v":1424.1166666666668,"d":"1424.12"},{"v":1520.7166666666667,"d":"1520.72"},{"v":1539.4833333333331,"d":"1539.48"},{"v":1569.0166666666667,"d":"1569.02"},1509.95,1461.65,2436800,{"v":0.06187903085236186,"d":"6.19%"}]
[5,"Others","ADANIENT",155.65,{"v":153.01666666666668,"d":"153.02"},{"v":149.63333333333335,"d":"149.63"},{"v":143.61666666666667,"d":"143.62"},{"v":140.23333333333335,"d":"140.23"},{"v":159.03333333333336,"d":"159.03"},{"v":162.41666666666669,"d":"162.42"},{"v":168.43333333333337,"d":"168.43"},156.4,147,29348000,{"v":0.06164086239328607,"d":"6.16%"}]
[6,"Others","ADANIPORTS",{"v":414.1,"d":"414.10"},{"v":412.6333333333334,"d":"412.63"},{"v":410.46666666666675,"d":"410.47"},{"v":406.83333333333337,"d":"406.83"},{"v":404.66666666666674,"d":"404.67"},{"v":416.26666666666677,"d":"416.27"},{"v":418.4333333333334,"d":"418.43"},{"v":422.0666666666668,"d":"422.07"},414.8,409,11720000,{"v":-0.013052631578947368,"d":"-1.31%"}]
[7,"Power","ADANIPOWER",61.85,{"v":61.6,"d":"61.60"},{"v":61,"d":"61.00"},60.15,59.55,62.45,{"v":63.05000000000001,"d":"63.05"},{"v":63.900000000000006,"d":"63.90"},62.2,60.75,88340000,{"v":-0.016477399242930305,"d":"-1.65%"}]
[8,"Automobile","AMARAJABAT",680.55,{"v":674.6666666666666,"d":"674.67"},{"v":653.8333333333333,"d":"653.83"},{"v":627.1166666666667,"d":"627.12"},{"v":606.2833333333333,"d":"606.28"},{"v":701.3833333333332,"d":"701.38"},{"v":722.2166666666665,"d":"722.22"},{"v":748.9333333333332,"d":"748.93"},695.5,647.95,1605100,{"v":0.006584723441615452,"d":"0.66%"}]
[9,"Cement","AMBUJACEM",{"v":197.7,"d":"197.70"},{"v":196.80000000000004,"d":"196.80"},{"v":194.95000000000007,"d":"194.95"},{"v":192.20000000000005,"d":"192.20"},{"v":190.35000000000008,"d":"190.35"},{"v":199.55000000000007,"d":"199.55"},{"v":201.40000000000003,"d":"201.40"},{"v":204.15000000000006,"d":"204.15"},198.65,194.05,23907500,{"v":-0.0205858254813601,"d":"-2.06%"}]
[10,"Others","APOLLOHOSP",{"v":1487,"d":"1487.00"},{"v":1480,"d":"1480.00"},{"v":1469,"d":"1469.00"},{"v":1451,"d":"1451.00"},{"v":1440,"d":"1440.00"},{"v":1498,"d":"1498.00"},{"v":1509,"d":"1509.00"},{"v":1527,"d":"1527.00"},1491,1462,1327500,{"v":-0.01920945696342815,"d":"-1.92%"}]
{"$rows_left_out":160}
{"sheet":"Cash Intra","index":2,"n_rows":247,"n_cols":13,"rows_kept":247,"merged":[[7,0,8,0],[7,1,8,1],[7,2,8,2],[7,3,8,3],[7,4,7,6],[7,7,7,9]]}
[]
[]
[]
[]
[{"$nulls":12},"Back to Main Page"]
["FOR INTRA DAY TRADING",{"$nulls":9},{"$f":"Main!B10","v":"2019-10-16"}]
[]
["Sr.no","Scrip","CLOSE RATE","Pivot Point","Supports",null,null,"Resistances"]
[null,null,"Point",null,"S1","S2","S3","R1","R2","R3","HIGH","LOW","Total Trade Quanity in Lakhs"]
[1,"Nifty 50",11428.3,{"v":11410.916666666666,"d":"11410.92"},{"v":11359.483333333332,"d":"11359.48"},{"v":11290.666666666666,"d":"11290.67"},{"v":11239.233333333332,"d":"11239.23"},{"v":11479.733333333332,"d":"11479.73"},{"v":11531.166666666666,"d":"11531.17"},{"v":11599.983333333332,"d":"11599.98"},11462.35,11342.1]
[2,"Nifty Bank",28555.1,{"v":28478.733333333334,"d":"28478.73"},{"v":28262.61666666667,"d":"28262.62"},{"v":27970.133333333335,"d":"27970.13"},{"v":27754.01666666667,"d":"27754.02"},{"v":28771.216666666667,"d":"28771.22"},{"v":28987.33333333333,"d":"28987.33"},{"v":29279.816666666666,"d":"29279.82"},28694.85,28186.25]
[3,"Nifty CPSE",1968.6,{"v":1961.3999999999999,"d":"1961.40"},{"v":1950.3999999999996,"d":"1950.40"},{"v":1932.1999999999998,"d":"1932.20"},{"v":1921.1999999999996,"d":"1921.20"},{"v":1979.5999999999997,"d":"1979.60"},{"v":1990.6000000000001,"d":"1990.60"},{"v":2008.7999999999997,"d":"2008.80"},1972.4,1943.2]
[4,"Nifty Infra",3222.35,{"v":3218.033333333333,"d":"3218.03"},{"v":3206.616666666666,"d":"3206.62"},{"v":3190.883333333333,"d":"3190.88"},{"v":3179.4666666666662,"d":"3179.47"},{"v":3233.7666666666655,"d":"3233.77"},{"v":3245.1833333333325,"d":"3245.18"},{"v":3260.916666666665,"d":"3260.92"},3229.45,3202.3]
[5,"Nifty IT",15208.4,{"v":15226.966666666665,"d":"15226.97"},{"v":15172.48333333333,"d":"15172.48"},{"v":15136.566666666664,"d":"15136.57"},{"v":15082.083333333328,"d":"15082.08"},{"v":15262.883333333331,"d":"15262.88"},{"v":15317.366666666665,"d":"15317.37"},{"v":15353.283333333333,"d":"15353.28"},15281.45,15191.05]
[6,"Nifty PSE",3264.85,3253.85,{"v":3238.7,"d":"3238.70"},{"v":3212.5499999999997,"d":"3212.55"},{"v":3197.3999999999996,"d":"3197.40"},{"v":3280,"d":"3280.00"},{"v":3295.1500000000005,"d":"3295.15"},{"v":3321.3,"d":"3321.30"},3269,3227.7]
[7,"Nifty Midcap 50",4290.65,{"v":4278.599999999999,"d":"4278.60"},{"v":4256.249999999999,"d":"4256.25"},{"v":4221.849999999999,"d":"4221.85"},{"v":4199.499999999999,"d":"4199.50"},{"v":4312.999999999999,"d":"4313.00"},{"v":4335.349999999999,"d":"4335.35"},{"v":4369.749999999999,"d":"4369.75"},4300.95,4244.2]
[8,"ACC",1498.05,{"v":1488.1166666666668,"d":"1488.12"},{"v":1471.2333333333336,"d":"1471.23"},{"v":1444.4166666666667,"d":"1444.42"},{"v":1427.5333333333335,"d":"1427.53"},{"v":1514.9333333333336,"d":"1514.93"},{"v":1531.8166666666668,"d":"1531.82"},{"v":1558.6333333333337,"d":"1558.63"},1505,1461.3,17.02459]
[9,"AUBANK",643.55,645.85,{"v":638.7,"d":"638.70"},633.85,{"v":626.7,"d":"626.70"},{"v":650.7,"d":"650.70"},{"v":657.8499999999999,"d":"657.85"},{"v":662.7,"d":"662.70"},653,641,3.32462]
[10,"ADANIPORTS",413.75,{"v":411.90000000000003,"d":"411.90"},{"v":409.30000000000007,"d":"409.30"},404.85,{"v":402.25000000000006,"d":"402.25"},{"v":416.3500000000001,"d":"416.35"},{"v":418.9500000000001,"d":"418.95"},{"v":423.4000000000001,"d":"423.40"},414.5,407.45,24.34978]
[11,"ADANIPOWER",61.9,61.75,61.15,{"v":60.4,"d":"60.40"},{"v":59.8,"d":"59.80"},{"v":62.5,"d":"62.50"},{"v":63.099999999999994,"d":"63.10"},63.85,62.35,61,66.91019]
{"$rows_left_out":228}
{"sheet":"MidCap Intra","index":3,"n_rows":545,"n_cols":13,"rows_kept":545,"merged":[[0,0,0,1],[8,0,9,0],[8,1,9,1],[8,2,9,2],[8,3,9,3],[8,4,8,6],[8,7,8,9]]}
[]
[]
[]
[]
[{"$nulls":11},"Back To Main Page"]
["FOR INTRA DAY TRADING",{"$nulls":9},{"$f":"Main!B10","v":"2019-10-16"}]
[null,null," "]
[]
["Sr.no","Scrip","CLOSE RATE","Pivot Point","Supports",null,null,"Resistances"]
[null,null,"Point",null,"S1","S2","S3","R1","R2","R3","HIGH","LOW","Total Trade Quanity in Lakhs"]
[1,"3MINDIA",20267.65,{"v":20189.883333333335,"d":"20189.88"},{"v":20009.76666666667,"d":"20009.77"},{"v":19751.883333333335,"d":"19751.88"},{"v":19571.76666666667,"d":"19571.77"},{"v":20447.76666666667,"d":"20447.77"},{"v":20627.88333333333,"d":"20627.88"},{"v":20885.76666666667,"d":"20885.77"},20370,19932,0.03337]
[2,"ACC",1498.05,{"v":1488.1166666666668,"d":"1488.12"},{"v":1471.2333333333336,"d":"1471.23"},{"v":1444.4166666666667,"d":"1444.42"},{"v":1427.5333333333335,"d":"1427.53"},{"v":1514.9333333333336,"d":"1514.93"},{"v":1531.8166666666668,"d":"1531.82"},{"v":1558.6333333333337,"d":"1558.63"},1505,1461.3,17.02459]
[3,"AIAENG",1714.55,{"v":1712.2833333333335,"d":"1712.28"},{"v":1688.316666666667,"d":"1688.32"},{"v":1662.0833333333335,"d":"1662.08"},{"v":1638.116666666667,"d":"1638.12"},{"v":1738.516666666667,"d":"1738.52"},{"v":1762.4833333333338,"d":"1762.48"},{"v":1788.7166666666672,"d":"1788.72"},1736.25,1686.05,0.07453]
[4,"APLAPOLLO",1391.9,{"v":1380.9666666666665,"d":"1380.97"},{"v":1366.933333333333,"d":"1366.93"},{"v":1341.9666666666665,"d":"1341.97"},{"v":1327.933333333333,"d":"1327.93"},{"v":1405.933333333333,"d":"1405.93"},{"v":1419.9666666666662,"d":"1419.97"},{"v":1444.933333333333,"d":"1444.93"},1395,1356,0.18604]
[5,"AUBANK",643.55,645.85,{"v":638.7,"d":"638.70"},633.85,{"v":626.7,"d":"626.70"},{"v":650.7,"d":"650.70"},{"v":657.8499999999999,"d":"657.85"},{"v":662.7,"d":"662.70"},653,641,3.32462]
[6,"AAVAS",1673.95,1678.75,{"v":1657.5,"d":"1657.50"},1641.05,{"v":1619.8,"d":"1619.80"},{"v":1695.2,"d":"1695.20"},1716.45,{"v":1732.9,"d":"1732.90"},1700,1662.3,0.09038]
[7,"ABBOTINDIA",10917.9,{"v":10902.633333333333,"d":"10902.63"},{"v":10780.266666666666,"d":"10780.27"},{"v":10642.633333333333,"d":"10642.63"},{"v":10520.266666666666,"d":"10520.27"},{"v":11040.266666666666,"d":"11040.27"},{"v":11162.633333333331,"d":"11162.63"},{"v":11300.266666666666,"d":"11300.27"},11025,10765,0.12639]
[8,"ADANIGAS",151.55,{"v":152.45000000000002,"d":"152.45"},{"v":149.20000000000005,"d":"149.20"},{"v":146.85000000000002,"d":"146.85"},{"v":143.60000000000005,"d":"143.60"},{"v":154.80000000000004,"d":"154.80"},{"v":158.04999999999998,"d":"158.05"},{"v":160.40000000000003,"d":"160.40"},155.7,150.1,18.19063]
[9,"ADANIGREEN",79.95,{"v":79.63333333333334,"d":"79.63"},{"v":78.06666666666668,"d":"78.07"},{"v":76.18333333333334,"d":"76.18"},{"v":74.61666666666667,"d":"74.62"},{"v":81.51666666666668,"d":"81.52"},{"v":83.08333333333334,"d":"83.08"},{"v":84.96666666666668,"d":"84.97"},81.2,77.75,27.19906]
[10,"ADANIPORTS",413.75,{"v":411.90000000000003,"d":"411.90"},{"v":409.30000000000007,"d":"409.30"},404.85,{"v":402.25000000000006,"d":"402.25"},{"v":416.3500000000001,"d":"416.35"},{"v":418.9500000000001,"d":"418.95"},{"v":423.4000000000001,"d":"423.40"},414.5,407.45,24.34978]
{"$rows_left_out":513}
{"sheet":"Bulk Deals","index":4,"n_rows":86,"n_cols":8,"rows_kept":86,"merged":[[4,0,4,1],[4,2,4,3],[6,1,6,2]]}
[" "]
[]
[]
[]
[]
[{"$nulls":4},"Back To Main Page"]
["Subject :","BULK DEAL",null,{"$f":"Main!B10","v":"2019-10-16"}]
[]
["Date","Scrip code","Scrip Name","Client Name","Buy / Sell","Quantity Traded","Trade Price / Wt.Avg.trade price","Exchange  "]
["2019-10-15",542721,"ARL","BHANSALI MAFATLAL KALIDAS(HUF)","SELL",{"v":76000,"d":"76,000"},{"v":34.3,"d":"34.30"},"BSE"]
["2019-10-15",533229,"BAJAJCON","NATWEST BANK PLC AS TRUSTEE OF THE JUPITER INDIA FUND","BUY",{"v":2323000,"d":"2,323,000"},{"v":193,"d":"193.00"},"BSE"]
["2019-10-15",533229,"BAJAJCON","BIRLA SUNLIFE TRUSTEE COMPMAY PVT LTD A/C BIRLA LONG TERM ADVANTAGE FUND - SERIES -1","BUY",{"v":1300000,"d":"1,300,000"},195,"BSE"]
["2019-10-15",533229,"BAJAJCON","ADITYA BIRLA SUN LIFE MUTUAL FUND","BUY",{"v":2600000,"d":"2,600,000"},195,"BSE"]
["2019-10-15",533229,"BAJAJCON","ICICI PRUDENTIAL MUTUAL FUND -","BUY",{"v":1011110,"d":"1,011,110"},195,"BSE"]
["2019-10-15",533229,"BAJAJCON","ICICI PRUDENTIAL MUTUAL FUND","BUY",{"v":800000,"d":"800,000"},195,"BSE"]
["2019-10-15",533229,"BAJAJCON","ICICI PRUDENTIAL MUTUAL FUND","BUY",{"v":1011111,"d":"1,011,111"},195,"BSE"]
["2019-10-15",533229,"BAJAJCON","ICICI PRUDENTIAL MUTUAL FUND","BUY",{"v":910000,"d":"910,000"},{"v":195,"d":"195.00"},"BSE"]
["2019-10-15",533229,"BAJAJCON","HDFC MUTUAL FUND","BUY",{"v":1050000,"d":"1,050,000"},{"v":195,"d":"195.00"},"BSE"]
["2019-10-15",533229,"BAJAJCON","ICG Q LIMITED","BUY",{"v":1800000,"d":"1,800,000"},{"v":193,"d":"193.00"},"BSE"]
["2019-10-15",533229,"BAJAJCON","STEINBERG INDIA EMERGING OPPORTUNITIES FUND LIMITED","BUY",{"v":2315000,"d":"2,315,000"},195,"BSE"]
{"$rows_left_out":67}
{"sheet":"Call Tracker (Equity & F&O)","index":5,"n_rows":301,"n_cols":18,"rows_kept":301,"merged":[[96,0,97,0],[96,1,97,1],[96,9,97,9],[96,11,97,11],[96,12,97,12],[96,13,97,13],[96,14,97,14],[98,0,99,0],[98,1,99,1],[98,9,99,9],[98,11,99,11],[98,12,99,12],[98,13,99,13],[98,14,99,14],[100,0,101,0],[100,1,101,1],[100,9,101,9],[100,11,101,11],[100,12,101,12],[100,13,101,13],[100,14,101,14],[102,0,103,0],[102,1,103,1],[102,9,103,9],[102,11,103,11],[102,12,103,12],[102,13,103,13],[102,14,103,14],[104,0,105,0],[104,1,105,1],[104,9,105,9],[104,11,105,11],[104,12,105,12],[104,13,105,13],[104,14,105,14],[106,0,107,0],[106,1,107,1],[106,9,107,9],[106,11,107,11],[106,12,107,12],[106,13,107,13],[106,14,107,14],[115,0,116,0],[115,1,116,1],[115,9,116,9],[115,11,116,11],[115,12,116,12],[115,13,116,13],[115,14,116,14]]}
[]
[]
[]
[]
[{"$nulls":12},"Back To Main Page"]
["Retail Research Technical Calls & Fundamental Performance Report for the month of October-2019 "]
[{"$nulls":12},{"$f":"Main!B10","v":"2019-10-16"}]
[null,"Positional  Call"]
["Sr.no","Date",null,"Company","Rec","Rec Price","Stop Loss***","Call Closed At","Target","Remark","Profit / Loss per Share","Gain / Loss  %","Status","Closed Date","NSE Closed Price"]
[1,"2019-08-30",null,"BIOCON","Buy{}",229.5,214.3,242.5,"255-260","Profit of Rs.13/-",{"$f":"H10-F10","v":13},{"$f":"K10/F10","v":{"v":0.05664488017429194,"d":"5.66%"}},"Successful","2019-10-10",{"$nulls":3},"R"]
[2,"2019-09-09",null,"TORNTPHARM","Sell",1705,1808,1618,"1560-1540","Profit of Rs.87/-",{"$f":"F11-H11","v":87},{"$f":"K11/F11","v":{"v":0.05102639296187683,"d":"5.10%"}},"Successful","2019-10-01",{"$nulls":3},"R"]
[3,"2019-09-25",null,"AXISBANK","Buy","690-700",628,null,"800-820","Open",{"$nulls":4},{"$f":"VLOOKUP(D12,Sheet2!A41:M1680,6,0)","v":690.05},null,null,"H"]
[4,"2019-09-26",null,"HDFC","Buy","2065-2075",1940,null,"2250-2300","Open",{"$nulls":4},{"$f":"VLOOKUP(D13,Sheet2!A42:M1681,6,0)","v":2013.3},null,null,"H"]
[5,"2019-09-26",null,"BANKBARODA","Buy",96,89,89.5,"110-114","Loss of Rs.6.5/-",{"$f":"H14-F14","v":-6.5},{"$f":"K14/F14","v":{"v":-0.06770833333333333,"d":"-6.77%"}},"UnSuccessful","2019-10-01",{"$nulls":3},"H"]
[6,"2019-09-30",null,"BPCL","Sell",475,510,503,"420-410","Loss of Rs.28/-",{"$f":"F15-H15","v":-28},{"v":-0.05894736842105263,"d":"-5.89%"},"UnSuccessful","2019-10-03",{"$nulls":3},"H"]
[7,"2019-10-01",null,"CUMMINSIND","Buy","574-579",530,null,"640-660","Open",{"$nulls":4},{"$f":"VLOOKUP(D16,Sheet2!A46:M1685,6,0)","v":569.3},null,null,"H"]
[8,"2019-10-01",null,"UPL","Buy","592-598",564,null,"650-660","Open",{"$nulls":4},{"$f":"VLOOKUP(D17,Sheet2!A47:M1686,6,0)","v":583.1},null,null,"R"]
[9,"2019-10-03",null,"HEIDELBERG","Buy",183,169,189,"205-210","Part Profit of Rs.6/-",{"$f":"H18-F18","v":6},{"$f":"K18/F18","v":{"v":0.03278688524590164,"d":"3.28%"}},"Successful","2019-10-09",{"$f":"VLOOKUP(D18,Sheet2!A48:M1687,6,0)","v":180.9},null,null,"H"]
[10,"2019-10-03",null,"APOLLOHOSP","Buy{}",1378.5,1286,1448,"1550-1580","Profit of Rs.69.5/-",{"$f":"H19-F19","v":69.5},{"$f":"K19/F19","v":{"v":0.050417120058034094,"d":"5.04%"}},"Successful","2019-10-11",{"$nulls":3},"R"]
[11,"2019-10-04",null,"HDFCAMC","Buy",2665,2537,2755,"2930-2960","Part Profit of Rs.90/-",{"$f":"H20-F20","v":90},{"$f":"K20/F20","v":{"v":0.03377110694183865,"d":"3.38%"}},"Successful","2019-10-07",{"$f":"VLOOKUP(D20,Sheet2!A50:M1689,6,0)","v":2705},null,null,"R"]
{"$rows_left_out":267}
{"sheet":"Sheet2","index":6,"n_rows":1899,"n_cols":14,"rows_kept":1899,"hidden":true}
["SYMBOL","SERIES","OPEN","HIGH","LOW","CLOSE","LAST","PREVCLOSE","TOTTRDQTY","TOTTRDVAL","TIMESTAMP","TOTALTRADES","ISIN","ISIN"]
["20MICRONS","EQ",38.8,38.8,37.7,38.05,38.1,38.05,14693,558584.95,"2019-10-15",156,"INE144J01027"]
["21STCENMGM","EQ",12.7,12.7,12.7,12.7,12.7,12.7,2,25.4,"2019-10-15",1,"INE253B01015"]
["3IINFOTECH","EQ",2.1,2.1,2,2,2.05,2,522318,1066589.6,"2019-10-15",353,"INE748C01020"]
["3MINDIA","EQ",19932,20370,19932,20267.65,20350,19930.5,3337,67111627.75,"2019-10-15",883,"INE470A01017"]
["3PLAND","EQ",6.25,6.25,6.2,6.2,6.2,6.2,10,62.45,"2019-10-15",2,"INE105C01023"]
["5PAISA","EQ",184.25,184.25,179.5,181.05,179.5,175.5,23706,4342571.4,"2019-10-15",544,"INE618L01018"]
["63MOONS","EQ",118.6,120.5,114.5,115.55,116,116.8,126148,14849243.05,"2019-10-15",2177,"INE111B01023"]
["A2ZINFRA","EQ",9.75,10,9.45,9.7,9.7,9.8,225906,2193449.7,"2019-10-15",575,"INE619I01012"]
["AARTIDRUGS","EQ",464.25,464.25,452.95,457.5,456.5,457.75,2971,1358210.05,"2019-10-15",358,"INE767A01016"]
["AARTIIND","EQ",771.1,775,753,758.75,753.1,770.85,76417,58347137.7,"2019-10-15",14072,"INE769A01020"]
["AARVEEDEN","EQ",14.5,15.55,14.2,14.5,14.5,14.5,2180,31353.95,"2019-10-15",84,"INE273D01019"]
["AAVAS","EQ",1700,1700,1662.3,1673.95,1674.95,1696.7,9038,15157301.6,"2019-10-15",1641,"INE216P01012"]
["ABAN","BE",25.8,26.3,25.1,25.55,25.5,25.8,17326,443486.45,"2019-10-15",216,"INE421A01028"]
["ABB","EQ",1479.9,1520,1465.65,1496.7,1515.1,1478.4,49536,73765478.65,"2019-10-15",2892,"INE117A01022"]
["ABBOTINDIA","EQ",11000,11025,10765,10917.9,10920.6,10999.6,12639,137319646.95,"2019-10-15",1951,"INE358A01014"]
["ABCAPITAL","EQ",78.4,78.5,77,77.25,77.2,77.85,729005,56595145.45,"2019-10-15",8029,"INE674K01013"]
["ABFRL","EQ",205.25,205.8,198.2,200,200,205.05,463568,93141926.8,"2019-10-15",9243,"INE647O01011"]
["ABSLNN50ET","EQ",270.09,270.09,270.09,270.09,270.09,270.49,18,4861.62,"2019-10-15",2,"INF209KB1B87"]
["ACC","EQ",1479,1505,1461.3,1498.05,1497.9,1469.35,1702459,2528377126.85,"2019-10-15",58539,"INE012A01025"]
{"$rows_left_out":1701}
{"sheet":"Sheet1","index":7,"n_rows":0,"n_cols":0,"rows_kept":0,"hidden":true}

{"sheet":"Sheet3","index":8,"n_rows":0,"n_cols":0,"rows_kept":0,"hidden":true}

{"sheet":"Sheet4","index":9,"n_rows":0,"n_cols":0,"rows_kept":0,"hidden":true}

{"sheet":"Sheet5","index":10,"n_rows":0,"n_cols":0,"rows_kept":0,"hidden":true}