{"text_format":"3","workbook":"xlsx","n_sheets":6,"sheets":["Main","Future Intra","Cash Intra","MidCap Intra","Bulk Deals","Call Tracker (Equity & F&O)"],"not_rendered":{"images":4,"defined_names":1},"read":"whole","date_system":"1900"}

{"sheet":"Main","index":0,"n_rows":27,"n_cols":11,"rows_kept":27}
[null,"                                                                                                 "]
[]
[]
[]
[]
[{"$nulls":6}," "]
[]
[]
[]
[null,"2024-08-14"]
[]
[null,"Sheet No.","Template Name","Summary"]
[null,1,"Future Intra","For Intraday trading in F&O segment"]
[null,2,"Cash Intra","For Intraday trading in cash market segment"]
[null,3,"Mid-cap Intra","For Intraday trading in Mid-cap stocks"]
[null,4,"Bulk Deals","Reveals Bulk Deals carried on NSE & BSE"]
[null,5,"Call Tracker"]
{"$rows_empty":9}
[{"$nulls":10},"`"]

{"sheet":"Future Intra","index":1,"n_rows":225,"n_cols":16,"rows_kept":225,"merged":[[8,0,9,0],[8,1,9,1],[8,2,9,2],[8,3,9,3],[8,6,8,8],[8,9,8,11]]}
[]
[]
[]
[]
[{"$nulls":12},"Back to Main Page"]
["FOR INTRA DAY TRADING",{"$nulls":10},{"$f":"Main!B10","v":"2024-08-14"}]
[]
[]
["Sr.no","Sector","Scrip","Expiry Date","CLOSE RATE","Pivot Point","Supports",null,null,"Resistances"]
[{"$nulls":4},"Point","Point","S1","S2","S3","R1","R2","R3","HIGH","LOW","OI","% Change in OI"]
[1,"Index","NIFTY","2024-08-29",{"v":24161,"d":"24161.00"},24225.45,{"v":24060.9,"d":"24060.90"},{"v":23960.8,"d":"23960.80"},23796.25,{"v":24325.550000000003,"d":"24325.55"},{"v":24490.1,"d":"24490.10"},{"v":24590.200000000004,"d":"24590.20"},24390,24125.35,13891000,{"v":0.038166113304422725,"d":"3.82%"}]
[2,"Index","BANKNIFTY","2024-08-28",{"v":50052,"d":"50052.00"},{"v":50267.93333333333,"d":"50267.93"},{"v":49789.766666666656,"d":"49789.77"},{"v":49527.533333333326,"d":"49527.53"},{"v":49049.366666666654,"d":"49049.37"},{"v":50530.16666666666,"d":"50530.17"},{"v":51008.33333333333,"d":"51008.33"},{"v":51270.56666666666,"d":"51270.57"},50746.1,50005.7,3802320,{"v":0.2138137102798368,"d":"21.38%"}]
[3,"Index","FINNIFTY","2024-08-27",{"v":22700.8,"d":"22700.80"},22810.25,22564.55,{"v":22428.3,"d":"22428.30"},{"v":22182.6,"d":"22182.60"},{"v":22946.5,"d":"22946.50"},{"v":23192.199999999997,"d":"23192.20"},23328.45,23055.95,22674,129650,{"v":0.9496240601503759,"d":"94.96%"}]
[4,"Index","MIDCPNIFTY","2024-08-26",12591.45,{"v":12621.133333333333,"d":"12621.13"},{"v":12524.666666666666,"d":"12524.67"},{"v":12457.883333333333,"d":"12457.88"},{"v":12361.416666666666,"d":"12361.42"},{"v":12687.916666666666,"d":"12687.92"},{"v":12784.383333333333,"d":"12784.38"},{"v":12851.166666666666,"d":"12851.17"},12717.6,12554.35,2330800,{"v":-0.011744753020987916,"d":"-1.17%"}]
[5,"Index","NIFTYNXT50","2024-08-30",71815.25,{"v":72095.38333333335,"d":"72095.38"},{"v":71415.8166666667,"d":"71415.82"},{"v":71016.38333333335,"d":"71016.38"},{"v":70336.8166666667,"d":"70336.82"},{"v":72494.8166666667,"d":"72494.82"},{"v":73174.38333333335,"d":"73174.38"},{"v":73573.8166666667,"d":"73573.82"},72774.95,71695.95,13220,{"v":0.08271908271908272,"d":"8.27%"}]
[6,"Chemicals","AARTIIND","2024-08-29",{"v":621.6,"d":"621.60"},{"v":652.2833333333333,"d":"652.28"},{"v":584.5666666666666,"d":"584.57"},{"v":547.5333333333333,"d":"547.53"},{"v":479.8166666666666,"d":"479.82"},{"v":689.3166666666666,"d":"689.32"},{"v":757.0333333333333,"d":"757.03"},{"v":794.0666666666666,"d":"794.07"},720,615.25,20074000,{"v":0.33773157403705184,"d":"33.77%"}]
[7,"Capital_Goods","ABB","2024-08-29",{"v":7560.1,"d":"7560.10"},{"v":7624.8,"d":"7624.80"},{"v":7471.950000000001,"d":"7471.95"},{"v":7383.8,"d":"7383.80"},{"v":7230.950000000001,"d":"7230.95"},{"v":7712.950000000001,"d":"7712.95"},{"v":7865.800000000001,"d":"7865.80"},{"v":7953.950000000001,"d":"7953.95"},7777.65,7536.65,1948875,{"v":0.033543254888962544,"d":"3.35%"}]
[8,"Pharma","ABBOTINDIA","2024-08-29",27417.05,{"v":27310.666666666668,"d":"27310.67"},{"v":27071.333333333336,"d":"27071.33"},{"v":26725.61666666667,"d":"26725.62"},{"v":26486.283333333336,"d":"26486.28"},{"v":27656.383333333335,"d":"27656.38"},{"v":27895.71666666667,"d":"27895.72"},{"v":28241.433333333334,"d":"28241.43"},27550,26964.95,151360,{"v":-0.03259619071967276,"d":"-3.26%"}]
[9,"Finance","ABCAPITAL","2024-08-29",{"v":207.2,"d":"207.20"},{"v":209.20333333333335,"d":"209.20"},{"v":203.5066666666667,"d":"203.51"},{"v":199.81333333333333,"d":"199.81"},{"v":194.11666666666667,"d":"194.12"},{"v":212.8966666666667,"d":"212.90"},{"v":218.59333333333336,"d":"218.59"},{"v":222.28666666666672,"d":"222.29"},214.9,205.51,79984800,{"v":-0.017315730113447888,"d":"-1.73%"}]
[10,"Textile","ABFRL","2024-08-29",316.35,{"v":318.34999999999997,"d":"318.35"},{"v":312.04999999999995,"d":"312.05"},307.75,301.45,{"v":322.6499999999999,"d":"322.65"},328.95,{"v":333.2499999999999,"d":"333.25"},324.65,314.05,48958000,{"v":-0.01671018276762402,"d":"-1.67%"}]
{"$rows_left_out":194}
{"sheet":"Cash Intra","index":2,"n_rows":243,"n_cols":13,"rows_kept":243,"merged":[[7,0,8,0],[7,1,8,1],[7,2,8,2],[7,3,8,3],[7,4,7,6],[7,7,7,9]]}
[]
[]
[]
[]
[{"$nulls":12},"Back to Main Page"]
["FOR INTRA DAY TRADING",{"$nulls":9},{"$f":"Main!B10","v":"2024-08-14"}]
[]
["Sr.no",null,"CLOSE RATE","Pivot Point","Supports",null,null,"Resistances"]
[{"$nulls":4},"S1","S2","S3","R1","R2","R3","HIGH","LOW","Total Trade Quanity in Lakhs"]
[1,"Nifty 50",{"v":24139,"d":"24139.00"},{"v":24205.149999999998,"d":"24205.15"},{"v":24050.349999999995,"d":"24050.35"},{"v":23961.699999999997,"d":"23961.70"},{"v":23806.899999999994,"d":"23806.90"},{"v":24293.799999999996,"d":"24293.80"},{"v":24448.6,"d":"24448.60"},{"v":24537.249999999996,"d":"24537.25"},24359.95,{"v":24116.5,"d":"24116.50"}]
[2,"Nifty Bank",49831.85,{"v":50058.73333333334,"d":"50058.73"},{"v":49558.216666666674,"d":"49558.22"},{"v":49284.583333333336,"d":"49284.58"},{"v":48784.06666666667,"d":"48784.07"},{"v":50332.366666666676,"d":"50332.37"},{"v":50832.88333333334,"d":"50832.88"},{"v":51106.51666666668,"d":"51106.52"},50559.25,{"v":49785.1,"d":"49785.10"}]
[3,"Nifty CPSE",{"v":7306.9,"d":"7306.90"},7341.75,{"v":7248.9,"d":"7248.90"},{"v":7190.9,"d":"7190.90"},{"v":7098.049999999999,"d":"7098.05"},7399.75,{"v":7492.6,"d":"7492.60"},{"v":7550.6,"d":"7550.60"},{"v":7434.6,"d":"7434.60"},7283.75]
[4,"Nifty Infra",9052.95,{"v":9081.550000000001,"d":"9081.55"},{"v":9009.250000000002,"d":"9009.25"},{"v":8965.550000000001,"d":"8965.55"},{"v":8893.250000000002,"d":"8893.25"},{"v":9125.250000000002,"d":"9125.25"},{"v":9197.550000000001,"d":"9197.55"},{"v":9241.250000000002,"d":"9241.25"},9153.85,9037.85]
[5,"Nifty IT",39114.85,39156.95,{"v":38930.59999999999,"d":"38930.60"},{"v":38746.34999999999,"d":"38746.35"},{"v":38519.999999999985,"d":"38520.00"},{"v":39341.2,"d":"39341.20"},39567.55,{"v":39751.8,"d":"39751.80"},{"v":39383.3,"d":"39383.30"},{"v":38972.7,"d":"38972.70"}]
[6,"Nifty PSE",11092.15,{"v":11154.800000000001,"d":"11154.80"},{"v":11001.600000000002,"d":"11001.60"},{"v":10911.050000000001,"d":"10911.05"},{"v":10757.850000000002,"d":"10757.85"},{"v":11245.350000000002,"d":"11245.35"},{"v":11398.550000000003,"d":"11398.55"},{"v":11489.100000000002,"d":"11489.10"},{"v":11308,"d":"11308.00"},11064.25]
[7,"Nifty Midcap 50",16055.35,{"v":16127.516666666668,"d":"16127.52"},{"v":15959.733333333337,"d":"15959.73"},{"v":15864.116666666669,"d":"15864.12"},{"v":15696.333333333338,"d":"15696.33"},{"v":16223.133333333337,"d":"16223.13"},{"v":16390.916666666664,"d":"16390.92"},{"v":16486.533333333336,"d":"16486.53"},{"v":16295.3,"d":"16295.30"},{"v":16031.9,"d":"16031.90"}]
[8,"ABB",7544.8,{"v":7619.516666666666,"d":"7619.52"},{"v":7450.283333333333,"d":"7450.28"},{"v":7355.766666666666,"d":"7355.77"},{"v":7186.533333333333,"d":"7186.53"},{"v":7714.033333333333,"d":"7714.03"},{"v":7883.266666666666,"d":"7883.27"},{"v":7977.783333333333,"d":"7977.78"},7788.75,7525,4.85092]
[9,"ACC",2304.8,{"v":2323.6833333333334,"d":"2323.68"},{"v":2281.166666666667,"d":"2281.17"},{"v":2257.5333333333338,"d":"2257.53"},{"v":2215.0166666666673,"d":"2215.02"},{"v":2347.3166666666666,"d":"2347.32"},{"v":2389.833333333333,"d":"2389.83"},{"v":2413.4666666666662,"d":"2413.47"},2366.2,2300.05,3.47684]
[10,"APLAPOLLO",1411.25,{"v":1420.0166666666664,"d":"1420.02"},{"v":1395.8333333333328,"d":"1395.83"},{"v":1380.4166666666663,"d":"1380.42"},{"v":1356.2333333333327,"d":"1356.23"},{"v":1435.433333333333,"d":"1435.43"},{"v":1459.6166666666663,"d":"1459.62"},{"v":1475.033333333333,"d":"1475.03"},1444.2,1404.6,2.17949]
[11,"AUBANK",611.95,{"v":611.4333333333334,"d":"611.43"},{"v":607.4166666666667,"d":"607.42"},{"v":602.8833333333333,"d":"602.88"},{"v":598.8666666666667,"d":"598.87"},{"v":615.9666666666668,"d":"615.97"},{"v":619.9833333333335,"d":"619.98"},{"v":624.5166666666669,"d":"624.52"},615.45,606.9,23.26446]
{"$rows_left_out":224}
{"sheet":"MidCap Intra","index":3,"n_rows":533,"n_cols":13,"rows_kept":533,"merged":[[0,0,0,1],[8,0,9,0],[8,1,9,1],[8,2,9,2],[8,3,9,3],[8,4,8,6],[8,7,8,9]]}
[]
[]
[]
[]
[{"$nulls":11},"Back To Main Page"]
["FOR INTRA DAY TRADING",{"$nulls":9},{"$f":"Main!B10","v":"2024-08-14"}]
[null,null," "]
[]
["Sr.no","Scrip","CLOSE RATE","Pivot Point","Supports",null,null,"Resistances"]
[{"$nulls":4},"S1","S2","S3","R1","R2","R3","HIGH","LOW","Total Trade Quanity in Lakhs"]
[1,"360ONE",1012.9,{"v":1026.2166666666667,"d":"1026.22"},{"v":992.4333333333334,"d":"992.43"},{"v":971.9666666666667,"d":"971.97"},{"v":938.1833333333334,"d":"938.18"},{"v":1046.6833333333334,"d":"1046.68"},{"v":1080.4666666666667,"d":"1080.47"},{"v":1100.9333333333334,"d":"1100.93"},1060,1005.75,5.75666]
[2,"3MINDIA",37000.95,{"v":37240.21666666667,"d":"37240.22"},{"v":36561.833333333336,"d":"36561.83"},{"v":36122.71666666667,"d":"36122.72"},{"v":35444.333333333336,"d":"35444.33"},{"v":37679.333333333336,"d":"37679.33"},{"v":38357.71666666667,"d":"38357.72"},{"v":38796.833333333336,"d":"38796.83"},37918.6,36801.1,0.02605]
[3,"ABB",7544.8,{"v":7619.516666666666,"d":"7619.52"},{"v":7450.283333333333,"d":"7450.28"},{"v":7355.766666666666,"d":"7355.77"},{"v":7186.533333333333,"d":"7186.53"},{"v":7714.033333333333,"d":"7714.03"},{"v":7883.266666666666,"d":"7883.27"},{"v":7977.783333333333,"d":"7977.78"},7788.75,7525,4.85092]
[4,"ACC",2304.8,{"v":2323.6833333333334,"d":"2323.68"},{"v":2281.166666666667,"d":"2281.17"},{"v":2257.5333333333338,"d":"2257.53"},{"v":2215.0166666666673,"d":"2215.02"},{"v":2347.3166666666666,"d":"2347.32"},{"v":2389.833333333333,"d":"2389.83"},{"v":2413.4666666666662,"d":"2413.47"},2366.2,2300.05,3.47684]
[5,"AIAENG",4547.2,{"v":4589.683333333333,"d":"4589.68"},{"v":4399.366666666667,"d":"4399.37"},{"v":4251.533333333334,"d":"4251.53"},{"v":4061.216666666667,"d":"4061.22"},{"v":4737.516666666666,"d":"4737.52"},{"v":4927.833333333334,"d":"4927.83"},{"v":5075.666666666666,"d":"5075.67"},4780,4441.85,4.52493]
[6,"APLAPOLLO",1411.25,{"v":1420.0166666666664,"d":"1420.02"},{"v":1395.8333333333328,"d":"1395.83"},{"v":1380.4166666666663,"d":"1380.42"},{"v":1356.2333333333327,"d":"1356.23"},{"v":1435.433333333333,"d":"1435.43"},{"v":1459.6166666666663,"d":"1459.62"},{"v":1475.033333333333,"d":"1475.03"},1444.2,1404.6,2.17949]
[7,"AUBANK",611.95,{"v":611.4333333333334,"d":"611.43"},{"v":607.4166666666667,"d":"607.42"},{"v":602.8833333333333,"d":"602.88"},{"v":598.8666666666667,"d":"598.87"},{"v":615.9666666666668,"d":"615.97"},{"v":619.9833333333335,"d":"619.98"},{"v":624.5166666666669,"d":"624.52"},615.45,606.9,23.26446]
[8,"AARTIIND",621.15,{"v":647.6333333333333,"d":"647.63"},{"v":579.2666666666667,"d":"579.27"},{"v":537.3833333333333,"d":"537.38"},{"v":469.01666666666665,"d":"469.02"},{"v":689.5166666666667,"d":"689.52"},{"v":757.8833333333332,"d":"757.88"},{"v":799.7666666666667,"d":"799.77"},716,605.75,208.52416]
[9,"AAVAS",1703.25,{"v":1713.7166666666665,"d":"1713.72"},{"v":1679.633333333333,"d":"1679.63"},{"v":1656.0166666666664,"d":"1656.02"},{"v":1621.933333333333,"d":"1621.93"},{"v":1737.333333333333,"d":"1737.33"},{"v":1771.4166666666665,"d":"1771.42"},{"v":1795.033333333333,"d":"1795.03"},1747.8,1690.1,1.8938]
[10,"ABBOTINDIA",27309.85,{"v":27224.3,"d":"27224.30"},{"v":27004.399999999998,"d":"27004.40"},{"v":26698.949999999997,"d":"26698.95"},{"v":26479.049999999996,"d":"26479.05"},27529.75,27749.65,{"v":28055.100000000002,"d":"28055.10"},27444.2,26918.85,0.1746]
{"$rows_left_out":508}
{"sheet":"Bulk Deals","index":4,"n_rows":238,"n_cols":8,"rows_kept":238,"merged":[[4,0,4,1],[4,2,4,3],[6,1,6,2]]}
[" "]
[]
[]
[]
[]
[{"$nulls":4},"Back To Main Page"]
["Subject :","BULK DEAL",null,{"$f":"Main!B10","v":"2024-08-14"}]
[]
["Date","Scrip code","Scrip Name","Client Name","Buy / Sell","Quantity Traded","Trade Price / Wt.Avg.trade price","Exchange  "]
["2024-08-13",539661,"ACEMEN","GUTTIKONDA VARA LAKSHMI","BUY",{"v":21632,"d":"21,632"},63.43,"BSE"]
["2024-08-13",544224,"AFCOM","ROHAN GUPTA","BUY",{"v":168000,"d":"168,000"},237.5,"BSE"]
["2024-08-13",544224,"AFCOM","MULTIPLIER SHARE & STOCK ADVISORS PRIVATE LIMITED","BUY",{"v":26400,"d":"26,400"},215.55,"BSE"]
["2024-08-13",544224,"AFCOM","MULTIPLIER SHARE & STOCK ADVISORS PRIVATE LIMITED","SELL",{"v":540000,"d":"540,000"},237.5,"BSE"]
["2024-08-13",544224,"AFCOM","ISHAAN TRADEFIN LLP","SELL",{"v":264000,"d":"264,000"},237.5,"BSE"]
["2024-08-13",544224,"AFCOM","ISHAAN TRADEFIN LLP","BUY",{"v":62400,"d":"62,400"},235.94,"BSE"]
["2024-08-13",544224,"AFCOM","VICTUS ENTERPRISE LLP","BUY",{"v":151200,"d":"151,200"},237.5,"BSE"]
["2024-08-13",544224,"AFCOM","STOCK VERTEX VENTURES","SELL",{"v":151200,"d":"151,200"},231.4,"BSE"]
["2024-08-13",544224,"AFCOM","MANSI SHARE & STOCK ADVISORS PRIVATE LIMITED","SELL",{"v":300000,"d":"300,000"},236.87,"BSE"]
["2024-08-13",538351,"AFEL","SHAILESH KANJIBHAI DHAMELIYA","SELL",{"v":79886,"d":"79,886"},18.97,"BSE"]
["2024-08-13",531300,"AMITINT","VIKASA GLOBAL FUND PCC - EUBILIA CAPITAL PARTNERS FUND I","BUY",{"v":107000,"d":"107,000"},3.89,"BSE"]
{"$rows_left_out":219}
{"sheet":"Call Tracker (Equity & F&O)","index":5,"n_rows":297,"n_cols":18,"rows_kept":297}
[]
[]
[]
[]
[{"$nulls":12},"Back To Main Page"]
["Retail Research Technical Calls & Fundamental Performance Report for the month of July-2024"]
[{"$nulls":12},{"$f":"Main!B10","v":"2024-08-14"}]
[null,"Positional  Call"]
["Sr.no","Date",null,"Company","Rec","Rec Price","Stop Loss***","Call Closed At","Target","Remark","Profit / Loss per Share","All charges","Net Gain / Loss  %","Status","Closed Date","Market Closing Price","Second Buying Date"]
[1,"2024-06-25",null,"HAPPSTMNDS","Accu",830,795,780,"900-950","Loss of Rs.50/-",{"$f":"H10-F10","v":-50},{"$f":"(F10*-0.3)/100","v":-2.49},{"$f":"(K10+L10)/F10","v":{"v":-0.06324096385542169,"d":"-6.32%"}},"Unsuccessful","2024-08-05",null,null,"H"]
[2,"2024-06-27",null,"BAJAJ-AUTO","Accu",9325,8900,9825,"10000-10400","Profit of Rs.500/-",{"$f":"H11-F11","v":500},{"$f":"(F11*-0.3)/100","v":{"v":-27.975,"d":"-27.98"}},{"$f":"(K11+L11)/F11","v":{"v":0.05061930294906166,"d":"5.06%"}},"Successful","2024-08-01",null,null,"H"]
[3,"2024-07-01",null,"RELIANCE","Accu",3075,2940,2900,"3300-3500","Loss of Rs.175/-",-175,{"v":-9.225,"d":"-9.23"},{"v":-0.05991056910569106,"d":"-5.99%"},"Unsuccessful","2024-08-05",null,null,"H"]
[4,"2024-07-19",null,"BAJAJFINSV","Accu",1617,1560,1555,"1720-1800","Loss of Rs.62/-",{"$f":"H13-F13","v":-62},{"$f":"(F13*-0.3)/100","v":{"v":-4.851,"d":"-4.85"}},{"$f":"(K13+L13)/F13","v":{"v":-0.0413426097711812,"d":"-4.13%"}},"Unsuccessful","2024-08-08",null,null,"H"]
[5,"2024-07-25",null,"NESTLEIND","Accu","2390-2470",2330,null,"2650-2800","Open",{"$nulls":5},{"$f":"VLOOKUP(D14,'MidCap Intra'!$B$11:$C$571,2,0)","v":{"v":2484.7,"d":"2484.70"}},null,"H"]
[6,"2024-07-26",null,"LTF","Accu",173.5,164,163.5,"195-205","Loss of Rs.10/-",{"$f":"H15-F15","v":-10},{"$f":"(F15*-0.3)/100","v":{"v":-0.5205,"d":"-0.52"}},{"$f":"(K15+L15)/F15","v":{"v":-0.060636887608069165,"d":"-6.06%"}},"Unsuccessful","2024-08-13",null,null,"H"]
[7,"2024-07-26",null,"RKFORGE","Accu",840,790,882,"900-950","Profit of Rs.42/-",{"$f":"H16-F16","v":42},{"$f":"(F16*-0.3)/100","v":-2.52},{"$f":"(K16+L16)/F16","v":{"v":0.04699999999999999,"d":"4.70%"}},"Successful","2024-08-02",null,null,"H"]
[8,"2024-07-29",null,"CARBORUNIV","Accu",1710,1645,1605,"1840-1940","Loss of Rs.105/-",-105,-5.13,{"v":-0.06440350877192982,"d":"-6.44%"},"Unsuccessful","2024-08-05",null,null,"H"]
[9,"2024-07-30",null,"LTTS","Accu","5040-5170",4800,null,"5540-5900","Open",{"$nulls":5},{"$f":"VLOOKUP(D18,'MidCap Intra'!$B$11:$C$571,2,0)","v":4823.45},null,"K"]
[10,"2024-07-30",null,"VBL","Accu",1565,1495,1490,"1700-1800","Loss of Rs.75/-",{"$f":"H19-F19","v":-75},{"$f":"(F19*-0.3)/100","v":{"v":-4.695,"d":"-4.70"}},{"$f":"(K19+L19)/F19","v":{"v":-0.050923322683706064,"d":"-5.09%"}},"Unsuccessful","2024-08-06",null,null,"H"]
[11,"2024-07-30",null,"IOC","Accu",177.5,167,167,"195-210","Loss of Rs.10.5/-",{"$f":"H20-F20","v":-10.5},{"$f":"(F20*-0.3)/100","v":{"v":-0.5325,"d":"-0.53"}},{"$f":"(K20+L20)/F20","v":{"v":-0.06215492957746479,"d":"-6.22%"}},"Unsuccessful","2024-08-06",null,null,"H"]
{"$rows_left_out":270}