{"text_format":"3","workbook":"xlsx","n_sheets":6,"sheets":["Main","Future Intra","Cash Intra","MidCap Intra","Bulk Deals","Call Tracker (Equity & F&O)"],"not_rendered":{"images":4,"defined_names":1},"read":"whole","date_system":"1900"}

{"sheet":"Main","index":0,"n_rows":27,"n_cols":11,"rows_kept":27}
[null,"                                                                                                 "]
[]
[]
[]
[]
[{"$nulls":6}," "]
[]
[]
[]
[null,"2024-03-14"]
[]
[null,"Sheet No.","Template Name","Summary"]
[null,1,"Future Intra","For Intraday trading in F&O segment"]
[null,2,"Cash Intra","For Intraday trading in cash market segment"]
[null,3,"Mid-cap Intra","For Intraday trading in Mid-cap stocks"]
[null,4,"Bulk Deals","Reveals Bulk Deals carried on NSE & BSE"]
[null,5,"Call Tracker"]
{"$rows_empty":9}
[{"$nulls":10},"`"]

{"sheet":"Future Intra","index":1,"n_rows":236,"n_cols":16,"rows_kept":236,"merged":[[8,0,9,0],[8,1,9,1],[8,2,9,2],[8,3,9,3],[8,6,8,8],[8,9,8,11]]}
[]
[]
[]
[]
[{"$nulls":12},"Back to Main Page"]
["FOR INTRA DAY TRADING",{"$nulls":10},{"$f":"Main!B10","v":"2024-03-14"}]
[]
[]
["Sr.no","Sector","Scrip","Expiry Date","CLOSE RATE","Pivot Point","Supports",null,null,"Resistances"]
[{"$nulls":4},"Point","Point","S1","S2","S3","R1","R2","R3","HIGH","LOW","OI","% Change in OI"]
[1,"Index","NIFTY","2024-03-28",22103.25,{"v":22214.416666666668,"d":"22214.42"},{"v":21913.833333333336,"d":"21913.83"},{"v":21724.416666666668,"d":"21724.42"},{"v":21423.833333333336,"d":"21423.83"},{"v":22403.833333333336,"d":"22403.83"},{"v":22704.41666666667,"d":"22704.42"},{"v":22893.833333333336,"d":"22893.83"},22515,22025,15483150,{"v":-0.009537974379887732,"d":"-0.95%"}]
[2,"Index","BANKNIFTY","2024-03-27",47081.35,{"v":47237.73333333334,"d":"47237.73"},{"v":46791.16666666667,"d":"46791.17"},{"v":46500.98333333334,"d":"46500.98"},{"v":46054.41666666667,"d":"46054.42"},{"v":47527.91666666667,"d":"47527.92"},{"v":47974.48333333334,"d":"47974.48"},{"v":48264.66666666667,"d":"48264.67"},47684.3,46947.55,5336190,{"v":0.02133706942586287,"d":"2.13%"}]
[3,"Index","FINNIFTY","2024-03-26",{"v":20795.3,"d":"20795.30"},20854.95,20697.45,{"v":20599.6,"d":"20599.60"},{"v":20442.1,"d":"20442.10"},{"v":20952.800000000003,"d":"20952.80"},{"v":21110.300000000003,"d":"21110.30"},{"v":21208.150000000005,"d":"21208.15"},21012.45,20757.1,73160,{"v":-0.08686969545681478,"d":"-8.69%"}]
[4,"Index","MIDCPNIFTY","2024-03-22",10386.35,{"v":10492.6,"d":"10492.60"},{"v":10211.1,"d":"10211.10"},10035.85,9754.35,10667.85,10949.35,{"v":11124.6,"d":"11124.60"},10774.1,10317.35,1446525,{"v":0.025140852556606783,"d":"2.51%"}]
[5,"Chemical","AARTIIND","2024-03-28",621.45,{"v":630.5666666666667,"d":"630.57"},{"v":605.0333333333334,"d":"605.03"},{"v":588.6166666666667,"d":"588.62"},{"v":563.0833333333334,"d":"563.08"},{"v":646.9833333333335,"d":"646.98"},{"v":672.5166666666668,"d":"672.52"},{"v":688.9333333333335,"d":"688.93"},656.1,614.15,13951000,{"v":-0.027398215281650866,"d":"-2.74%"}]
[6,"Capital_Goods","ABB","2024-03-28",{"v":5627.5,"d":"5627.50"},5687.75,5542.75,{"v":5458,"d":"5458.00"},{"v":5313,"d":"5313.00"},{"v":5772.5,"d":"5772.50"},{"v":5917.5,"d":"5917.50"},6002.25,5832.75,5603,1082250,{"v":-0.025438991445294913,"d":"-2.54%"}]
[7,"Pharma","ABBOTINDIA","2024-03-28",27482.25,{"v":27358.416666666668,"d":"27358.42"},{"v":27077.833333333336,"d":"27077.83"},{"v":26673.416666666668,"d":"26673.42"},{"v":26392.833333333336,"d":"26392.83"},{"v":27762.833333333336,"d":"27762.83"},{"v":28043.41666666667,"d":"28043.42"},{"v":28447.833333333336,"d":"28447.83"},27639,26954,210040,{"v":-0.007747543461829176,"d":"-0.77%"}]
[8,"Others","ABCAPITAL","2024-03-28",{"v":171.9,"d":"171.90"},{"v":175.44999999999996,"d":"175.45"},{"v":166.39999999999992,"d":"166.40"},{"v":160.89999999999995,"d":"160.90"},{"v":151.8499999999999,"d":"151.85"},{"v":180.94999999999993,"d":"180.95"},{"v":189.99999999999994,"d":"190.00"},{"v":195.49999999999994,"d":"195.50"},184.5,169.95,58606200,{"v":0.05276942477446891,"d":"5.28%"}]
[9,"Textile","ABFRL","2024-03-28",{"v":200.5,"d":"200.50"},{"v":204.98333333333335,"d":"204.98"},{"v":194.0166666666667,"d":"194.02"},{"v":187.53333333333336,"d":"187.53"},{"v":176.56666666666672,"d":"176.57"},{"v":211.4666666666667,"d":"211.47"},{"v":222.43333333333334,"d":"222.43"},{"v":228.91666666666669,"d":"228.92"},215.95,198.5,47195200,{"v":-0.0522633529995301,"d":"-5.23%"}]
[10,"Cement","ACC","2024-03-28",2400.75,{"v":2450.9166666666665,"d":"2450.92"},{"v":2316.833333333333,"d":"2316.83"},{"v":2232.9166666666665,"d":"2232.92"},{"v":2098.833333333333,"d":"2098.83"},{"v":2534.833333333333,"d":"2534.83"},{"v":2668.916666666666,"d":"2668.92"},{"v":2752.833333333333,"d":"2752.83"},2585,2367,4833600,{"v":-4.202719406674907E-3,"d":"-0.42%"}]
{"$rows_left_out":194}
{"sheet":"Cash Intra","index":2,"n_rows":245,"n_cols":13,"rows_kept":245,"merged":[[7,0,8,0],[7,1,8,1],[7,2,8,2],[7,3,8,3],[7,4,7,6],[7,7,7,9]]}
[]
[]
[]
[]
[{"$nulls":12},"Back to Main Page"]
["FOR INTRA DAY TRADING",{"$nulls":9},{"$f":"Main!B10","v":"2024-03-14"}]
[]
["Sr.no",null,"CLOSE RATE","Pivot Point","Supports",null,null,"Resistances"]
[{"$nulls":4},"S1","S2","S3","R1","R2","R3","HIGH","LOW","Total Trade Quanity in Lakhs"]
[1,"Nifty 50",{"v":21997.7,"d":"21997.70"},{"v":22116.7,"d":"22116.70"},21786.65,{"v":21575.600000000002,"d":"21575.60"},{"v":21245.550000000003,"d":"21245.55"},22327.75,{"v":22657.799999999996,"d":"22657.80"},22868.85,22446.75,21905.65]
[2,"Nifty Bank",{"v":46981.3,"d":"46981.30"},{"v":47097.38333333333,"d":"47097.38"},{"v":46726.066666666666,"d":"46726.07"},{"v":46470.833333333336,"d":"46470.83"},{"v":46099.51666666667,"d":"46099.52"},{"v":47352.61666666666,"d":"47352.62"},{"v":47723.93333333333,"d":"47723.93"},{"v":47979.16666666666,"d":"47979.17"},{"v":47468.7,"d":"47468.70"},46842.15]
[3,"Nifty CPSE",5457.45,{"v":5569.116666666666,"d":"5569.12"},{"v":5284.783333333332,"d":"5284.78"},{"v":5112.116666666666,"d":"5112.12"},{"v":4827.783333333332,"d":"4827.78"},{"v":5741.783333333332,"d":"5741.78"},{"v":6026.116666666666,"d":"6026.12"},{"v":6198.783333333332,"d":"6198.78"},5853.45,5396.45]
[4,"Nifty Infra",{"v":7916.2,"d":"7916.20"},{"v":8010.666666666667,"d":"8010.67"},{"v":7773.183333333334,"d":"7773.18"},{"v":7630.166666666667,"d":"7630.17"},{"v":7392.683333333334,"d":"7392.68"},{"v":8153.683333333334,"d":"8153.68"},{"v":8391.166666666666,"d":"8391.17"},{"v":8534.183333333334,"d":"8534.18"},8248.15,7867.65]
[5,"Nifty IT",36946.45,{"v":37064.049999999996,"d":"37064.05"},{"v":36571.49999999999,"d":"36571.50"},{"v":36196.549999999996,"d":"36196.55"},{"v":35703.99999999999,"d":"35704.00"},{"v":37438.99999999999,"d":"37439.00"},{"v":37931.549999999996,"d":"37931.55"},{"v":38306.49999999999,"d":"38306.50"},{"v":37556.6,"d":"37556.60"},{"v":36689.1,"d":"36689.10"}]
[6,"Nifty PSE",{"v":8756.4,"d":"8756.40"},{"v":8933.016666666668,"d":"8933.02"},{"v":8490.033333333336,"d":"8490.03"},{"v":8223.666666666668,"d":"8223.67"},{"v":7780.683333333336,"d":"7780.68"},{"v":9199.383333333337,"d":"9199.38"},{"v":9642.36666666667,"d":"9642.37"},{"v":9908.733333333337,"d":"9908.73"},{"v":9376,"d":"9376.00"},8666.65]
[7,"Nifty Midcap 50",13189.05,{"v":13359.583333333334,"d":"13359.58"},{"v":12921.416666666668,"d":"12921.42"},{"v":12653.783333333335,"d":"12653.78"},{"v":12215.616666666669,"d":"12215.62"},{"v":13627.216666666667,"d":"13627.22"},{"v":14065.383333333335,"d":"14065.38"},{"v":14333.016666666666,"d":"14333.02"},13797.75,13091.95]
[8,"ABB",5597.25,{"v":5659.766666666666,"d":"5659.77"},{"v":5510.1833333333325,"d":"5510.18"},{"v":5423.116666666666,"d":"5423.12"},{"v":5273.533333333332,"d":"5273.53"},{"v":5746.833333333333,"d":"5746.83"},{"v":5896.416666666667,"d":"5896.42"},{"v":5983.483333333334,"d":"5983.48"},5809.35,5572.7,4.54668]
[9,"ACC",2389.1,{"v":2439.733333333333,"d":"2439.73"},{"v":2303.816666666666,"d":"2303.82"},{"v":2218.533333333333,"d":"2218.53"},{"v":2082.616666666666,"d":"2082.62"},{"v":2525.0166666666664,"d":"2525.02"},{"v":2660.9333333333334,"d":"2660.93"},{"v":2746.2166666666667,"d":"2746.22"},2575.65,2354.45,5.12003]
[10,"APLAPOLLO",1492.45,{"v":1530.8166666666666,"d":"1530.82"},{"v":1401.6333333333332,"d":"1401.63"},{"v":1310.8166666666666,"d":"1310.82"},{"v":1181.6333333333332,"d":"1181.63"},{"v":1621.6333333333332,"d":"1621.63"},{"v":1750.8166666666666,"d":"1750.82"},{"v":1841.6333333333332,"d":"1841.63"},1660,1440,65.07913]
[11,"AUBANK",576.9,{"v":578.0833333333334,"d":"578.08"},{"v":569.7166666666667,"d":"569.72"},{"v":562.5333333333333,"d":"562.53"},{"v":554.1666666666666,"d":"554.17"},{"v":585.2666666666668,"d":"585.27"},{"v":593.6333333333333,"d":"593.63"},{"v":600.8166666666668,"d":"600.82"},586.45,570.9,46.09989]
{"$rows_left_out":226}
{"sheet":"MidCap Intra","index":3,"n_rows":530,"n_cols":13,"rows_kept":530,"merged":[[0,0,0,1],[8,0,9,0],[8,1,9,1],[8,2,9,2],[8,3,9,3],[8,4,8,6],[8,7,8,9]]}
[]
[]
[]
[]
[{"$nulls":11},"Back To Main Page"]
["FOR INTRA DAY TRADING",{"$nulls":9},{"$f":"Main!B10","v":"2024-03-14"}]
[null,null," "]
[]
["Sr.no","Scrip","CLOSE RATE","Pivot Point","Supports",null,null,"Resistances"]
[{"$nulls":4},"S1","S2","S3","R1","R2","R3","HIGH","LOW","Total Trade Quanity in Lakhs"]
[1,"360ONE",697.6,{"v":693.1666666666666,"d":"693.17"},{"v":679.1833333333333,"d":"679.18"},{"v":660.7666666666667,"d":"660.77"},{"v":646.7833333333333,"d":"646.78"},{"v":711.5833333333333,"d":"711.58"},{"v":725.5666666666666,"d":"725.57"},{"v":743.9833333333332,"d":"743.98"},707.15,674.75,4.72495]
[2,"3MINDIA",30246.55,30350.55,{"v":29801.1,"d":"29801.10"},{"v":29355.649999999998,"d":"29355.65"},{"v":28806.199999999997,"d":"28806.20"},{"v":30796,"d":"30796.00"},{"v":31345.450000000004,"d":"31345.45"},{"v":31790.9,"d":"31790.90"},30900,29905.1,0.06237]
[3,"ABB",5597.25,{"v":5659.766666666666,"d":"5659.77"},{"v":5510.1833333333325,"d":"5510.18"},{"v":5423.116666666666,"d":"5423.12"},{"v":5273.533333333332,"d":"5273.53"},{"v":5746.833333333333,"d":"5746.83"},{"v":5896.416666666667,"d":"5896.42"},{"v":5983.483333333334,"d":"5983.48"},5809.35,5572.7,4.54668]
[4,"ACC",2389.1,{"v":2439.733333333333,"d":"2439.73"},{"v":2303.816666666666,"d":"2303.82"},{"v":2218.533333333333,"d":"2218.53"},{"v":2082.616666666666,"d":"2082.62"},{"v":2525.0166666666664,"d":"2525.02"},{"v":2660.9333333333334,"d":"2660.93"},{"v":2746.2166666666667,"d":"2746.22"},2575.65,2354.45,5.12003]
[5,"AIAENG",3629.85,{"v":3625.633333333333,"d":"3625.63"},{"v":3558.3166666666666,"d":"3558.32"},{"v":3486.7833333333333,"d":"3486.78"},{"v":3419.4666666666667,"d":"3419.47"},{"v":3697.1666666666665,"d":"3697.17"},{"v":3764.483333333333,"d":"3764.48"},{"v":3836.0166666666664,"d":"3836.02"},3692.95,3554.1,0.47161]
[6,"APLAPOLLO",1492.45,{"v":1530.8166666666666,"d":"1530.82"},{"v":1401.6333333333332,"d":"1401.63"},{"v":1310.8166666666666,"d":"1310.82"},{"v":1181.6333333333332,"d":"1181.63"},{"v":1621.6333333333332,"d":"1621.63"},{"v":1750.8166666666666,"d":"1750.82"},{"v":1841.6333333333332,"d":"1841.63"},1660,1440,65.07913]
[7,"AUBANK",576.9,{"v":578.0833333333334,"d":"578.08"},{"v":569.7166666666667,"d":"569.72"},{"v":562.5333333333333,"d":"562.53"},{"v":554.1666666666666,"d":"554.17"},{"v":585.2666666666668,"d":"585.27"},{"v":593.6333333333333,"d":"593.63"},{"v":600.8166666666668,"d":"600.82"},586.45,570.9,46.09989]
[8,"AARTIDRUGS",451.75,{"v":451.9833333333333,"d":"451.98"},{"v":440.1666666666666,"d":"440.17"},{"v":428.58333333333326,"d":"428.58"},{"v":416.76666666666654,"d":"416.77"},{"v":463.5666666666666,"d":"463.57"},{"v":475.3833333333333,"d":"475.38"},{"v":486.96666666666664,"d":"486.97"},463.8,440.4,2.5998]
[9,"AARTIIND",619.9,{"v":628.0666666666667,"d":"628.07"},{"v":602.6333333333334,"d":"602.63"},{"v":585.3666666666667,"d":"585.37"},{"v":559.9333333333334,"d":"559.93"},{"v":645.3333333333335,"d":"645.33"},{"v":670.7666666666667,"d":"670.77"},{"v":688.0333333333335,"d":"688.03"},653.5,610.8,17.01165]
[10,"AAVAS",1339.65,{"v":1354.7,"d":"1354.70"},1315.95,1292.25,{"v":1253.5,"d":"1253.50"},{"v":1378.4,"d":"1378.40"},1417.15,{"v":1440.8500000000001,"d":"1440.85"},1393.45,1331,2.09892]
{"$rows_left_out":511}
{"sheet":"Bulk Deals","index":4,"n_rows":130,"n_cols":8,"rows_kept":130,"merged":[[4,0,4,1],[4,2,4,3],[6,1,6,2]]}
[" "]
[]
[]
[]
[]
[{"$nulls":4},"Back To Main Page"]
["Subject :","BULK DEAL",null,{"$f":"Main!B10","v":"2024-03-14"}]
[]
["Date","Scrip code","Scrip Name","Client Name","Buy / Sell","Quantity Traded","Trade Price / Wt.Avg.trade price","Exchange  "]
["2024-03-13",539528,"AAYUSH","MULTIPLIER SHARE & STOCK ADVISORS PRIVATE LIMITED","SELL",{"v":22508,"d":"22,508"},144.3,"BSE"]
["2024-03-13",539528,"AAYUSH","AVANCE VENTURES PRIVATE LIMITED","BUY",{"v":50000,"d":"50,000"},147.15,"BSE"]
["2024-03-13",513119,"ABCGAS","ROHITH SATISH SHOREWALA","SELL",{"v":12006,"d":"12,006"},58,"BSE"]
["2024-03-13",513119,"ABCGAS","ARJUN LEASING AND FINANCE PVT LTD .","BUY",{"v":12550,"d":"12,550"},57.96,"BSE"]
["2024-03-13",539661,"ACEMEN","ECV VENTURES PRIVATE LIMITED","BUY",{"v":17266,"d":"17,266"},43.73,"BSE"]
["2024-03-13",544101,"BRISK","PRAVEENMUDUNURI","SELL",{"v":16800,"d":"16,800"},149.19,"BSE"]
["2024-03-13",544101,"BRISK","RAJESH ARJUN DHARIRA","BUY",{"v":21600,"d":"21,600"},149.66,"BSE"]
["2024-03-13",542866,"COLABCLOUD","AVANCE VENTURES PRIVATE LIMITED","BUY",{"v":55000,"d":"55,000"},189.19,"BSE"]
["2024-03-13",531460,"CONTICON","PARESH DHIRAJLAL SHAH","BUY",{"v":52692,"d":"52,692"},7.74,"BSE"]
["2024-03-13",539596,"DELTA","MULTIPLIER SHARE & STOCK ADVISORS PRIVATE LIMITED","BUY",{"v":40000,"d":"40,000"},29.96,"BSE"]
["2024-03-13",539596,"DELTA","MULTIPLIER SHARE & STOCK ADVISORS PRIVATE LIMITED","SELL",285,29.96,"BSE"]
{"$rows_left_out":111}
{"sheet":"Call Tracker (Equity & F&O)","index":5,"n_rows":313,"n_cols":19,"rows_kept":313,"merged":[[66,0,67,0],[66,1,67,1],[66,9,67,9],[66,12,67,12],[66,14,67,14],[66,15,67,15],[71,0,72,0],[71,1,72,1],[71,9,72,9],[71,12,72,12],[71,14,72,14],[71,15,72,15],[75,0,76,0],[75,1,76,1],[75,9,76,9],[75,12,76,12],[75,14,76,14],[75,15,76,15],[81,0,82,0],[81,1,82,1],[81,9,82,9],[81,12,82,12],[81,14,82,14],[81,15,82,15]]}
[]
[]
[]
[]
[{"$nulls":12},"Back To Main Page"]
["Retail Research Technical Calls & Fundamental Performance Report for the month of March-2024"]
[{"$nulls":12},{"$f":"Main!B10","v":"2024-03-14"}]
[null,"Positional  Call"]
["Sr.no","Date",null,"Company","Rec","Rec Price","Stop Loss***","Call Closed At","Target","Remark","Profit / Loss per Share","All charges","Net Gain / Loss  %","Status","Closed Date","Market Closing Price","Second Buying Date"]
[1,"2024-01-30",null,"RELIANCE","Accu",2870,2640,3024,"3100-3200","Profit of Rs.154/-",{"$f":"H10-F10","v":154},{"$f":"(F10*-0.3)/100","v":-8.61},{"$f":"(K10+L10)/F10","v":{"v":0.05065853658536585,"d":"5.07%"}},"Successful","2024-03-04",{"$nulls":3},"H"]
[2,"2024-02-06",null,"CARBORUNIV","Accu","1065-1105",1030,null,"1200-1280","Open",{"$nulls":5},{"$f":"VLOOKUP(D11,'MidCap Intra'!$B$11:$C$568,2,0)","v":1060.85},null,null,"H"]
[3,"2024-02-08",null,"LTIM","Accu","5200-5400",4990,null,"5750-6050","Open",{"$nulls":5},{"$f":"VLOOKUP(D12,'MidCap Intra'!$B$11:$C$568,2,0)","v":{"v":5195,"d":"5195.00"}},null,null,"H"]
[4,"2024-02-09",null,"HDFCBANK","Accu",1400,1290,1470,"1500-1600","Profit of Rs.70/-",{"$f":"H13-F13","v":70},{"$f":"(F13*-0.3)/100","v":{"v":-4.2,"d":"-4.20"}},{"$f":"(K13+L13)/F13","v":{"v":0.047,"d":"4.70%"}},"Successful","2024-03-13",{"$nulls":3},"H"]
[5,"2024-02-16",null,"ARE&M","Accu",853,805,805,"920-960","Loss of Rs.48/-",-48,{"v":-2.5589999999999997,"d":"-2.56"},{"v":-0.05927198124267292,"d":"-5.93%"},"Unsuccessful","2024-03-13",{"$nulls":3},"K"]
[6,"2024-02-21",null,"IBULHSGFIN","Accu",180,164,168,"215-230","Loss of Rs.12/-",{"$f":"H15-F15","v":-12},{"$f":"(F15*-0.3)/100","v":-0.54},{"$f":"(K15+L15)/F15","v":{"v":-0.06966666666666667,"d":"-6.97%"}},"Unsuccessful","2024-03-13",{"$nulls":3},"H"]
[7,"2024-02-23",null,"CAPACITE","Accu",258.75,238,238,"300-330","Loss of Rs.20.75/-",{"$f":"H16-F16","v":-20.75},{"$f":"(F16*-0.3)/100","v":{"v":-0.77625,"d":"-0.78"}},{"$f":"(K16+L16)/F16","v":{"v":-0.08319323671497585,"d":"-8.32%"}},"Unsuccessful","2024-03-13",{"$nulls":3},"H"]
[8,"2024-02-29",null,"JAMNAAUTO","Accu",119.5,111.8,125.5,"153-155","Profit of Rs.6/-",{"$f":"H17-F17","v":6},{"$f":"(F17*-0.3)/100","v":{"v":-0.35850000000000004,"d":"-0.36"}},{"$f":"(K17+L17)/F17","v":{"v":0.0472092050209205,"d":"4.72%"}},"Successful","2024-03-01",{"$nulls":3},"H"]
[9,"2024-03-01",null,"WIPRO","Accu","497.5-517.5",477.5,null,"560-600","Open",{"$nulls":5},{"$f":"VLOOKUP(D18,'MidCap Intra'!$B$11:$C$568,2,0)","v":{"v":504.4,"d":"504.40"}}]
[10,"2024-03-02",null,"SAIL","Accu",136.75,128,144.1,"145-152","Profit of Rs.7.35/-",{"$f":"H19-F19","v":7.349999999999994},{"$f":"(F19*-0.3)/100","v":{"v":-0.41025,"d":"-0.41"}},{"$f":"(K19+L19)/F19","v":{"v":0.05074771480804384,"d":"5.07%"}},"Successful","2024-03-04"]
[11,"2024-03-04",null,"TATASTEEL","Accu","144.5-151.5",139,null,"164-175","Open",{"$nulls":5},{"$f":"VLOOKUP(D20,'MidCap Intra'!$B$11:$C$568,2,0)","v":143.65},null,null,"H"]
{"$rows_left_out":286}