{"text_format":"3","workbook":"xlsx","n_sheets":11,"sheets":["Main","Future Intra","Cash Intra","MidCap Intra","Bulk Deals","Call Tracker (Equity & F&O)","Sheet2","Sheet1","Sheet3","Sheet4","Sheet5"],"not_rendered":{"images":4,"defined_names":5},"read":"whole","date_system":"1900"}

{"sheet":"Main","index":0,"n_rows":27,"n_cols":11,"rows_kept":27}
[null,"                                                                                                 "]
{"$rows_empty":8}
[null,"2019-10-11"]
[]
[null,"Sheet No.","Template Name","Summary"]
[null,1,"Future Intra","For Intraday trading in F&O segment"]
[null,2,"Cash Intra","For Intraday trading in cash market segment"]
[null,3,"Mid-cap Intra","For Intraday trading in Mid-cap stocks"]
[null,4,"Bulk Deals","Reveals Bulk Deals carried on NSE & BSE"]
[null,5,"Call Tracker"]
{"$rows_empty":9}
[{"$nulls":10},"`"]

{"sheet":"Future Intra","index":1,"n_rows":193,"n_cols":15,"rows_kept":193,"merged":[[8,0,9,0],[8,1,9,1],[8,2,9,2],[8,5,8,7],[8,8,8,10]]}
[]
[]
[]
[]
[{"$nulls":12},"Back to Main Page"]
["FOR INTRA DAY TRADING",{"$nulls":10},{"$f":"Main!B10","v":"2019-10-11"}]
[]
[]
["Sr.no","Sector","Scrip","CLOSE RATE","Pivot Point","Supports",null,null,"Resistances"]
[null,"Sector",null,"Point","Point","S1","S2","S3","R1","R2","R3","HIGH","LOW","OI","% Change in OI"]
[1,"Index","BANKNIFTY",{"v":28106.6,"d":"28106.60"},{"v":28258.86666666667,"d":"28258.87"},{"v":27827.733333333337,"d":"27827.73"},{"v":27548.86666666667,"d":"27548.87"},{"v":27117.733333333337,"d":"27117.73"},{"v":28537.733333333337,"d":"28537.73"},{"v":28968.86666666667,"d":"28968.87"},{"v":29247.733333333337,"d":"29247.73"},28690,27980,1623460,{"v":0.11476873214678093,"d":"11.48%"}]
[2,"Index","NIFTY",11254.25,{"v":11261.066666666666,"d":"11261.07"},{"v":11208.18333333333,"d":"11208.18"},{"v":11162.116666666665,"d":"11162.12"},{"v":11109.23333333333,"d":"11109.23"},{"v":11307.133333333331,"d":"11307.13"},{"v":11360.016666666666,"d":"11360.02"},{"v":11406.083333333332,"d":"11406.08"},11313.95,11215,15654300,{"v":2.8058037859133274E-3,"d":"0.28%"}]
[3,"Index","NIFTYIT",{"v":15131,"d":"15131.00"},{"v":15148,"d":"15148.00"},{"v":15016,"d":"15016.00"},{"v":14901,"d":"14901.00"},{"v":14769,"d":"14769.00"},{"v":15263,"d":"15263.00"},{"v":15395,"d":"15395.00"},{"v":15510,"d":"15510.00"},15280,15033,13250,{"v":0.09053497942386832,"d":"9.05%"}]
[4,"Cement","ACC",1429.25,{"v":1440.4666666666665,"d":"1440.47"},{"v":1411.733333333333,"d":"1411.73"},{"v":1394.2166666666665,"d":"1394.22"},{"v":1365.483333333333,"d":"1365.48"},{"v":1457.983333333333,"d":"1457.98"},{"v":1486.7166666666665,"d":"1486.72"},{"v":1504.233333333333,"d":"1504.23"},1469.2,1422.95,2412400,{"v":0.009879437374413932,"d":"0.99%"}]
[5,"Others","ADANIENT",{"v":137.6,"d":"137.60"},{"v":137.31666666666663,"d":"137.32"},{"v":135.43333333333328,"d":"135.43"},{"v":133.26666666666665,"d":"133.27"},{"v":131.3833333333333,"d":"131.38"},{"v":139.48333333333326,"d":"139.48"},{"v":141.36666666666665,"d":"141.37"},{"v":143.53333333333325,"d":"143.53"},139.2,135.15,26296000,{"v":-3.3353547604608852E-3,"d":"-0.33%"}]
[6,"Others","ADANIPORTS",{"v":400.6,"d":"400.60"},{"v":399.5333333333333,"d":"399.53"},{"v":397.1166666666666,"d":"397.12"},{"v":393.6333333333333,"d":"393.63"},{"v":391.21666666666664,"d":"391.22"},{"v":403.0166666666666,"d":"403.02"},{"v":405.43333333333334,"d":"405.43"},{"v":408.9166666666666,"d":"408.92"},401.95,396.05,11665000,{"v":-0.020570948782535684,"d":"-2.06%"}]
[7,"Power","ADANIPOWER",62.35,61.35,59.85,57.35,55.85,63.85,65.35,67.85,62.85,58.85,91620000,{"v":-0.007582322357019064,"d":"-0.76%"}]
[8,"Automobile","AMARAJABAT",{"v":681.4,"d":"681.40"},{"v":687.5333333333334,"d":"687.53"},{"v":672.5666666666668,"d":"672.57"},{"v":663.7333333333335,"d":"663.73"},{"v":648.7666666666669,"d":"648.77"},{"v":696.3666666666668,"d":"696.37"},{"v":711.3333333333333,"d":"711.33"},{"v":720.1666666666667,"d":"720.17"},702.5,678.7,1621900,{"v":2.1626297577854673E-3,"d":"0.22%"}]
[9,"Cement","AMBUJACEM",188.25,{"v":189.21666666666667,"d":"189.22"},{"v":186.23333333333335,"d":"186.23"},{"v":184.21666666666667,"d":"184.22"},{"v":181.23333333333335,"d":"181.23"},{"v":191.23333333333335,"d":"191.23"},{"v":194.21666666666664,"d":"194.22"},{"v":196.23333333333335,"d":"196.23"},192.2,187.2,23997500,{"v":-0.002182952182952183,"d":"-0.22%"}]
[10,"Others","APOLLOHOSP",1418.45,{"v":1420.8500000000001,"d":"1420.85"},{"v":1402.8000000000002,"d":"1402.80"},1387.15,{"v":1369.1000000000001,"d":"1369.10"},{"v":1436.5000000000002,"d":"1436.50"},1454.55,{"v":1470.2000000000003,"d":"1470.20"},1438.9,1405.2,1467500,{"v":0.004105371193978789,"d":"0.41%"}]
{"$rows_left_out":160}
{"sheet":"Cash Intra","index":2,"n_rows":247,"n_cols":13,"rows_kept":247,"merged":[[7,0,8,0],[7,1,8,1],[7,2,8,2],[7,3,8,3],[7,4,7,6],[7,7,7,9]]}
[]
[]
[]
[]
[{"$nulls":12},"Back to Main Page"]
["FOR INTRA DAY TRADING",{"$nulls":9},{"$f":"Main!B10","v":"2019-10-11"}]
[]
["Sr.no","Scrip","CLOSE RATE","Pivot Point","Supports",null,null,"Resistances"]
[null,null,"Point",null,"S1","S2","S3","R1","R2","R3","HIGH","LOW","Total Trade Quanity in Lakhs"]
[1,"Nifty 50",11234.55,{"v":11245.483333333332,"d":"11245.48"},{"v":11197.616666666663,"d":"11197.62"},{"v":11160.68333333333,"d":"11160.68"},{"v":11112.816666666662,"d":"11112.82"},{"v":11282.416666666664,"d":"11282.42"},{"v":11330.283333333333,"d":"11330.28"},{"v":11367.216666666665,"d":"11367.22"},11293.35,11208.55]
[2,"Nifty Bank",28013.45,{"v":28160.11666666667,"d":"28160.12"},{"v":27767.483333333337,"d":"27767.48"},{"v":27521.51666666667,"d":"27521.52"},{"v":27128.88333333334,"d":"27128.88"},{"v":28406.083333333336,"d":"28406.08"},{"v":28798.716666666667,"d":"28798.72"},{"v":29044.683333333334,"d":"29044.68"},28552.75,27914.15]
[3,"Nifty CPSE",1903.5,{"v":1906.9166666666667,"d":"1906.92"},{"v":1897.3833333333334,"d":"1897.38"},{"v":1891.2666666666667,"d":"1891.27"},{"v":1881.7333333333333,"d":"1881.73"},{"v":1913.0333333333335,"d":"1913.03"},{"v":1922.5666666666668,"d":"1922.57"},{"v":1928.6833333333336,"d":"1928.68"},1916.45,1900.8]
[4,"Nifty Infra",3172,{"v":3165.633333333333,"d":"3165.63"},{"v":3154.0166666666664,"d":"3154.02"},{"v":3136.0333333333333,"d":"3136.03"},{"v":3124.4166666666665,"d":"3124.42"},{"v":3183.6166666666663,"d":"3183.62"},{"v":3195.233333333333,"d":"3195.23"},{"v":3213.2166666666662,"d":"3213.22"},3177.25,3147.65]
[5,"Nifty IT",15093.8,{"v":15121.333333333334,"d":"15121.33"},{"v":15007.066666666668,"d":"15007.07"},{"v":14920.333333333334,"d":"14920.33"},{"v":14806.066666666668,"d":"14806.07"},{"v":15208.066666666668,"d":"15208.07"},{"v":15322.333333333334,"d":"15322.33"},{"v":15409.066666666668,"d":"15409.07"},15235.6,15034.6]
[6,"Nifty PSE",3189.2,{"v":3193.183333333333,"d":"3193.18"},{"v":3177.0666666666657,"d":"3177.07"},{"v":3164.933333333333,"d":"3164.93"},{"v":3148.8166666666657,"d":"3148.82"},{"v":3205.3166666666657,"d":"3205.32"},{"v":3221.4333333333334,"d":"3221.43"},{"v":3233.5666666666657,"d":"3233.57"},3209.3,3181.05]
[7,"Nifty Midcap 50",4255.15,{"v":4271.2,"d":"4271.20"},{"v":4233.099999999999,"d":"4233.10"},{"v":4211.049999999999,"d":"4211.05"},{"v":4172.949999999999,"d":"4172.95"},4293.25,4331.35,{"v":4353.400000000001,"d":"4353.40"},4309.3,4249.15]
[8,"ACC",1422.9,{"v":1434.5999999999997,"d":"1434.60"},{"v":1406.3999999999994,"d":"1406.40"},{"v":1389.8999999999996,"d":"1389.90"},{"v":1361.6999999999994,"d":"1361.70"},{"v":1451.0999999999995,"d":"1451.10"},{"v":1479.2999999999997,"d":"1479.30"},{"v":1495.7999999999995,"d":"1495.80"},1462.8,1418.1,7.2133]
[9,"AUBANK",638.7,{"v":641.3333333333334,"d":"641.33"},{"v":633.6666666666667,"d":"633.67"},{"v":628.6333333333333,"d":"628.63"},{"v":620.9666666666667,"d":"620.97"},{"v":646.3666666666668,"d":"646.37"},{"v":654.0333333333335,"d":"654.03"},{"v":659.0666666666668,"d":"659.07"},649,636.3,0.54896]
[10,"ADANIPORTS",399.9,{"v":399.0333333333333,"d":"399.03"},{"v":396.4666666666666,"d":"396.47"},{"v":393.0333333333333,"d":"393.03"},{"v":390.4666666666666,"d":"390.47"},{"v":402.4666666666666,"d":"402.47"},{"v":405.0333333333333,"d":"405.03"},{"v":408.4666666666666,"d":"408.47"},401.6,395.6,30.34826]
[11,"ADANIPOWER",62.5,{"v":61.5,"d":"61.50"},{"v":59.9,"d":"59.90"},{"v":57.3,"d":"57.30"},{"v":55.699999999999996,"d":"55.70"},{"v":64.1,"d":"64.10"},{"v":65.69999999999999,"d":"65.70"},{"v":68.30000000000001,"d":"68.30"},63.1,58.9,171.92619]
{"$rows_left_out":228}
{"sheet":"MidCap Intra","index":3,"n_rows":545,"n_cols":13,"rows_kept":545,"merged":[[0,0,0,1],[8,0,9,0],[8,1,9,1],[8,2,9,2],[8,3,9,3],[8,4,8,6],[8,7,8,9]]}
[]
[]
[]
[]
[{"$nulls":11},"Back To Main Page"]
["FOR INTRA DAY TRADING",{"$nulls":9},{"$f":"Main!B10","v":"2019-10-11"}]
[null,null," "]
[]
["Sr.no","Scrip","CLOSE RATE","Pivot Point","Supports",null,null,"Resistances"]
[null,null,"Point",null,"S1","S2","S3","R1","R2","R3","HIGH","LOW","Total Trade Quanity in Lakhs"]
[1,"3MINDIA",19852.95,{"v":19941.61666666667,"d":"19941.62"},{"v":19636.333333333336,"d":"19636.33"},{"v":19419.716666666667,"d":"19419.72"},{"v":19114.433333333334,"d":"19114.43"},{"v":20158.233333333337,"d":"20158.23"},{"v":20463.51666666667,"d":"20463.52"},{"v":20680.13333333334,"d":"20680.13"},20246.9,19725,0.00867]
[2,"ACC",1422.9,{"v":1434.5999999999997,"d":"1434.60"},{"v":1406.3999999999994,"d":"1406.40"},{"v":1389.8999999999996,"d":"1389.90"},{"v":1361.6999999999994,"d":"1361.70"},{"v":1451.0999999999995,"d":"1451.10"},{"v":1479.2999999999997,"d":"1479.30"},{"v":1495.7999999999995,"d":"1495.80"},1462.8,1418.1,7.2133]
[3,"AIAENG",1623.35,{"v":1628.4833333333333,"d":"1628.48"},{"v":1601.9166666666667,"d":"1601.92"},{"v":1580.4833333333333,"d":"1580.48"},{"v":1553.9166666666667,"d":"1553.92"},{"v":1649.9166666666667,"d":"1649.92"},{"v":1676.4833333333333,"d":"1676.48"},{"v":1697.9166666666667,"d":"1697.92"},1655.05,1607.05,0.07594]
[4,"APLAPOLLO",1361.95,{"v":1357.9166666666667,"d":"1357.92"},{"v":1344.3333333333335,"d":"1344.33"},{"v":1326.7166666666667,"d":"1326.72"},{"v":1313.1333333333334,"d":"1313.13"},{"v":1375.5333333333335,"d":"1375.53"},{"v":1389.116666666667,"d":"1389.12"},{"v":1406.7333333333336,"d":"1406.73"},1371.5,1340.3,0.18516]
[5,"AUBANK",638.7,{"v":641.3333333333334,"d":"641.33"},{"v":633.6666666666667,"d":"633.67"},{"v":628.6333333333333,"d":"628.63"},{"v":620.9666666666667,"d":"620.97"},{"v":646.3666666666668,"d":"646.37"},{"v":654.0333333333335,"d":"654.03"},{"v":659.0666666666668,"d":"659.07"},649,636.3,0.54896]
[6,"AAVAS",1635.75,{"v":1638.3166666666666,"d":"1638.32"},{"v":1600.4833333333331,"d":"1600.48"},{"v":1565.2166666666665,"d":"1565.22"},{"v":1527.383333333333,"d":"1527.38"},{"v":1673.5833333333333,"d":"1673.58"},{"v":1711.4166666666667,"d":"1711.42"},{"v":1746.6833333333334,"d":"1746.68"},1676.15,1603.05,0.09207]
[7,"ABBOTINDIA",10999.35,{"v":10945.833333333334,"d":"10945.83"},{"v":10835.116666666669,"d":"10835.12"},{"v":10670.883333333335,"d":"10670.88"},{"v":10560.16666666667,"d":"10560.17"},{"v":11110.066666666668,"d":"11110.07"},{"v":11220.783333333331,"d":"11220.78"},{"v":11385.016666666666,"d":"11385.02"},11056.55,10781.6,0.20392]
[8,"ADANIGAS",138.5,{"v":139.41666666666666,"d":"139.42"},{"v":135.88333333333333,"d":"135.88"},{"v":133.26666666666668,"d":"133.27"},{"v":129.73333333333335,"d":"129.73"},{"v":142.0333333333333,"d":"142.03"},{"v":145.56666666666666,"d":"145.57"},{"v":148.18333333333328,"d":"148.18"},142.95,136.8,18.89479]
[9,"ADANIGREEN",73.8,72.95,{"v":71.4,"d":"71.40"},{"v":69,"d":"69.00"},67.45,{"v":75.35000000000001,"d":"75.35"},{"v":76.89999999999999,"d":"76.90"},{"v":79.30000000000001,"d":"79.30"},74.5,70.55,32.67575]
[10,"ADANIPORTS",399.9,{"v":399.0333333333333,"d":"399.03"},{"v":396.4666666666666,"d":"396.47"},{"v":393.0333333333333,"d":"393.03"},{"v":390.4666666666666,"d":"390.47"},{"v":402.4666666666666,"d":"402.47"},{"v":405.0333333333333,"d":"405.03"},{"v":408.4666666666666,"d":"408.47"},401.6,395.6,30.34826]
{"$rows_left_out":513}
{"sheet":"Bulk Deals","index":4,"n_rows":58,"n_cols":8,"rows_kept":58,"merged":[[4,0,4,1],[4,2,4,3],[6,1,6,2]]}
[" "]
[]
[]
[]
[]
[{"$nulls":4},"Back To Main Page"]
["Subject :","BULK DEAL",null,{"$f":"Main!B10","v":"2019-10-11"}]
[]
["Date","Scrip code","Scrip Name","Client Name","Buy / Sell","Quantity Traded","Trade Price / Wt.Avg.trade price","Exchange  "]
["2019-10-10",542721,"ARL","BHANSALI MAFATLAL KALIDAS(HUF)","SELL",{"v":212000,"d":"212,000"},{"v":33.5,"d":"33.50"},"BSE"]
["2019-10-10",542721,"ARL","SIMPLEX TRADING & AGENCIES LTD","BUY",{"v":80000,"d":"80,000"},{"v":33.5,"d":"33.50"},"BSE"]
["2019-10-10",542721,"ARL","SHAH ENTERPRISE","BUY",{"v":120000,"d":"120,000"},33.5,"BSE"]
["2019-10-10",531179,"ARMANFIN","PARAM CAPITAL","SELL",{"v":30000,"d":"30,000"},540,"BSE"]
["2019-10-10",590122,"ASHIKACR","DEEPAK KUMAR","BUY",{"v":43037,"d":"43,037"},39.78,"BSE"]
["2019-10-10",590122,"ASHIKACR","KABIR SHRAN DAGAR (HUF)","SELL",{"v":43037,"d":"43,037"},37.8,"BSE"]
["2019-10-10",537766,"BCP","SRINIDHI INFIN LIMITED","BUY",{"v":715005,"d":"715,005"},8.89,"BSE"]
["2019-10-10",537766,"BCP","SRINIDHI INFIN LIMITED","SELL",{"v":530000,"d":"530,000"},8.89,"BSE"]
["2019-10-10",537766,"BCP","SIDDHARTH CHIMANLAL SHAH","BUY",{"v":580000,"d":"580,000"},8.89,"BSE"]
["2019-10-10",537766,"BCP","SIDDHARTH CHIMANLAL SHAH","SELL",{"v":80000,"d":"80,000"},8.89,"BSE"]
["2019-10-10",537766,"BCP","BALAJI FINVEST ADVISORY PRIVATE LIMITED","SELL",{"v":700000,"d":"700,000"},8.89,"BSE"]
{"$rows_left_out":39}
{"sheet":"Call Tracker (Equity & F&O)","index":5,"n_rows":289,"n_cols":18,"rows_kept":289,"merged":[[89,0,90,0],[89,1,90,1],[89,9,90,9],[89,11,90,11],[89,12,90,12],[89,13,90,13],[89,14,90,14],[91,0,92,0],[91,1,92,1],[91,9,92,9],[91,11,92,11],[91,12,92,12],[91,13,92,13],[91,14,92,14],[93,0,94,0],[93,1,94,1],[93,9,94,9],[93,11,94,11],[93,12,94,12],[93,13,94,13],[93,14,94,14],[95,0,96,0],[95,1,96,1],[95,9,96,9],[95,11,96,11],[95,12,96,12],[95,13,96,13],[95,14,96,14],[108,0,109,0],[108,1,109,1],[108,9,109,9],[108,11,109,11],[108,12,109,12],[108,13,109,13],[108,14,109,14]]}
[]
[]
[]
[]
[{"$nulls":12},"Back To Main Page"]
["Retail Research Technical Calls & Fundamental Performance Report for the month of October-2019 "]
[{"$nulls":12},{"$f":"Main!B10","v":"2019-10-11"}]
[null,"Positional  Call"]
["Sr.no","Date",null,"Company","Rec","Rec Price","Stop Loss***","Call Closed At","Target","Remark","Profit / Loss per Share","Gain / Loss  %","Status","Closed Date","NSE Closed Price"]
[1,"2019-08-30",null,"BIOCON","Buy{}",229.5,214.3,242.5,"255-260","Profit of Rs.13/-",{"$f":"H10-F10","v":13},{"$f":"K10/F10","v":{"v":0.05664488017429194,"d":"5.66%"}},"Successful","2019-10-10",{"$nulls":3},"R"]
[2,"2019-09-09",null,"TORNTPHARM","Sell",1705,1808,1618,"1560-1540","Profit of Rs.87/-",{"$f":"F11-H11","v":87},{"$f":"K11/F11","v":{"v":0.05102639296187683,"d":"5.10%"}},"Successful","2019-10-01",{"$nulls":3},"R"]
[3,"2019-09-25",null,"AXISBANK","Buy","690-700",628,null,"800-820","Open",{"$nulls":4},{"$f":"VLOOKUP(D12,Sheet2!A41:M1680,6,0)","v":672.95},null,null,"H"]
[4,"2019-09-26",null,"HDFC","Buy","2065-2075",1940,null,"2250-2300","Open",{"$nulls":4},{"$f":"VLOOKUP(D13,Sheet2!A42:M1681,6,0)","v":1987.95},null,null,"H"]
[5,"2019-09-26",null,"BANKBARODA","Buy",96,89,89.5,"110-114","Loss of Rs.6.5/-",{"$f":"H14-F14","v":-6.5},{"$f":"K14/F14","v":{"v":-0.06770833333333333,"d":"-6.77%"}},"UnSuccessful","2019-10-01",{"$nulls":3},"H"]
[6,"2019-09-30",null,"BPCL","Sell",475,510,503,"420-410","Loss of Rs.28/-",{"$f":"F15-H15","v":-28},{"v":-0.05894736842105263,"d":"-5.89%"},"UnSuccessful","2019-10-03",{"$nulls":3},"H"]
[7,"2019-10-01",null,"CUMMINSIND","Buy","574-579",530,null,"640-660","Open",{"$nulls":4},{"$f":"VLOOKUP(D16,Sheet2!A46:M1685,6,0)","v":564.75},null,null,"H"]
[8,"2019-10-01",null,"UPL","Buy","592-598",564,null,"650-660","Open",{"$nulls":4},{"$f":"VLOOKUP(D17,Sheet2!A47:M1686,6,0)","v":583.45},null,null,"R"]
[9,"2019-10-03",null,"HEIDELBERG","Buy",183,169,189,"205-210","Part Profit of Rs.6/-",{"$f":"H18-F18","v":6},{"$f":"K18/F18","v":{"v":0.03278688524590164,"d":"3.28%"}},"Successful","2019-10-09",{"$f":"VLOOKUP(D18,Sheet2!A48:M1687,6,0)","v":182.6},null,null,"H"]
[10,"2019-10-03",null,"APOLLOHOSP","Buy",1378.5,1286,1420,"1550-1580","Part Profit of Rs.41.5/-",{"$f":"H19-F19","v":41.5},{"$f":"K19/F19","v":{"v":0.03010518679724338,"d":"3.01%"}},"Successful","2019-10-04",{"$f":"VLOOKUP(D19,Sheet2!A49:M1688,6,0)","v":1412.25},null,null,"R"]
[11,"2019-10-04",null,"HDFCAMC","Buy",2665,2537,2755,"2930-2960","Part Profit of Rs.90/-",{"$f":"H20-F20","v":90},{"$f":"K20/F20","v":{"v":0.03377110694183865,"d":"3.38%"}},"Successful","2019-10-07",{"$f":"VLOOKUP(D20,Sheet2!A50:M1689,6,0)","v":2723.55},null,null,"R"]
{"$rows_left_out":235}
{"sheet":"Sheet2","index":6,"n_rows":1899,"n_cols":14,"rows_kept":1899,"hidden":true}
["SYMBOL","SERIES","OPEN","HIGH","LOW","CLOSE","LAST","PREVCLOSE","TOTTRDQTY","TOTTRDVAL","TIMESTAMP","TOTALTRADES","ISIN","ISIN"]
["20MICRONS","EQ",38.25,39.35,37.65,38.1,37.8,38.9,17434,666074.4,"2019-10-10",223,"INE144J01027"]
["21STCENMGM","EQ",12.7,12.95,12.7,12.7,12.7,12.95,1861,23637.2,"2019-10-10",3,"INE253B01015"]
["3IINFOTECH","EQ",2.1,2.15,2.05,2.1,2.1,2.1,839135,1761202.8,"2019-10-10",446,"INE748C01020"]
["3MINDIA","EQ",20156,20246.9,19725,19852.95,19843,20219.3,867,17292939.5,"2019-10-10",520,"INE470A01017"]
["5PAISA","EQ",167,169.7,160.65,164.45,164,165.85,5155,850937.3,"2019-10-10",146,"INE618L01018"]
["63MOONS","EQ",121.45,124,114.2,115.3,115.35,120.45,127577,15124369.25,"2019-10-10",3207,"INE111B01023"]
["A2ZINFRA","EQ",9.65,9.75,9.2,9.5,9.45,9.65,89280,843448.85,"2019-10-10",214,"INE619I01012"]
["AARTIDRUGS","EQ",462.1,462.15,444.1,451.7,454,460.15,27919,12825744.6,"2019-10-10",1101,"INE767A01016"]
["AARTIIND","EQ",764.5,775,761,765.15,765,759.75,40187,30807049.75,"2019-10-10",4194,"INE769A01020"]
["AARVEEDEN","EQ",15.85,15.9,14,15.3,15.85,14.65,3111,45943.7,"2019-10-10",120,"INE273D01019"]
["AAVAS","EQ",1610,1676.15,1603.05,1635.75,1633,1604.05,9207,15090939.45,"2019-10-10",2040,"INE216P01012"]
["ABAN","BE",24.2,25.95,24.1,25.05,25.25,25.15,21434,538477.85,"2019-10-10",235,"INE421A01028"]
["ABB","EQ",1485,1493.85,1454.3,1464.45,1464.95,1486,31590,46385811.15,"2019-10-10",2997,"INE117A01022"]
["ABBOTINDIA","EQ",10990,11056.55,10781.6,10999.35,10990,10998.6,20392,222573525.6,"2019-10-10",3073,"INE358A01014"]
["ABCAPITAL","EQ",79.55,81.2,79,79.2,79.2,79.4,670965,53554604.3,"2019-10-10",11307,"INE674K01013"]
["ABFRL","EQ",206.55,208.1,203.55,204.6,203.75,208.1,358364,73727970.1,"2019-10-10",5341,"INE647O01011"]
["ACC","EQ",1459.8,1462.8,1418.1,1422.9,1424.45,1467.1,721330,1035461218.2,"2019-10-10",26051,"INE012A01025"]
["ACCELYA","EQ",844.95,850,823.35,846.1,850,856.35,6589,5546911.3,"2019-10-10",426,"INE793A01012"]
["ACE","EQ",74.2,78,73.7,77.45,77.45,74.6,215567,16267420.9,"2019-10-10",1293,"INE731H01025"]
{"$rows_left_out":1701}
{"sheet":"Sheet1","index":7,"n_rows":0,"n_cols":0,"rows_kept":0,"hidden":true}

{"sheet":"Sheet3","index":8,"n_rows":0,"n_cols":0,"rows_kept":0,"hidden":true}

{"sheet":"Sheet4","index":9,"n_rows":0,"n_cols":0,"rows_kept":0,"hidden":true}

{"sheet":"Sheet5","index":10,"n_rows":0,"n_cols":0,"rows_kept":0,"hidden":true}