{"text_format":"3","workbook":"xlsx","n_sheets":6,"sheets":["Main","Future Intra","Cash Intra","MidCap Intra","Bulk Deals","Call Tracker (Equity & F&O)"],"not_rendered":{"images":2,"external_links":1,"defined_names":3},"read":"whole","date_system":"1900"}

{"sheet":"Main","index":0,"n_rows":27,"n_cols":11,"rows_kept":27}
[null,"                                                                                                 "]
{"$rows_empty":8}
[null,"2022-09-13"]
[]
[null,"Sheet No.","Template Name","Summary"]
[null,1,"Future Intra","For Intraday trading in F&O segment"]
[null,2,"Cash Intra","For Intraday trading in cash market segment"]
[null,3,"Mid-cap Intra","For Intraday trading in Mid-cap stocks"]
[null,4,"Bulk Deals","Reveals Bulk Deals carried on NSE & BSE"]
[null,5,"Call Tracker"]
{"$rows_empty":9}
[{"$nulls":10},"`"]

{"sheet":"Future Intra","index":1,"n_rows":237,"n_cols":16,"rows_kept":237,"merged":[[8,0,9,0],[8,1,9,1],[8,2,9,2],[8,3,9,3],[8,6,8,8],[8,9,8,11]]}
[]
[]
[]
[]
[{"$nulls":12},"Back to Main Page"]
["FOR INTRA DAY TRADING",{"$nulls":10},{"$f":"Main!B10","v":"2022-09-13"}]
[]
[]
["Sr.no","Sector","Scrip","Expiry Date","CLOSE RATE","Pivot Point","Supports",null,null,"Resistances"]
[{"$nulls":4},"Point","Point","S1","S2","S3","R1","R2","R3","HIGH","LOW","OI","% Change in OI"]
[1,"Index","NIFTY","2022-09-29",17964.35,{"v":17953.616666666665,"d":"17953.62"},{"v":17882.83333333333,"d":"17882.83"},{"v":17801.316666666662,"d":"17801.32"},{"v":17730.533333333326,"d":"17730.53"},{"v":18035.13333333333,"d":"18035.13"},{"v":18105.916666666664,"d":"18105.92"},{"v":18187.433333333334,"d":"18187.43"},18024.4,17872.1,14462500,{"v":0.024949594095156426,"d":"2.49%"}]
[2,"Index","BANKNIFTY","2022-09-29",{"v":40673.7,"d":"40673.70"},{"v":40634.333333333336,"d":"40634.33"},{"v":40498.66666666667,"d":"40498.67"},{"v":40323.63333333334,"d":"40323.63"},{"v":40187.966666666674,"d":"40187.97"},{"v":40809.36666666667,"d":"40809.37"},{"v":40945.03333333334,"d":"40945.03"},{"v":41120.066666666666,"d":"41120.07"},40770,40459.3,2503050,{"v":0.009609857919309461,"d":"0.96%"}]
[3,"Index","FINNIFTY","2022-09-27",{"v":18493.7,"d":"18493.70"},{"v":18487.516666666666,"d":"18487.52"},{"v":18416.183333333334,"d":"18416.18"},{"v":18338.666666666668,"d":"18338.67"},{"v":18267.333333333336,"d":"18267.33"},{"v":18565.033333333333,"d":"18565.03"},{"v":18636.36666666667,"d":"18636.37"},{"v":18713.88333333333,"d":"18713.88"},18558.85,18410,4720,{"v":-0.008403361344537815,"d":"-0.84%"}]
[4,"Index","MIDCPNIFTY","2022-09-27",{"v":7540,"d":"7540.00"},{"v":2513.3333333333335,"d":"2513.33"},{"v":5026.666666666667,"d":"5026.67"},{"v":2513.3333333333335,"d":"2513.33"},{"v":5026.666666666667,"d":"5026.67"},{"v":5026.666666666667,"d":"5026.67"},{"v":2513.3333333333335,"d":"2513.33"},{"v":5026.666666666667,"d":"5026.67"},0,0,525,{"v":0,"d":"0.00%"}]
[5,"Chemical","AARTIIND","2022-09-29",{"v":892.1,"d":"892.10"},{"v":884.4000000000001,"d":"884.40"},{"v":870.6000000000001,"d":"870.60"},{"v":849.1,"d":"849.10"},{"v":835.3000000000001,"d":"835.30"},{"v":905.9000000000002,"d":"905.90"},{"v":919.7000000000002,"d":"919.70"},{"v":941.2000000000003,"d":"941.20"},898.2,862.9,3220650,{"v":0.1374962473731612,"d":"13.75%"}]
[6,"Capital_Goods","ABB","2022-09-29",{"v":3348.7,"d":"3348.70"},{"v":3346.9166666666665,"d":"3346.92"},{"v":3326.833333333333,"d":"3326.83"},{"v":3304.9666666666667,"d":"3304.97"},{"v":3284.883333333333,"d":"3284.88"},{"v":3368.783333333333,"d":"3368.78"},{"v":3388.866666666666,"d":"3388.87"},{"v":3410.7333333333327,"d":"3410.73"},3367,3325.05,1202250,{"v":0.017777777777777778,"d":"1.78%"}]
[7,"Pharma","ABBOTINDIA","2022-09-29",18258.95,{"v":18304.983333333334,"d":"18304.98"},{"v":18174.966666666667,"d":"18174.97"},{"v":18090.983333333334,"d":"18090.98"},{"v":17960.966666666667,"d":"17960.97"},{"v":18388.966666666667,"d":"18388.97"},{"v":18518.983333333337,"d":"18518.98"},{"v":18602.966666666667,"d":"18602.97"},18435,18221,54320,{"v":0.05763239875389408,"d":"5.76%"}]
[8,"Others","ABCAPITAL","2022-09-29",119.35,{"v":118.43333333333334,"d":"118.43"},{"v":116.46666666666667,"d":"116.47"},{"v":113.58333333333333,"d":"113.58"},{"v":111.61666666666666,"d":"111.62"},{"v":121.31666666666668,"d":"121.32"},{"v":123.28333333333335,"d":"123.28"},{"v":126.16666666666669,"d":"126.17"},120.4,115.55,26168400,{"v":0.068342151675485,"d":"6.83%"}]
[9,"Textile","ABFRL","2022-09-29",{"v":325.9,"d":"325.90"},{"v":326.8333333333333,"d":"326.83"},{"v":323.71666666666664,"d":"323.72"},{"v":321.5333333333333,"d":"321.53"},{"v":318.41666666666663,"d":"318.42"},{"v":329.01666666666665,"d":"329.02"},{"v":332.1333333333333,"d":"332.13"},{"v":334.31666666666666,"d":"334.32"},329.95,324.65,10301200,{"v":-0.01687344913151365,"d":"-1.69%"}]
[10,"Cement","ACC","2022-09-29",2516.05,{"v":2453.6666666666665,"d":"2453.67"},{"v":2382.333333333333,"d":"2382.33"},{"v":2248.6166666666663,"d":"2248.62"},{"v":2177.283333333333,"d":"2177.28"},{"v":2587.383333333333,"d":"2587.38"},{"v":2658.7166666666662,"d":"2658.72"},{"v":2792.4333333333334,"d":"2792.43"},2525,2319.95,4237750,{"v":0.09537964458804524,"d":"9.54%"}]
{"$rows_left_out":206}
{"sheet":"Cash Intra","index":2,"n_rows":246,"n_cols":13,"rows_kept":246,"merged":[[7,0,8,0],[7,1,8,1],[7,2,8,2],[7,3,8,3],[7,4,7,6],[7,7,7,9]]}
[]
[]
[]
[]
[{"$nulls":12},"Back to Main Page"]
["FOR INTRA DAY TRADING",{"$nulls":9},{"$f":"Main!B10","v":"2022-09-13"}]
[]
["Sr.no",null,"CLOSE RATE","Pivot Point","Supports",null,null,"Resistances"]
[{"$nulls":4},"S1","S2","S3","R1","R2","R3","HIGH","LOW","Total Trade Quanity in Lakhs"]
[1,"Nifty 50",{"$f":"VLOOKUP($B10,[1]INDEX!$A$1:$F$50,6,0)","v":17936.35},{"$f":"(C10+K10+L10)/3","v":17935.35},{"$f":"+(D10*2)-K10","v":{"v":17890.149999999998,"d":"17890.15"}},{"$f":"+D10-K10+L10","v":17843.95},{"$f":"L10-2*(K10-D10)","v":17798.75},{"$f":"(D10*2)-L10","v":{"v":17981.549999999996,"d":"17981.55"}},{"$f":"+D10+K10-L10","v":{"v":18026.749999999993,"d":"18026.75"}},{"$f":"K10+2*(D10-L10)","v":{"v":18072.949999999993,"d":"18072.95"}},{"$f":"VLOOKUP($B10,[1]INDEX!$A$1:$F$50,4,0)","v":17980.55},{"$f":"VLOOKUP($B10,[1]INDEX!$A$1:$G$50,5,0)","v":17889.15}]
[2,"Nifty Bank",{"$f":"VLOOKUP($B11,[1]INDEX!$A$1:$F$50,6,0)","v":{"v":40574,"d":"40574.00"}},{"$f":"(C11+K11+L11)/3","v":{"v":40545.6,"d":"40545.60"}},{"$f":"+(D11*2)-K11","v":{"v":40406.299999999996,"d":"40406.30"}},{"$f":"+D11-K11+L11","v":{"v":40238.6,"d":"40238.60"}},{"$f":"L11-2*(K11-D11)","v":{"v":40099.299999999996,"d":"40099.30"}},{"$f":"(D11*2)-L11","v":{"v":40713.299999999996,"d":"40713.30"}},{"$f":"+D11+K11-L11","v":{"v":40852.6,"d":"40852.60"}},{"$f":"K11+2*(D11-L11)","v":{"v":41020.299999999996,"d":"41020.30"}},{"$f":"VLOOKUP($B11,[1]INDEX!$A$1:$F$50,4,0)","v":{"v":40684.9,"d":"40684.90"}},{"$f":"VLOOKUP($B11,[1]INDEX!$A$1:$G$50,5,0)","v":{"v":40377.9,"d":"40377.90"}}]
[3,"Nifty CPSE",{"$f":"VLOOKUP($B12,[1]INDEX!$A$1:$F$50,6,0)","v":{"v":2740.6,"d":"2740.60"}},{"v":2740.383333333333,"d":"2740.38"},{"v":2723.4166666666665,"d":"2723.42"},{"v":2706.233333333333,"d":"2706.23"},{"v":2689.2666666666664,"d":"2689.27"},{"v":2757.5666666666666,"d":"2757.57"},{"v":2774.5333333333338,"d":"2774.53"},{"v":2791.7166666666667,"d":"2791.72"},{"$f":"VLOOKUP($B12,[1]INDEX!$A$1:$F$50,4,0)","v":2757.35},{"$f":"VLOOKUP($B12,[1]INDEX!$A$1:$G$50,5,0)","v":{"v":2723.2,"d":"2723.20"}}]
[4,"Nifty Infra",{"$f":"VLOOKUP($B13,[1]INDEX!$A$1:$F$50,6,0)","v":5256.75},{"v":5244.333333333333,"d":"5244.33"},{"v":5225.116666666666,"d":"5225.12"},{"v":5193.483333333333,"d":"5193.48"},{"v":5174.2666666666655,"d":"5174.27"},{"v":5275.966666666666,"d":"5275.97"},{"v":5295.183333333333,"d":"5295.18"},{"v":5326.816666666667,"d":"5326.82"},{"$f":"VLOOKUP($B13,[1]INDEX!$A$1:$F$50,4,0)","v":5263.55},{"$f":"VLOOKUP($B13,[1]INDEX!$A$1:$G$50,5,0)","v":{"v":5212.7,"d":"5212.70"}}]
[5,"Nifty IT",{"$f":"VLOOKUP($B14,[1]INDEX!$A$1:$F$50,6,0)","v":{"v":29131.2,"d":"29131.20"}},{"v":29119.816666666666,"d":"29119.82"},{"v":28943.43333333333,"d":"28943.43"},{"v":28755.666666666664,"d":"28755.67"},{"v":28579.28333333333,"d":"28579.28"},{"v":29307.583333333332,"d":"29307.58"},{"v":29483.966666666664,"d":"29483.97"},{"v":29671.733333333334,"d":"29671.73"},{"$f":"VLOOKUP($B14,[1]INDEX!$A$1:$F$50,4,0)","v":{"v":29296.2,"d":"29296.20"}},{"$f":"VLOOKUP($B14,[1]INDEX!$A$1:$G$50,5,0)","v":28932.05}]
[6,"Nifty PSE",{"$f":"VLOOKUP($B15,[1]INDEX!$A$1:$F$50,6,0)","v":{"v":4296.7,"d":"4296.70"}},{"v":4288.216666666666,"d":"4288.22"},{"v":4276.633333333332,"d":"4276.63"},{"v":4256.566666666666,"d":"4256.57"},{"v":4244.983333333332,"d":"4244.98"},{"v":4308.283333333333,"d":"4308.28"},{"v":4319.866666666667,"d":"4319.87"},{"v":4339.933333333333,"d":"4339.93"},{"$f":"VLOOKUP($B15,[1]INDEX!$A$1:$F$50,4,0)","v":{"v":4299.8,"d":"4299.80"}},{"$f":"VLOOKUP($B15,[1]INDEX!$A$1:$G$50,5,0)","v":4268.15}]
[7,"Nifty Midcap 50",{"$f":"VLOOKUP($B16,[1]INDEX!$A$1:$F$50,6,0)","v":8821.05},{"v":8803.133333333333,"d":"8803.13"},{"v":8778.466666666667,"d":"8778.47"},{"v":8735.883333333333,"d":"8735.88"},{"v":8711.216666666667,"d":"8711.22"},{"v":8845.716666666667,"d":"8845.72"},{"v":8870.383333333335,"d":"8870.38"},{"v":8912.966666666667,"d":"8912.97"},{"$f":"VLOOKUP($B16,[1]INDEX!$A$1:$F$50,4,0)","v":{"v":8827.8,"d":"8827.80"}},{"$f":"VLOOKUP($B16,[1]INDEX!$A$1:$G$50,5,0)","v":8760.55}]
[8,"ABB",{"$f":"VLOOKUP($B17,[1]EQ!$A9:$L5825,6,0)","v":3329.6},{"v":3329.9500000000003,"d":"3329.95"},{"v":3309.9000000000005,"d":"3309.90"},{"v":3290.2000000000003,"d":"3290.20"},{"v":3270.1500000000005,"d":"3270.15"},{"v":3349.6500000000005,"d":"3349.65"},{"v":3369.7000000000007,"d":"3369.70"},{"v":3389.4000000000005,"d":"3389.40"},{"$f":"VLOOKUP($B17,[1]EQ!$A9:$L5825,4,0)","v":3350},{"$f":"VLOOKUP($B17,[1]EQ!$A9:$L5825,5,0)","v":3310.25},{"$f":"VLOOKUP($B17,[1]EQ!$A$4:$I$3070,9,0)/100000","v":1.79592}]
[9,"ACC",{"$f":"VLOOKUP($B18,[1]EQ!$A10:$L5826,6,0)","v":2500.85},{"v":2451.9166666666665,"d":"2451.92"},{"v":2389.183333333333,"d":"2389.18"},{"v":2277.5166666666664,"d":"2277.52"},{"v":2214.783333333333,"d":"2214.78"},{"v":2563.583333333333,"d":"2563.58"},{"v":2626.3166666666666,"d":"2626.32"},{"v":2737.983333333333,"d":"2737.98"},{"$f":"VLOOKUP($B18,[1]EQ!$A10:$L5826,4,0)","v":2514.65},{"$f":"VLOOKUP($B18,[1]EQ!$A10:$L5826,5,0)","v":2340.25},{"$f":"VLOOKUP($B18,[1]EQ!$A$4:$I$3070,9,0)/100000","v":19.90854}]
[10,"AUBANK",{"$f":"VLOOKUP($B19,[1]EQ!$A11:$L5827,6,0)","v":660.75},{"v":658.5166666666667,"d":"658.52"},{"v":654.4833333333333,"d":"654.48"},{"v":648.2166666666667,"d":"648.22"},{"v":644.1833333333334,"d":"644.18"},{"v":664.7833333333333,"d":"664.78"},{"v":668.8166666666666,"d":"668.82"},{"v":675.0833333333333,"d":"675.08"},{"$f":"VLOOKUP($B19,[1]EQ!$A11:$L5827,4,0)","v":662.55},{"$f":"VLOOKUP($B19,[1]EQ!$A11:$L5827,5,0)","v":652.25},{"$f":"VLOOKUP($B19,[1]EQ!$A$4:$I$3070,9,0)/100000","v":10.50504}]
[11,"ABBOTINDIA",{"$f":"VLOOKUP($B20,[1]EQ!$A12:$L5828,6,0)","v":18139.95},{"v":18193.316666666666,"d":"18193.32"},{"v":18036.63333333333,"d":"18036.63"},{"v":17933.316666666666,"d":"17933.32"},{"v":17776.63333333333,"d":"17776.63"},{"v":18296.63333333333,"d":"18296.63"},{"v":18453.316666666666,"d":"18453.32"},{"v":18556.63333333333,"d":"18556.63"},{"$f":"VLOOKUP($B20,[1]EQ!$A12:$L5828,4,0)","v":18350},{"$f":"VLOOKUP($B20,[1]EQ!$A12:$L5828,5,0)","v":18090},{"$f":"VLOOKUP($B20,[1]EQ!$A$4:$I$3070,9,0)/100000","v":0.15525}]
{"$rows_left_out":227}
{"sheet":"MidCap Intra","index":3,"n_rows":532,"n_cols":13,"rows_kept":532,"merged":[[0,0,0,1],[8,0,9,0],[8,1,9,1],[8,2,9,2],[8,3,9,3],[8,4,8,6],[8,7,8,9]]}
[]
[]
[]
[]
[{"$nulls":11},"Back To Main Page"]
["FOR INTRA DAY TRADING",{"$nulls":9},{"$f":"Main!B10","v":"2022-09-13"}]
[null,null," "]
[]
["Sr.no","Scrip","CLOSE RATE","Pivot Point","Supports",null,null,"Resistances"]
[{"$nulls":4},"S1","S2","S3","R1","R2","R3","HIGH","LOW","Total Trade Quanity in Lakhs"]
[1,"3MINDIA",22806.15,{"v":22818.733333333334,"d":"22818.73"},{"v":22712.466666666667,"d":"22712.47"},{"v":22618.783333333333,"d":"22618.78"},{"v":22512.516666666666,"d":"22512.52"},{"v":22912.416666666668,"d":"22912.42"},{"v":23018.683333333338,"d":"23018.68"},{"v":23112.36666666667,"d":"23112.37"},22925,22725.05,0.06215]
[2,"ABB",3329.6,{"v":3329.9500000000003,"d":"3329.95"},{"v":3309.9000000000005,"d":"3309.90"},{"v":3290.2000000000003,"d":"3290.20"},{"v":3270.1500000000005,"d":"3270.15"},{"v":3349.6500000000005,"d":"3349.65"},{"v":3369.7000000000007,"d":"3369.70"},{"v":3389.4000000000005,"d":"3389.40"},3350,3310.25,1.79592]
[3,"ACC",2500.85,{"v":2451.9166666666665,"d":"2451.92"},{"v":2389.183333333333,"d":"2389.18"},{"v":2277.5166666666664,"d":"2277.52"},{"v":2214.783333333333,"d":"2214.78"},{"v":2563.583333333333,"d":"2563.58"},{"v":2626.3166666666666,"d":"2626.32"},{"v":2737.983333333333,"d":"2737.98"},2514.65,2340.25,19.90854]
[4,"AIAENG",2612.6,{"v":2603.4833333333336,"d":"2603.48"},{"v":2568.966666666667,"d":"2568.97"},{"v":2525.3333333333335,"d":"2525.33"},{"v":2490.816666666667,"d":"2490.82"},{"v":2647.1166666666672,"d":"2647.12"},{"v":2681.6333333333337,"d":"2681.63"},{"v":2725.2666666666673,"d":"2725.27"},2638,2559.85,0.41346]
[5,"APLAPOLLO",1010.35,{"v":1009.6833333333334,"d":"1009.68"},{"v":998.3666666666668,"d":"998.37"},{"v":986.3833333333334,"d":"986.38"},{"v":975.0666666666668,"d":"975.07"},{"v":1021.6666666666667,"d":"1021.67"},{"v":1032.9833333333333,"d":"1032.98"},{"v":1044.9666666666667,"d":"1044.97"},1021,997.7,3.01052]
[6,"AUBANK",660.75,{"v":658.5166666666667,"d":"658.52"},{"v":654.4833333333333,"d":"654.48"},{"v":648.2166666666667,"d":"648.22"},{"v":644.1833333333334,"d":"644.18"},{"v":664.7833333333333,"d":"664.78"},{"v":668.8166666666666,"d":"668.82"},{"v":675.0833333333333,"d":"675.08"},662.55,652.25,10.50504]
[7,"AARTIDRUGS",464.85,{"v":466.01666666666665,"d":"466.02"},{"v":460.8333333333333,"d":"460.83"},{"v":456.81666666666666,"d":"456.82"},{"v":451.6333333333333,"d":"451.63"},{"v":470.0333333333333,"d":"470.03"},{"v":475.2166666666667,"d":"475.22"},{"v":479.2333333333333,"d":"479.23"},471.2,462,1.29233]
[8,"AAVAS",2308.15,{"v":2313.233333333333,"d":"2313.23"},{"v":2287.1166666666663,"d":"2287.12"},{"v":2266.083333333333,"d":"2266.08"},{"v":2239.9666666666662,"d":"2239.97"},{"v":2334.2666666666664,"d":"2334.27"},{"v":2360.383333333333,"d":"2360.38"},{"v":2381.4166666666665,"d":"2381.42"},2339.35,2292.2,0.486]
[9,"ABBOTINDIA",18139.95,{"v":18193.316666666666,"d":"18193.32"},{"v":18036.63333333333,"d":"18036.63"},{"v":17933.316666666666,"d":"17933.32"},{"v":17776.63333333333,"d":"17776.63"},{"v":18296.63333333333,"d":"18296.63"},{"v":18453.316666666666,"d":"18453.32"},{"v":18556.63333333333,"d":"18556.63"},18350,18090,0.15525]
[10,"ADANIENT",3463.8,{"v":3472.4,"d":"3472.40"},{"v":3449.3,"d":"3449.30"},{"v":3434.8,"d":"3434.80"},{"v":3411.7000000000003,"d":"3411.70"},{"v":3486.9,"d":"3486.90"},{"v":3509.9999999999995,"d":"3510.00"},{"v":3524.5,"d":"3524.50"},3495.5,3457.9,16.47756]
{"$rows_left_out":513}
{"sheet":"Bulk Deals","index":4,"n_rows":187,"n_cols":8,"rows_kept":187,"merged":[[4,0,4,1],[4,2,4,3],[6,1,6,2]]}
[" "]
[]
[]
[]
[]
[{"$nulls":4},"Back To Main Page"]
["Subject :","BULK DEAL",null,{"$f":"Main!B10","v":"2022-09-13"}]
[]
["Date","Scrip code","Scrip Name","Client Name","Buy / Sell","Quantity Traded","Trade Price / Wt.Avg.trade price","Exchange  "]
["2022-09-12",542377,"AARSHYAM","RAKESH KUMAR BANSAL","SELL",{"v":150000,"d":"150,000"},3.52,"BSE"]
["2022-09-12",542377,"AARSHYAM","NNM SECURITIES PVT LTD","BUY",{"v":346000,"d":"346,000"},3.52,"BSE"]
["2022-09-12",542377,"AARSHYAM","SHREYANS LOGISTICS PRIVATE LIMITED","SELL",{"v":200000,"d":"200,000"},3.52,"BSE"]
["2022-09-12",539570,"ACEWIN","LAXMANBHAI RAVJIBHAI GAJERA","BUY",{"v":134400,"d":"134,400"},3.11,"BSE"]
["2022-09-12",539570,"ACEWIN","PREMA LAL","SELL",{"v":105600,"d":"105,600"},3.12,"BSE"]
["2022-09-12",517356,"ACIIN","KOTAK MAHINDRA BANK LIMITED","SELL",{"v":595353,"d":"595,353"},1.14,"BSE"]
["2022-09-12",543377,"ADISHAKTI","VINOD KUMAR MALI","SELL",{"v":30000,"d":"30,000"},7.9,"BSE"]
["2022-09-12",543377,"ADISHAKTI","NNM SECURITIES PVT LTD","SELL",{"v":30000,"d":"30,000"},7.87,"BSE"]
["2022-09-12",543377,"ADISHAKTI","NNM SECURITIES PVT LTD","BUY",{"v":30000,"d":"30,000"},7.9,"BSE"]
["2022-09-12",538351,"AFEL","MULTIPLIER SHARE & STOCK ADVISORS PRIVATE LIMITED","SELL",{"v":95000,"d":"95,000"},19.41,"BSE"]
["2022-09-12",539115,"ALAN SCOTT","NEXT ORBIT VENTURES FUND","SELL",{"v":10000,"d":"10,000"},47.31,"BSE"]
{"$rows_left_out":168}
{"sheet":"Call Tracker (Equity & F&O)","index":5,"n_rows":289,"n_cols":18,"rows_kept":289,"merged":[[93,0,94,0],[93,1,94,1],[93,9,94,9]]}
[]
[]
[]
[]
[{"$nulls":12},"Back To Main Page"]
["Retail Research Technical Calls & Fundamental Performance Report for the month of Sep-2022"]
[{"$nulls":12},{"$f":"Main!B10","v":"2022-09-13"}]
[null,"Positional  Call"]
["Sr.no","Date",null,"Company","Rec","Rec Price","Stop Loss***","Call Closed At","Target","Remark","Profit / Loss per Share","All charges","Net Gain / Loss  %","Status","Closed Date","Market Closing Price"]
[1,"2022-08-12",null,"BATAINDIA","Buy",1905,1750,1982.5,"2100-2200","Part profit of Rs.77.5/-",{"$f":"H10-F10","v":77.5},{"$f":"(F10*-0.7)/100","v":{"v":-13.335,"d":"-13.34"}},{"$f":"(K10+L10)/F10","v":{"v":0.03368241469816272,"d":"3.37%"}},"Successful","2022-08-16",null,null,"H"]
[2,"2022-08-19",null,"GSPL","Buy",246.5,229,260,"270-280","Part profit of Rs.13.5/-",13.5,{"v":-1.7254999999999998,"d":"-1.73"},{"v":0.047766734279918864,"d":"4.78%"},"Successful","2022-09-09",null,null,"H"]
[3,"2022-08-22",null,"VTL","Buy",327.5,298,344.5,"360-390","Part profit of Rs.17/-",{"$f":"H12-F12","v":17},{"$f":"(F12*-0.7)/100","v":{"v":-2.2924999999999995,"d":"-2.29"}},{"$f":"(K12+L12)/F12","v":{"v":0.044908396946564885,"d":"4.49%"}},"Successful","2022-08-25",null,null,"H"]
[4,"2022-08-22",null,"RELIANCE ","Buy","2580-2610",2480,null,"2750-2800","Open",{"$nulls":7},"H"]
[5,"2022-08-23",null,"IGL","Buy",405,375,428.5,"440-460","Profit of Rs.23.5/-",{"$f":"H14-F14","v":23.5},{"$f":"(F14*-0.7)/100","v":{"v":-2.835,"d":"-2.84"}},{"$f":"(K14+L14)/F14","v":{"v":0.05102469135802469,"d":"5.10%"}},"Successful","2022-09-02",null,null,"H"]
[6,"2022-08-26",null,"DELTACORP","Buy","210-214",199,null,"230-235","Open",{"$nulls":7},"N"]
[7,"2022-08-29",null,"GMMPFAUDLR","Buy",1650,1540,1775,"1770-1850","Profit of Rs.125/-",{"$f":"H16-F16","v":125},{"$f":"(F16*-0.7)/100","v":-11.55},{"$f":"(K16+L16)/F16","v":{"v":0.06875757575757575,"d":"6.88%"}},"Successful","2022-09-02",null,null,"N"]
[8,"2022-08-29",null,"IEX","Buy",157,149.5,158.5,"165-170","Profit of Rs.1.5/-",{"$f":"H17-F17","v":1.5},{"$f":"(F17*-0.7)/100","v":{"v":-1.099,"d":"-1.10"}},{"$f":"(K17+L17)/F17","v":{"v":2.5541401273885354E-3,"d":"0.26%"}},"Neutral","2022-09-05",null,null,"H"]
[9,"2022-09-05",null,"AMARAJABAT","Buy",514,480,545,"550-580","Profit of Rs.31/-",{"$f":"H18-F18","v":31},{"$f":"(F18*-0.07)/100","v":{"v":-0.35980000000000006,"d":"-0.36"}},{"$f":"(K18+L18)/F18","v":{"v":0.05961128404669261,"d":"5.96%"}},"Successful","2022-09-12",null,null,"N"]
[10,"2022-09-06",null,"COLPAL","Buy","1610-1640",1535,null,"1750-1800","Open",{"$nulls":7},"H"]
[11,"2022-09-07",null,"LTI","Buy",4415,4140,4677.5,"4800-5000","Profit of Rs.262.5/-",{"$f":"H20-F20","v":262.5},{"$f":"(F20*-0.7)/100","v":{"v":-30.905,"d":"-30.91"}},{"$f":"(K20+L20)/F20","v":{"v":0.052456398640996604,"d":"5.25%"}},"Successful","2022-09-09",null,null,"H"]
{"$rows_left_out":269}