{"text_format":"3","workbook":"xlsx","n_sheets":11,"sheets":["Main","Future Intra","Cash Intra","MidCap Intra","Bulk Deals","Call Tracker (Equity & F&O)","Sheet2","Sheet1","Sheet3","Sheet4","Sheet5"],"not_rendered":{"images":4,"defined_names":5},"read":"whole","date_system":"1900"}

{"sheet":"Main","index":0,"n_rows":27,"n_cols":11,"rows_kept":27}
[null,"                                                                                                 "]
{"$rows_empty":8}
[null,"2020-01-13"]
[]
[null,"Sheet No.","Template Name","Summary"]
[null,1,"Future Intra","For Intraday trading in F&O segment"]
[null,2,"Cash Intra","For Intraday trading in cash market segment"]
[null,3,"Mid-cap Intra","For Intraday trading in Mid-cap stocks"]
[null,4,"Bulk Deals","Reveals Bulk Deals carried on NSE & BSE"]
[null,5,"Call Tracker"]
{"$rows_empty":9}
[{"$nulls":10},"`"]

{"sheet":"Future Intra","index":1,"n_rows":190,"n_cols":15,"rows_kept":190,"merged":[[8,0,9,0],[8,1,9,1],[8,2,9,2],[8,5,8,7],[8,8,8,10]]}
[]
[]
[]
[]
[{"$nulls":12},"Back to Main Page"]
["FOR INTRA DAY TRADING",{"$nulls":10},{"$f":"Main!B10","v":"2020-01-13"}]
[]
[]
["Sr.no","Sector","Scrip","CLOSE RATE","Pivot Point","Supports",null,null,"Resistances"]
[null,"Sector",null,"Point","Point","S1","S2","S3","R1","R2","R3","HIGH","LOW","OI","% Change in OI"]
[1,"Index","BANKNIFTY",32122.75,{"v":32162.566666666666,"d":"32162.57"},{"v":31940.18333333333,"d":"31940.18"},{"v":31757.616666666665,"d":"31757.62"},{"v":31535.23333333333,"d":"31535.23"},{"v":32345.13333333333,"d":"32345.13"},{"v":32567.516666666663,"d":"32567.52"},{"v":32750.083333333332,"d":"32750.08"},32384.95,31980,1469640,{"v":-0.09612900845049632,"d":"-9.61%"}]
[2,"Index","NIFTY",{"v":12290,"d":"12290.00"},{"v":12300.733333333332,"d":"12300.73"},{"v":12244.466666666664,"d":"12244.47"},{"v":12198.933333333332,"d":"12198.93"},{"v":12142.666666666664,"d":"12142.67"},{"v":12346.266666666663,"d":"12346.27"},{"v":12402.53333333333,"d":"12402.53"},{"v":12448.066666666662,"d":"12448.07"},12357,12255.2,14684025,{"v":0.01239987796617181,"d":"1.24%"}]
[3,"Index","NIFTYIT",{"v":15939,"d":"15939.00"},{"v":15959.666666666666,"d":"15959.67"},{"v":15896.333333333332,"d":"15896.33"},{"v":15853.666666666666,"d":"15853.67"},{"v":15790.333333333332,"d":"15790.33"},{"v":16002.333333333332,"d":"16002.33"},{"v":16065.666666666664,"d":"16065.67"},{"v":16108.333333333332,"d":"16108.33"},16023,15917,5800,{"v":0.03571428571428571,"d":"3.57%"}]
[4,"Cement","ACC",{"v":1517.3,"d":"1517.30"},1513.95,{"v":1496.3500000000001,"d":"1496.35"},{"v":1475.4,"d":"1475.40"},{"v":1457.8000000000002,"d":"1457.80"},{"v":1534.9,"d":"1534.90"},{"v":1552.5,"d":"1552.50"},1573.45,1531.55,1493,3508800,{"v":1.0270455323519343E-3,"d":"0.10%"}]
[5,"Others","ADANIENT",209.15,{"v":208.91666666666666,"d":"208.92"},{"v":206.5333333333333,"d":"206.53"},{"v":203.91666666666666,"d":"203.92"},{"v":201.5333333333333,"d":"201.53"},{"v":211.5333333333333,"d":"211.53"},{"v":213.91666666666669,"d":"213.92"},{"v":216.5333333333333,"d":"216.53"},211.3,206.3,28812000,{"v":-8.3229296712442784E-4,"d":"-0.08%"}]
[6,"Others","ADANIPORTS",{"v":393,"d":"393.00"},{"v":393.1333333333334,"d":"393.13"},{"v":390.46666666666675,"d":"390.47"},{"v":387.9333333333334,"d":"387.93"},{"v":385.26666666666677,"d":"385.27"},{"v":395.66666666666674,"d":"395.67"},{"v":398.33333333333337,"d":"398.33"},{"v":400.86666666666673,"d":"400.87"},395.8,390.6,31885000,{"v":-0.03466545564638208,"d":"-3.47%"}]
[7,"Power","ADANIPOWER",{"v":61.3,"d":"61.30"},{"v":61.666666666666664,"d":"61.67"},{"v":60.633333333333326,"d":"60.63"},{"v":59.96666666666666,"d":"59.97"},{"v":58.93333333333332,"d":"58.93"},{"v":62.33333333333333,"d":"62.33"},{"v":63.366666666666674,"d":"63.37"},{"v":64.03333333333333,"d":"64.03"},62.7,61,73370000,{"v":-0.013180901143241426,"d":"-1.32%"}]
[8,"Automobile","AMARAJABAT",738.35,{"v":740.9499999999999,"d":"740.95"},{"v":730.3999999999999,"d":"730.40"},{"v":722.4499999999999,"d":"722.45"},{"v":711.8999999999999,"d":"711.90"},{"v":748.8999999999999,"d":"748.90"},{"v":759.4499999999998,"d":"759.45"},{"v":767.3999999999999,"d":"767.40"},751.5,733,1574400,{"v":0.04792332268370607,"d":"4.79%"}]
[9,"Cement","AMBUJACEM",212.85,{"v":211.76666666666665,"d":"211.77"},{"v":208.4333333333333,"d":"208.43"},{"v":204.01666666666665,"d":"204.02"},{"v":200.6833333333333,"d":"200.68"},{"v":216.1833333333333,"d":"216.18"},{"v":219.51666666666668,"d":"219.52"},{"v":223.9333333333333,"d":"223.93"},215.1,207.35,18785000,{"v":0.07650429799426935,"d":"7.65%"}]
[10,"Others","APOLLOHOSP",1493.25,{"v":1495.6666666666667,"d":"1495.67"},{"v":1481.5833333333335,"d":"1481.58"},{"v":1469.9166666666667,"d":"1469.92"},{"v":1455.8333333333335,"d":"1455.83"},{"v":1507.3333333333335,"d":"1507.33"},{"v":1521.416666666667,"d":"1521.42"},{"v":1533.0833333333335,"d":"1533.08"},1509.75,1484,1570500,{"v":0.035266974291364536,"d":"3.53%"}]
{"$rows_left_out":155}
{"sheet":"Cash Intra","index":2,"n_rows":247,"n_cols":13,"rows_kept":247,"merged":[[7,0,8,0],[7,1,8,1],[7,2,8,2],[7,3,8,3],[7,4,7,6],[7,7,7,9]]}
[]
[]
[]
[]
[{"$nulls":12},"Back to Main Page"]
["FOR INTRA DAY TRADING",{"$nulls":9},{"$f":"Main!B10","v":"2020-01-13"}]
[]
["Sr.no","Scrip","CLOSE RATE","Pivot Point","Supports",null,null,"Resistances"]
[null,null,"Point",null,"S1","S2","S3","R1","R2","R3","HIGH","LOW","Total Trade Quanity in Lakhs"]
[1,"Nifty 50",12256.8,{"v":12260.4,"d":"12260.40"},{"v":12209.599999999999,"d":"12209.60"},{"v":12162.4,"d":"12162.40"},{"v":12111.599999999999,"d":"12111.60"},{"v":12307.599999999999,"d":"12307.60"},{"v":12358.399999999998,"d":"12358.40"},{"v":12405.599999999999,"d":"12405.60"},12311.2,12213.2]
[2,"Nifty Bank",32097.4,{"v":32132.666666666668,"d":"32132.67"},{"v":31918.133333333335,"d":"31918.13"},{"v":31738.86666666667,"d":"31738.87"},{"v":31524.333333333336,"d":"31524.33"},{"v":32311.933333333334,"d":"32311.93"},{"v":32526.466666666667,"d":"32526.47"},{"v":32705.733333333334,"d":"32705.73"},32347.2,31953.4]
[3,"Nifty CPSE",1919.2,{"v":1916.0666666666666,"d":"1916.07"},{"v":1902.3333333333333,"d":"1902.33"},{"v":1885.4666666666667,"d":"1885.47"},{"v":1871.7333333333333,"d":"1871.73"},{"v":1932.9333333333332,"d":"1932.93"},{"v":1946.6666666666667,"d":"1946.67"},{"v":1963.533333333333,"d":"1963.53"},1929.8,1899.2]
[4,"Nifty Infra",3310.8,{"v":3312.7166666666667,"d":"3312.72"},{"v":3297.0833333333335,"d":"3297.08"},{"v":3283.366666666667,"d":"3283.37"},{"v":3267.7333333333336,"d":"3267.73"},{"v":3326.4333333333334,"d":"3326.43"},{"v":3342.0666666666666,"d":"3342.07"},{"v":3355.7833333333333,"d":"3355.78"},3328.35,3299]
[5,"Nifty IT",15959.9,{"v":15983.300000000001,"d":"15983.30"},{"v":15907.250000000002,"d":"15907.25"},{"v":15854.6,"d":"15854.60"},{"v":15778.550000000001,"d":"15778.55"},{"v":16035.950000000003,"d":"16035.95"},{"v":16112.000000000002,"d":"16112.00"},{"v":16164.650000000003,"d":"16164.65"},16059.35,15930.65]
[6,"Nifty PSE",3207.3,{"v":3206.966666666667,"d":"3206.97"},{"v":3185.383333333334,"d":"3185.38"},{"v":3163.466666666667,"d":"3163.47"},{"v":3141.883333333334,"d":"3141.88"},{"v":3228.883333333334,"d":"3228.88"},{"v":3250.466666666667,"d":"3250.47"},{"v":3272.383333333334,"d":"3272.38"},3228.55,3185.05]
[7,"Nifty Midcap 50",4787.7,{"v":4790.816666666667,"d":"4790.82"},{"v":4766.383333333333,"d":"4766.38"},{"v":4745.066666666667,"d":"4745.07"},{"v":4720.633333333333,"d":"4720.63"},{"v":4812.133333333333,"d":"4812.13"},{"v":4836.566666666666,"d":"4836.57"},{"v":4857.883333333333,"d":"4857.88"},4815.25,4769.5]
[8,"ACC",1511.2,{"v":1507.8166666666666,"d":"1507.82"},{"v":1490.6333333333332,"d":"1490.63"},{"v":1470.0666666666666,"d":"1470.07"},{"v":1452.8833333333332,"d":"1452.88"},{"v":1528.3833333333332,"d":"1528.38"},{"v":1545.5666666666666,"d":"1545.57"},{"v":1566.1333333333332,"d":"1566.13"},1525,1487.25,11.09054]
[9,"AUBANK",824.65,{"v":829.0500000000001,"d":"829.05"},{"v":816.6000000000001,"d":"816.60"},{"v":808.5500000000001,"d":"808.55"},{"v":796.1000000000001,"d":"796.10"},{"v":837.1000000000001,"d":"837.10"},{"v":849.5500000000002,"d":"849.55"},{"v":857.6000000000001,"d":"857.60"},841.5,821,3.02585]
[10,"ADANIPORTS",392.05,{"v":392.1166666666666,"d":"392.12"},{"v":389.9333333333332,"d":"389.93"},{"v":387.8166666666666,"d":"387.82"},{"v":385.6333333333332,"d":"385.63"},{"v":394.23333333333323,"d":"394.23"},{"v":396.41666666666663,"d":"396.42"},{"v":398.53333333333325,"d":"398.53"},394.3,390,24.05154]
[11,"ADANIPOWER",61.2,{"v":61.550000000000004,"d":"61.55"},{"v":60.60000000000001,"d":"60.60"},{"v":60.00000000000001,"d":"60.00"},{"v":59.05000000000001,"d":"59.05"},{"v":62.150000000000006,"d":"62.15"},{"v":63.10000000000001,"d":"63.10"},{"v":63.7,"d":"63.70"},62.5,60.95,69.11234]
{"$rows_left_out":228}
{"sheet":"MidCap Intra","index":3,"n_rows":545,"n_cols":13,"rows_kept":545,"merged":[[0,0,0,1],[8,0,9,0],[8,1,9,1],[8,2,9,2],[8,3,9,3],[8,4,8,6],[8,7,8,9]]}
[]
[]
[]
[]
[{"$nulls":11},"Back To Main Page"]
["FOR INTRA DAY TRADING",{"$nulls":9},{"$f":"Main!B10","v":"2020-01-13"}]
[null,null," "]
[]
["Sr.no","Scrip","CLOSE RATE","Pivot Point","Supports",null,null,"Resistances"]
[null,null,"Point",null,"S1","S2","S3","R1","R2","R3","HIGH","LOW","Total Trade Quanity in Lakhs"]
[1,"3MINDIA",21432.5,{"v":21399.833333333332,"d":"21399.83"},{"v":21274.666666666664,"d":"21274.67"},{"v":21116.833333333332,"d":"21116.83"},{"v":20991.666666666664,"d":"20991.67"},{"v":21557.666666666664,"d":"21557.67"},{"v":21682.83333333333,"d":"21682.83"},{"v":21840.666666666664,"d":"21840.67"},21525,21242,0.00671]
[2,"ACC",1511.2,{"v":1507.8166666666666,"d":"1507.82"},{"v":1490.6333333333332,"d":"1490.63"},{"v":1470.0666666666666,"d":"1470.07"},{"v":1452.8833333333332,"d":"1452.88"},{"v":1528.3833333333332,"d":"1528.38"},{"v":1545.5666666666666,"d":"1545.57"},{"v":1566.1333333333332,"d":"1566.13"},1525,1487.25,11.09054]
[3,"AIAENG",1638.3,{"v":1648.4166666666667,"d":"1648.42"},{"v":1618.8833333333334,"d":"1618.88"},{"v":1599.4666666666667,"d":"1599.47"},{"v":1569.9333333333334,"d":"1569.93"},{"v":1667.8333333333335,"d":"1667.83"},{"v":1697.3666666666668,"d":"1697.37"},{"v":1716.7833333333335,"d":"1716.78"},1677.95,1629,0.07608]
[4,"APLAPOLLO",1896,{"v":1887,"d":"1887.00"},{"v":1874,"d":"1874.00"},{"v":1852,"d":"1852.00"},{"v":1839,"d":"1839.00"},{"v":1909,"d":"1909.00"},{"v":1922,"d":"1922.00"},{"v":1944,"d":"1944.00"},1900,1865,0.15151]
[5,"AUBANK",824.65,{"v":829.0500000000001,"d":"829.05"},{"v":816.6000000000001,"d":"816.60"},{"v":808.5500000000001,"d":"808.55"},{"v":796.1000000000001,"d":"796.10"},{"v":837.1000000000001,"d":"837.10"},{"v":849.5500000000002,"d":"849.55"},{"v":857.6000000000001,"d":"857.60"},841.5,821,3.02585]
[6,"AARTIIND",863.85,{"v":879.6999999999999,"d":"879.70"},{"v":835.1499999999999,"d":"835.15"},{"v":806.4499999999999,"d":"806.45"},{"v":761.8999999999999,"d":"761.90"},{"v":908.3999999999999,"d":"908.40"},{"v":952.9499999999998,"d":"952.95"},{"v":981.6499999999999,"d":"981.65"},924.25,851,6.83302]
[7,"AAVAS",1992.9,{"v":1993.2166666666665,"d":"1993.22"},{"v":1972.433333333333,"d":"1972.43"},{"v":1951.9666666666665,"d":"1951.97"},{"v":1931.183333333333,"d":"1931.18"},{"v":2013.683333333333,"d":"2013.68"},{"v":2034.4666666666662,"d":"2034.47"},{"v":2054.933333333333,"d":"2054.93"},2014,1972.75,2.97719]
[8,"ABBOTINDIA",12534.7,{"v":12608.233333333332,"d":"12608.23"},{"v":12427.466666666664,"d":"12427.47"},{"v":12320.233333333332,"d":"12320.23"},{"v":12139.466666666664,"d":"12139.47"},{"v":12715.466666666664,"d":"12715.47"},{"v":12896.23333333333,"d":"12896.23"},{"v":13003.466666666664,"d":"13003.47"},12789,12501,0.14224]
[9,"ADANIGAS",164.25,{"v":166.08333333333334,"d":"166.08"},{"v":161.16666666666669,"d":"161.17"},{"v":158.08333333333334,"d":"158.08"},{"v":153.16666666666669,"d":"153.17"},{"v":169.16666666666669,"d":"169.17"},{"v":174.08333333333337,"d":"174.08"},{"v":177.16666666666669,"d":"177.17"},171,163,14.84336]
[10,"ADANIGREEN",220.55,{"v":228.28333333333333,"d":"228.28"},{"v":212.81666666666666,"d":"212.82"},{"v":205.08333333333334,"d":"205.08"},{"v":189.61666666666667,"d":"189.62"},{"v":236.01666666666665,"d":"236.02"},{"v":251.4833333333333,"d":"251.48"},{"v":259.21666666666664,"d":"259.22"},243.75,220.55,33.37546]
{"$rows_left_out":513}
{"sheet":"Bulk Deals","index":4,"n_rows":60,"n_cols":8,"rows_kept":60,"merged":[[4,0,4,1],[4,2,4,3],[6,1,6,2]]}
[" "]
[]
[]
[]
[]
[{"$nulls":4},"Back To Main Page"]
["Subject :","BULK DEAL",null,{"$f":"Main!B10","v":"2020-01-13"}]
[]
["Date","Scrip code","Scrip Name","Client Name","Buy / Sell","Quantity Traded","Trade Price / Wt.Avg.trade price","Exchange  "]
["2020-01-10",532368,"BCG","AKG FINVEST LIMITED","BUY",{"v":4500000,"d":"4,500,000"},{"v":5.4,"d":"5.40"},"BSE"]
["2020-01-10",532368,"BCG","GANPATI DEALCOM PVT LTD","SELL",{"v":4500000,"d":"4,500,000"},{"v":5.4,"d":"5.40"},"BSE"]
["2020-01-10",541627,"HITECHWIND","RAJA CHANDRASHEKHAR VENKATRAMAN","SELL",{"v":40000,"d":"40,000"},26.7,"BSE"]
["2020-01-10",539097,"HKG","YASH PRAFUL SHAH","BUY",{"v":4000,"d":"4,000"},46.5,"BSE"]
["2020-01-10",539097,"HKG","YASH PRAFUL SHAH","SELL",{"v":20000,"d":"20,000"},52.9,"BSE"]
["2020-01-10",524322,"KABRADG","RAMACHANDRAN MURALIDHARAN","SELL",{"v":30000,"d":"30,000"},1.03,"BSE"]
["2020-01-10",524322,"KABRADG","LAVEKUSH GADIYA","SELL",{"v":100000,"d":"100,000"},1,"BSE"]
["2020-01-10",524322,"KABRADG","SHILPA KUMAR","BUY",{"v":42050,"d":"42,050"},1.01,"BSE"]
["2020-01-10",524322,"KABRADG","DHEERAJ A KUMAR","BUY",{"v":48000,"d":"48,000"},1.01,"BSE"]
["2020-01-10",524322,"KABRADG","TEJA SHREE A","BUY",{"v":50699,"d":"50,699"},1.01,"BSE"]
["2020-01-10",500234,"KAKATCEM","MILLENNIUM STOCK BROKING PVT LTD","BUY",{"v":51705,"d":"51,705"},288.21,"BSE"]
{"$rows_left_out":41}
{"sheet":"Call Tracker (Equity & F&O)","index":5,"n_rows":296,"n_cols":18,"rows_kept":296,"merged":[[99,0,100,0],[99,1,100,1],[99,9,100,9],[99,11,100,11],[99,12,100,12],[99,13,100,13],[99,14,100,14],[109,0,110,0],[109,1,110,1],[109,9,110,9],[109,11,110,11],[109,12,110,12],[109,13,110,13],[109,14,110,14],[113,0,114,0],[113,1,114,1],[113,9,114,9],[113,11,114,11],[113,12,114,12],[113,13,114,13],[113,14,114,14],[122,0,123,0],[122,1,123,1],[122,9,123,9],[122,11,123,11],[122,12,123,12],[122,13,123,13],[122,14,123,14],[124,0,125,0],[124,1,125,1],[124,9,125,9],[124,11,125,11],[124,12,125,12],[124,13,125,13],[124,14,125,14]]}
[]
[]
[]
[]
[{"$nulls":12},"Back To Main Page"]
["Retail Research Technical Calls & Fundamental Performance Report for the month of January-2020 "]
[{"$nulls":12},{"$f":"Main!B10","v":"2020-01-13"}]
[null,"Positional  Call"]
["Sr.no","Date",null,"Company","Rec","Rec Price","Stop Loss***","Call Closed At","Target","Remark","Profit / Loss per Share","Gain / Loss  %","Status","Closed Date","NSE Closed Price"]
[1,"2019-10-07",null,"PIDILITIND","Buy{}",1367.5,1297,1399.25,"1500-1520","Profit of Rs.31.75/-",{"$f":"H10-F10","v":31.75},{"$f":"K10/F10","v":{"v":0.023217550274223033,"d":"2.32%"}},"Successful","2020-01-06",{"$nulls":3},"R"]
[2,"2019-11-14",null,"HEIDELBERG","Buy{}",186.5,174,193,"205-210","Profit of Rs.5/-",{"$f":"H11-F11","v":6.5},{"$f":"K11/F11","v":{"v":0.03485254691689008,"d":"3.49%"}},"Successful","2020-01-07",{"$nulls":3},"H"]
[3,"2019-11-18",null,"BAJAJ-AUTO","Sell",3190,3356.7,3030,"2900-2850","Profit of Rs.160/-",{"$f":"F12-H12","v":160},{"v":0.050156739811912224,"d":"5.02%"},"Successful","2020-01-06",{"$nulls":3},"R"]
[4,"2019-11-20",null,"BRITANNIA","Buy","3075-3100",2930,null,"3380-3420","Open",{"$nulls":4},{"$f":"VLOOKUP(D13,Sheet2!A76:M1715,6,0)","v":2989.75},null,null,"H"]
[5,"2019-11-21",null,"HINDUNILVR","Buy{}",2020,1917,1999.75,"2200-2250","Loss of Rs.20/-",{"$f":"H14-F14","v":-20.25},{"$f":"K14/F14","v":{"v":-0.010024752475247525,"d":"-1.00%"}},"Successful","2020-01-06",{"$nulls":3},"H"]
[6,"2019-11-27",null,"LT","Buy","1330-1340",1270,null,"1450-1500","Open",{"$nulls":4},{"$f":"VLOOKUP(D15,Sheet2!A80:M1719,6,0)","v":1324.6},null,null,"H"]
[7,"2019-12-02",null,"HAVELLS","Buy","662-667",632.7,null,"725-735","Open",{"$nulls":4},{"$f":"VLOOKUP(D16,Sheet2!A82:M1721,6,0)","v":644.95},null,null,"R"]
[8,"2019-12-06",null,"ONGC","Buy",127.5,122,132.5,140,"Part Profit of Rs.5/-",{"$f":"H17-F17","v":5},{"$f":"K17/F17","v":{"v":0.0392156862745098,"d":"3.92%"}},"Successful","2020-01-03",{"$f":"VLOOKUP(D17,Sheet2!A87:M1726,6,0)","v":124.15},null,null,"H"]
[9,"2019-12-23",null,"CANBK","Sell",227,238.3,216,"216-213","Profit of Rs.11/-",{"$f":"F18-H18","v":11},{"$f":"K18/F18","v":{"v":0.048458149779735685,"d":"4.85%"}},"Successful","2020-01-06",{"$nulls":3},"R"]
[10,"2019-12-24",null,"SBIN","Sell",334,351.3,317,"305-300","Profit of Rs.17/-",{"$f":"F19-H19","v":17},{"v":0.05089820359281437,"d":"5.09%"},"Successful","2020-01-07",{"$nulls":3},"R"]
[11,"2019-12-30",null,"EIHOTEL","Buy",140,132,147.5,"152-156","Profit of Rs.7.50/-",{"$f":"H20-F20","v":7.5},{"$f":"K20/F20","v":{"v":0.05357142857142857,"d":"5.36%"}},"Successful","2020-01-09",{"$nulls":3},"H"]
{"$rows_left_out":270}
{"sheet":"Sheet2","index":6,"n_rows":1899,"n_cols":14,"rows_kept":1899,"hidden":true}
["SYMBOL","SERIES","OPEN","HIGH","LOW","CLOSE","LAST","PREVCLOSE","TOTTRDQTY","TOTTRDVAL","TIMESTAMP","TOTALTRADES","ISIN","ISIN"]
["20MICRONS","EQ",33.45,34.9,33.45,34.3,34.25,33.4,30558,1046498.8,"2020-01-10",664,"INE144J01027"]
["21STCENMGM","EQ",16.8,17.25,16.8,16.8,16.8,17.1,2565,43254.9,"2020-01-10",56,"INE253B01015"]
["3IINFOTECH","EQ",2.5,2.55,2.35,2.4,2.45,2.55,5284620,12822033.05,"2020-01-10",1319,"INE748C01020"]
["3MINDIA","EQ",21377.3,21525,21242,21432.5,21473.9,21272.2,671,14366788.55,"2020-01-10",376,"INE470A01017"]
["3PLAND","EQ",6.25,6.8,6.25,6.8,6.8,6.5,1548,10268.15,"2020-01-10",12,"INE105C01023"]
["5PAISA","EQ",203.5,203.5,192.15,193.9,196,195.5,16648,3245987.35,"2020-01-10",484,"INE618L01018"]
["63MOONS","EQ",108,113.6,108,109,109,107.8,282346,31225662.6,"2020-01-10",5849,"INE111B01023"]
["A2ZINFRA","EQ",8,8.05,7.75,8,7.95,7.95,209133,1660687.9,"2020-01-10",298,"INE619I01012"]
["AARTIDRUGS","EQ",590,601.05,572,580.4,581.7,579.25,35003,20574177.7,"2020-01-10",1965,"INE767A01016"]
["AARTIIND","EQ",920,924.25,851,863.85,868,920.45,683302,601079848.2,"2020-01-10",28576,"INE769A01020"]
["AARVEEDEN","EQ",14.25,14.3,13.85,13.95,14,14.1,7443,104740.7,"2020-01-10",113,"INE273D01019"]
["AAVAS","EQ",1994.7,2014,1972.75,1992.9,1985,1978.35,297719,595332124.25,"2020-01-10",3000,"INE216P01012"]
["ABAN","EQ",27.2,27.2,26.25,26.5,26.55,27.05,66602,1776027.85,"2020-01-10",821,"INE421A01028"]
["ABB","EQ",1337.4,1405.8,1331.5,1372.4,1378,1322.1,147240,202992365.75,"2020-01-10",10878,"INE117A01022"]
["ABBOTINDIA","EQ",12723.25,12789,12501,12534.7,12550,12712.05,14224,179341464.8,"2020-01-10",3361,"INE358A01014"]
["ABCAPITAL","EQ",106,112.35,105.05,109.05,108.8,105.5,6251758,684114349.2,"2020-01-10",62603,"INE674K01013"]
["ABFRL","EQ",239.1,244.7,233.05,233.75,233.05,239.85,354906,84493579.85,"2020-01-10",9221,"INE647O01011"]
["ABSLBANETF","EQ",318.4,318.4,318.4,318.4,318.4,317.39,1,318.4,"2020-01-10",1,"INF209KB1O58"]
["ABSLNN50ET","EQ",289,338,289,338,338,286.94,1802,520827,"2020-01-10",760,"INF209KB1B87"]
{"$rows_left_out":1695}
{"sheet":"Sheet1","index":7,"n_rows":0,"n_cols":0,"rows_kept":0,"hidden":true}

{"sheet":"Sheet3","index":8,"n_rows":0,"n_cols":0,"rows_kept":0,"hidden":true}

{"sheet":"Sheet4","index":9,"n_rows":0,"n_cols":0,"rows_kept":0,"hidden":true}

{"sheet":"Sheet5","index":10,"n_rows":0,"n_cols":0,"rows_kept":0,"hidden":true}