{"text_format":"3","workbook":"xlsx","n_sheets":11,"sheets":["Main","Future Intra","Cash Intra","MidCap Intra","Bulk Deals","Call Tracker (Equity & F&O)","Sheet2","Sheet1","Sheet3","Sheet4","Sheet5"],"not_rendered":{"images":4,"defined_names":5},"read":"whole","date_system":"1900"}

{"sheet":"Main","index":0,"n_rows":27,"n_cols":11,"rows_kept":27}
[null,"                                                                                                 "]
{"$rows_empty":8}
[null,"2019-12-12"]
[]
[null,"Sheet No.","Template Name","Summary"]
[null,1,"Future Intra","For Intraday trading in F&O segment"]
[null,2,"Cash Intra","For Intraday trading in cash market segment"]
[null,3,"Mid-cap Intra","For Intraday trading in Mid-cap stocks"]
[null,4,"Bulk Deals","Reveals Bulk Deals carried on NSE & BSE"]
[null,5,"Call Tracker"]
{"$rows_empty":9}
[{"$nulls":10},"`"]

{"sheet":"Future Intra","index":1,"n_rows":193,"n_cols":15,"rows_kept":193,"merged":[[8,0,9,0],[8,1,9,1],[8,2,9,2],[8,5,8,7],[8,8,8,10]]}
[]
[]
[]
[]
[{"$nulls":12},"Back to Main Page"]
["FOR INTRA DAY TRADING",{"$nulls":10},{"$f":"Main!B10","v":"2019-12-12"}]
[]
[]
["Sr.no","Sector","Scrip","CLOSE RATE","Pivot Point","Supports",null,null,"Resistances"]
[null,"Sector",null,"Point","Point","S1","S2","S3","R1","R2","R3","HIGH","LOW","OI","% Change in OI"]
[1,"Index","BANKNIFTY",31314.25,{"v":31258.433333333334,"d":"31258.43"},{"v":31121.11666666667,"d":"31121.12"},{"v":30927.983333333334,"d":"30927.98"},{"v":30790.666666666668,"d":"30790.67"},{"v":31451.56666666667,"d":"31451.57"},{"v":31588.883333333335,"d":"31588.88"},{"v":31782.01666666667,"d":"31782.02"},31395.75,31065.3,1386820,{"v":-0.06327592029719689,"d":"-6.33%"}]
[2,"Index","NIFTY",11938.15,{"v":11921.449999999999,"d":"11921.45"},{"v":11888.999999999998,"d":"11889.00"},{"v":11839.849999999999,"d":"11839.85"},{"v":11807.399999999998,"d":"11807.40"},{"v":11970.599999999999,"d":"11970.60"},12003.05,{"v":12052.199999999999,"d":"12052.20"},11953.9,11872.3,14296800,{"v":0.017209270060139063,"d":"1.72%"}]
[3,"Index","NIFTYIT",{"v":15209,"d":"15209.00"},{"v":15168,"d":"15168.00"},{"v":15106,"d":"15106.00"},{"v":15003,"d":"15003.00"},{"v":14941,"d":"14941.00"},{"v":15271,"d":"15271.00"},{"v":15333,"d":"15333.00"},{"v":15436,"d":"15436.00"},15230,15065,7350,{"v":-0.19230769230769232,"d":"-19.23%"}]
[4,"Cement","ACC",1424.35,1426.95,1404.45,1384.55,1362.05,{"v":1446.8500000000001,"d":"1446.85"},{"v":1469.3500000000001,"d":"1469.35"},{"v":1489.2500000000002,"d":"1489.25"},1449.45,1407.05,3287600,{"v":0.01884219660344614,"d":"1.88%"}]
[5,"Others","ADANIENT",206.95,{"v":206.29999999999998,"d":"206.30"},{"v":204.04999999999995,"d":"204.05"},{"v":201.14999999999998,"d":"201.15"},{"v":198.89999999999995,"d":"198.90"},{"v":209.19999999999996,"d":"209.20"},{"v":211.45000000000002,"d":"211.45"},{"v":214.34999999999997,"d":"214.35"},208.55,203.4,29468000,{"v":0,"d":"0.00%"}]
[6,"Others","ADANIPORTS",370.25,{"v":369.09999999999997,"d":"369.10"},{"v":366.8999999999999,"d":"366.90"},{"v":363.54999999999995,"d":"363.55"},{"v":361.3499999999999,"d":"361.35"},{"v":372.44999999999993,"d":"372.45"},374.65,{"v":377.99999999999994,"d":"378.00"},371.3,365.75,32090000,{"v":-0.007269914926527455,"d":"-0.73%"}]
[7,"Power","ADANIPOWER",{"v":60.2,"d":"60.20"},59.85,59.35,{"v":58.5,"d":"58.50"},{"v":58,"d":"58.00"},{"v":60.7,"d":"60.70"},{"v":61.2,"d":"61.20"},{"v":62.050000000000004,"d":"62.05"},60.35,59,79520000,{"v":0.007474977828455594,"d":"0.75%"}]
[8,"Automobile","AMARAJABAT",730.45,{"v":730.3166666666667,"d":"730.32"},{"v":719.0333333333334,"d":"719.03"},{"v":707.6166666666667,"d":"707.62"},{"v":696.3333333333334,"d":"696.33"},{"v":741.7333333333335,"d":"741.73"},{"v":753.0166666666668,"d":"753.02"},{"v":764.4333333333335,"d":"764.43"},741.6,718.9,1312800,{"v":-0.002961950330371383,"d":"-0.30%"}]
[9,"Cement","AMBUJACEM",192.35,{"v":193.5,"d":"193.50"},{"v":189.6,"d":"189.60"},186.85,182.95,196.25,{"v":200.14999999999998,"d":"200.15"},{"v":202.9,"d":"202.90"},197.4,190.75,18315000,{"v":0.02763360920185159,"d":"2.76%"}]
[10,"Others","APOLLOHOSP",{"v":1396.7,"d":"1396.70"},{"v":1396.8166666666666,"d":"1396.82"},{"v":1384.8833333333332,"d":"1384.88"},{"v":1373.0666666666666,"d":"1373.07"},{"v":1361.1333333333332,"d":"1361.13"},{"v":1408.6333333333332,"d":"1408.63"},{"v":1420.5666666666666,"d":"1420.57"},{"v":1432.3833333333332,"d":"1432.38"},1408.75,1385,1514000,{"v":-0.008188666885031117,"d":"-0.82%"}]
{"$rows_left_out":159}
{"sheet":"Cash Intra","index":2,"n_rows":247,"n_cols":13,"rows_kept":247,"merged":[[7,0,8,0],[7,1,8,1],[7,2,8,2],[7,3,8,3],[7,4,7,6],[7,7,7,9]]}
[]
[]
[]
[]
[{"$nulls":12},"Back to Main Page"]
["FOR INTRA DAY TRADING",{"$nulls":9},{"$f":"Main!B10","v":"2019-12-12"}]
[]
["Sr.no","Scrip","CLOSE RATE","Pivot Point","Supports",null,null,"Resistances"]
[null,null,"Point",null,"S1","S2","S3","R1","R2","R3","HIGH","LOW","Total Trade Quanity in Lakhs"]
[1,"Nifty 50",11910.15,{"v":11888.549999999997,"d":"11888.55"},{"v":11853.899999999994,"d":"11853.90"},{"v":11797.649999999996,"d":"11797.65"},{"v":11762.999999999993,"d":"11763.00"},{"v":11944.799999999996,"d":"11944.80"},11979.45,{"v":12035.699999999997,"d":"12035.70"},11923.2,11832.3]
[2,"Nifty Bank",31256.75,{"v":31197,"d":"31197.00"},31056.15,{"v":30855.550000000003,"d":"30855.55"},{"v":30714.700000000004,"d":"30714.70"},{"v":31397.6,"d":"31397.60"},{"v":31538.449999999997,"d":"31538.45"},{"v":31739.049999999996,"d":"31739.05"},31337.85,30996.4]
[3,"Nifty CPSE",1858.25,{"v":1850.8833333333332,"d":"1850.88"},{"v":1839.1666666666665,"d":"1839.17"},{"v":1820.0833333333333,"d":"1820.08"},{"v":1808.3666666666666,"d":"1808.37"},{"v":1869.9666666666665,"d":"1869.97"},{"v":1881.6833333333332,"d":"1881.68"},{"v":1900.7666666666664,"d":"1900.77"},1862.6,1831.8]
[4,"Nifty Infra",3222.2,{"v":3216.4,"d":"3216.40"},{"v":3205.9,"d":"3205.90"},{"v":3189.6,"d":"3189.60"},{"v":3179.1,"d":"3179.10"},{"v":3232.7000000000003,"d":"3232.70"},{"v":3243.2000000000003,"d":"3243.20"},{"v":3259.5000000000005,"d":"3259.50"},3226.9,3200.1]
[5,"Nifty IT",15130.3,{"v":15080.433333333334,"d":"15080.43"},{"v":15013.516666666668,"d":"15013.52"},{"v":14896.733333333334,"d":"14896.73"},{"v":14829.816666666668,"d":"14829.82"},{"v":15197.216666666669,"d":"15197.22"},{"v":15264.133333333333,"d":"15264.13"},{"v":15380.91666666667,"d":"15380.92"},15147.35,14963.65]
[6,"Nifty PSE",3104.9,{"v":3095.9166666666665,"d":"3095.92"},{"v":3079.433333333333,"d":"3079.43"},{"v":3053.9666666666662,"d":"3053.97"},{"v":3037.4833333333327,"d":"3037.48"},{"v":3121.383333333333,"d":"3121.38"},{"v":3137.866666666667,"d":"3137.87"},{"v":3163.3333333333335,"d":"3163.33"},3112.4,3070.45]
[7,"Nifty Midcap 50",4542.3,{"v":4530.733333333334,"d":"4530.73"},{"v":4514.516666666667,"d":"4514.52"},{"v":4486.733333333334,"d":"4486.73"},{"v":4470.516666666667,"d":"4470.52"},{"v":4558.516666666667,"d":"4558.52"},{"v":4574.7333333333345,"d":"4574.73"},{"v":4602.516666666667,"d":"4602.52"},4546.95,4502.95]
[8,"ACC",1418.85,{"v":1422.1666666666667,"d":"1422.17"},{"v":1397.8333333333335,"d":"1397.83"},{"v":1376.8166666666668,"d":"1376.82"},{"v":1352.4833333333336,"d":"1352.48"},{"v":1443.1833333333334,"d":"1443.18"},{"v":1467.5166666666669,"d":"1467.52"},{"v":1488.5333333333333,"d":"1488.53"},1446.5,1401.15,8.71405]
[9,"AUBANK",800.25,{"v":797.9,"d":"797.90"},{"v":788.9499999999999,"d":"788.95"},777.65,{"v":768.6999999999999,"d":"768.70"},{"v":809.1999999999999,"d":"809.20"},818.15,{"v":829.4499999999999,"d":"829.45"},806.85,786.6,1.90114]
[10,"ADANIPORTS",369.7,{"v":368.51666666666665,"d":"368.52"},{"v":366.1833333333333,"d":"366.18"},{"v":362.66666666666663,"d":"362.67"},{"v":360.33333333333326,"d":"360.33"},{"v":372.0333333333333,"d":"372.03"},{"v":374.3666666666667,"d":"374.37"},{"v":377.8833333333333,"d":"377.88"},370.85,365,17.10192]
[11,"ADANIPOWER",60.05,{"v":59.71666666666667,"d":"59.72"},{"v":59.083333333333336,"d":"59.08"},{"v":58.11666666666667,"d":"58.12"},{"v":57.483333333333334,"d":"57.48"},{"v":60.68333333333334,"d":"60.68"},{"v":61.31666666666666,"d":"61.32"},{"v":62.28333333333334,"d":"62.28"},60.35,58.75,67.34695]
{"$rows_left_out":228}
{"sheet":"MidCap Intra","index":3,"n_rows":545,"n_cols":13,"rows_kept":545,"merged":[[0,0,0,1],[8,0,9,0],[8,1,9,1],[8,2,9,2],[8,3,9,3],[8,4,8,6],[8,7,8,9]]}
[]
[]
[]
[]
[{"$nulls":11},"Back To Main Page"]
["FOR INTRA DAY TRADING",{"$nulls":9},{"$f":"Main!B10","v":"2019-12-12"}]
[null,null," "]
[]
["Sr.no","Scrip","CLOSE RATE","Pivot Point","Supports",null,null,"Resistances"]
[null,null,"Point",null,"S1","S2","S3","R1","R2","R3","HIGH","LOW","Total Trade Quanity in Lakhs"]
[1,"3MINDIA",21143.35,{"v":21100.166666666668,"d":"21100.17"},{"v":20943.183333333334,"d":"20943.18"},{"v":20743.016666666666,"d":"20743.02"},{"v":20586.033333333333,"d":"20586.03"},{"v":21300.333333333336,"d":"21300.33"},{"v":21457.316666666666,"d":"21457.32"},{"v":21657.483333333337,"d":"21657.48"},21257.15,20900,0.01402]
[2,"ACC",1418.85,{"v":1422.1666666666667,"d":"1422.17"},{"v":1397.8333333333335,"d":"1397.83"},{"v":1376.8166666666668,"d":"1376.82"},{"v":1352.4833333333336,"d":"1352.48"},{"v":1443.1833333333334,"d":"1443.18"},{"v":1467.5166666666669,"d":"1467.52"},{"v":1488.5333333333333,"d":"1488.53"},1446.5,1401.15,8.71405]
[3,"AIAENG",1623.45,{"v":1626,"d":"1626.00"},1612.55,{"v":1601.6499999999999,"d":"1601.65"},{"v":1588.1999999999998,"d":"1588.20"},{"v":1636.9,"d":"1636.90"},1650.35,{"v":1661.2500000000002,"d":"1661.25"},1639.45,1615.1,0.03411]
[4,"APLAPOLLO",1600.3,{"v":1602.3666666666668,"d":"1602.37"},{"v":1584.7333333333336,"d":"1584.73"},{"v":1569.1666666666667,"d":"1569.17"},{"v":1551.5333333333335,"d":"1551.53"},{"v":1617.9333333333336,"d":"1617.93"},{"v":1635.5666666666668,"d":"1635.57"},{"v":1651.1333333333337,"d":"1651.13"},1620,1586.8,0.11975]
[5,"AUBANK",800.25,{"v":797.9,"d":"797.90"},{"v":788.9499999999999,"d":"788.95"},777.65,{"v":768.6999999999999,"d":"768.70"},{"v":809.1999999999999,"d":"809.20"},818.15,{"v":829.4499999999999,"d":"829.45"},806.85,786.6,1.90114]
[6,"AAVAS",1843.95,1839.55,{"v":1809.1,"d":"1809.10"},1774.25,{"v":1743.8,"d":"1743.80"},{"v":1874.3999999999999,"d":"1874.40"},{"v":1904.8500000000001,"d":"1904.85"},{"v":1939.6999999999998,"d":"1939.70"},1870,1804.7,2.79746]
[7,"ABBOTINDIA",12554.4,{"v":12499.566666666666,"d":"12499.57"},{"v":12384.083333333332,"d":"12384.08"},{"v":12213.766666666666,"d":"12213.77"},{"v":12098.283333333333,"d":"12098.28"},{"v":12669.883333333331,"d":"12669.88"},{"v":12785.366666666665,"d":"12785.37"},{"v":12955.68333333333,"d":"12955.68"},12615.05,12329.25,0.10195]
[8,"ADANIGAS",152,152.85,{"v":150.2,"d":"150.20"},{"v":148.4,"d":"148.40"},145.75,{"v":154.64999999999998,"d":"154.65"},{"v":157.3,"d":"157.30"},{"v":159.09999999999997,"d":"159.10"},155.5,151.05,8.25701]
[9,"ADANIGREEN",132.55,{"v":130.98333333333332,"d":"130.98"},{"v":128.76666666666665,"d":"128.77"},{"v":124.98333333333333,"d":"124.98"},{"v":122.76666666666667,"d":"122.77"},{"v":134.76666666666665,"d":"134.77"},{"v":136.9833333333333,"d":"136.98"},{"v":140.76666666666662,"d":"140.77"},133.2,127.2,23.19859]
[10,"ADANIPORTS",369.7,{"v":368.51666666666665,"d":"368.52"},{"v":366.1833333333333,"d":"366.18"},{"v":362.66666666666663,"d":"362.67"},{"v":360.33333333333326,"d":"360.33"},{"v":372.0333333333333,"d":"372.03"},{"v":374.3666666666667,"d":"374.37"},{"v":377.8833333333333,"d":"377.88"},370.85,365,17.10192]
{"$rows_left_out":513}
{"sheet":"Bulk Deals","index":4,"n_rows":81,"n_cols":8,"rows_kept":81,"merged":[[4,0,4,1],[4,2,4,3],[6,1,6,2]]}
[" "]
[]
[]
[]
[]
[{"$nulls":4},"Back To Main Page"]
["Subject :","BULK DEAL",null,{"$f":"Main!B10","v":"2019-12-12"}]
[]
["Date","Scrip code","Scrip Name","Client Name","Buy / Sell","Quantity Traded","Trade Price / Wt.Avg.trade price","Exchange  "]
["2019-12-11",538812,"AANCHALISP","BHAVISHYA ECOMMERCE PRIVATE LIMITED","BUY",{"v":114443,"d":"114,443"},15.99,"BSE"]
["2019-12-11",538812,"AANCHALISP","BHAVISHYA ECOMMERCE PRIVATE LIMITED","SELL",{"v":132869,"d":"132,869"},16.01,"BSE"]
["2019-12-11",511463,"ALEXANDER","VANDNA ANIRUDH SETHI","BUY",{"v":5238,"d":"5,238"},18.04,"BSE"]
["2019-12-11",511463,"ALEXANDER","KAHAR NIKLESH KANAIYABHAI","BUY",{"v":250000,"d":"250,000"},18.06,"BSE"]
["2019-12-11",511463,"ALEXANDER","VANDNA ANIRUDH SETHI","SELL",{"v":240000,"d":"240,000"},18.06,"BSE"]
["2019-12-11",539621,"BCLENTERPR","ARYADEEP INFRAHOMES PRIVATE LIMITED","BUY",{"v":109250,"d":"109,250"},12.31,"BSE"]
["2019-12-11",504340,"CONFINT","VISHANKVILASPATIL","BUY",{"v":104736,"d":"104,736"},0.5,"BSE"]
["2019-12-11",504340,"CONFINT","VICTORY SALES PRIVATE LIMITED","SELL",{"v":91950,"d":"91,950"},{"v":0.5,"d":"0.50"},"BSE"]
["2019-12-11",524624,"GAGAN","SHIMLA RANI","SELL",{"v":29500,"d":"29,500"},8.25,"BSE"]
["2019-12-11",524624,"GAGAN","KUL RATTAN MAHESHWARY","BUY",{"v":37570,"d":"37,570"},8.25,"BSE"]
["2019-12-11",536709,"INDRENEW","DHAVAL JAYSUKLAL GADANI","BUY",{"v":16670,"d":"16,670"},7.85,"BSE"]
{"$rows_left_out":62}
{"sheet":"Call Tracker (Equity & F&O)","index":5,"n_rows":317,"n_cols":18,"rows_kept":317,"merged":[[97,0,98,0],[97,1,98,1],[97,9,98,9],[97,11,98,11],[97,12,98,12],[97,13,98,13],[97,14,98,14],[99,0,100,0],[99,1,100,1],[99,9,100,9],[99,11,100,11],[99,12,100,12],[99,13,100,13],[99,14,100,14],[101,0,102,0],[101,1,102,1],[101,9,102,9],[101,11,102,11],[101,12,102,12],[101,13,102,13],[101,14,102,14],[103,0,104,0],[103,1,104,1],[103,9,104,9],[103,11,104,11],[103,12,104,12],[103,13,104,13],[103,14,104,14],[105,0,106,0],[105,1,106,1],[105,9,106,9],[105,11,106,11],[105,12,106,12],[105,13,106,13],[105,14,106,14],[107,0,108,0],[107,1,108,1],[107,9,108,9],[107,11,108,11],[107,12,108,12],[107,13,108,13],[107,14,108,14],[109,0,110,0],[109,1,110,1],[109,9,110,9],[109,11,110,11],[109,12,110,12],[109,13,110,13],[109,14,110,14],[111,0,112,0],[111,1,112,1],[111,9,112,9],[111,11,112,11],[111,12,112,12],[111,13,112,13],[111,14,112,14],[131,0,132,0],[131,1,132,1],[131,9,132,9],[131,11,132,11],[131,12,132,12],[131,13,132,13],[131,14,132,14],[133,0,134,0],[133,1,134,1],[133,9,134,9],[133,11,134,11],[133,12,134,12],[133,13,134,13],[133,14,134,14],[135,0,136,0],[135,1,136,1],[135,9,136,9],[135,11,136,11],[135,12,136,12],[135,13,136,13],[135,14,136,14]]}
[]
[]
[]
[]
[{"$nulls":12},"Back To Main Page"]
["Retail Research Technical Calls & Fundamental Performance Report for the month of December-2019 "]
[{"$nulls":12},{"$f":"Main!B10","v":"2019-12-12"}]
[null,"Positional  Call"]
["Sr.no","Date",null,"Company","Rec","Rec Price","Stop Loss***","Call Closed At","Target","Remark","Profit / Loss per Share","Gain / Loss  %","Status","Closed Date","NSE Closed Price"]
[1,"2019-10-07",null,"PIDILITIND","Buy{}",1367.5,1297,1413.5,"1500-1520","Part Profit of Rs.46/-",{"$f":"H10-F10","v":46},{"$f":"K10/F10","v":{"v":0.03363802559414991,"d":"3.36%"}},"Successful","2019-10-31",{"$f":"VLOOKUP(D10,Sheet2!A51:M1690,6,0)","v":1330.35},null,null,"R"]
[2,"2019-11-11",null,"POWERGRID","Buy{}",192,183,190,"208-212","Loss of Rs.2/-",{"$f":"H11-F11","v":-2},{"$f":"K11/F11","v":{"v":-0.010416666666666666,"d":"-1.04%"}},"Unsuccessful","2019-12-11",{"$nulls":3},"R"]
[3,"2019-11-14",null,"HEIDELBERG","Buy{}",186.5,174,194.5,"205-210","Part Profit of Rs.8/-",{"$f":"H12-F12","v":8},{"$f":"K12/F12","v":{"v":0.04289544235924933,"d":"4.29%"}},"Successful","2019-11-20",{"$f":"VLOOKUP(D12,Sheet2!A71:M1710,6,0)","v":177.2},null,null,"H"]
[4,"2019-11-18",null,"BAJAJ-AUTO","Sell","3180-3200",3356.7,null,"2900-2850","Open",{"$nulls":4},{"$f":"VLOOKUP(D13,Sheet2!A74:M1713,6,0)","v":3268.65},null,null,"R"]
[5,"2019-11-18",null,"THERMAX","Buy","1025-1035",977,null,"1120-1140","Open",{"$nulls":4},{"$f":"VLOOKUP(D14,Sheet2!A75:M1714,6,0)","v":1001.95},null,null,"H"]
[6,"2019-11-20",null,"BRITANNIA","Buy","3075-3100",2930,null,"3380-3420","Open",{"$nulls":4},{"$f":"VLOOKUP(D15,Sheet2!A76:M1715,6,0)","v":3041},null,null,"H"]
[7,"2019-11-21",null,"HINDUNILVR","Buy",2020,1917,2082,"2200-2250","Part Profit of Rs.62/-",{"$f":"H16-F16","v":62},{"$f":"K16/F16","v":{"v":0.030693069306930693,"d":"3.07%"}},"Successful","2019-11-27",{"$f":"VLOOKUP(D16,Sheet2!A77:M1716,6,0)","v":2010.45},null,null,"H"]
[8,"2019-11-22",null,"GODREJPROP","Buy",885,837.7,915,"965-985","Part Profit of Rs.30/-",{"$f":"H17-F17","v":30},{"$f":"K17/F17","v":{"v":0.03389830508474576,"d":"3.39%"}},"Successful","2019-11-28",{"$f":"VLOOKUP(D17,Sheet2!A79:M1718,6,0)","v":902.15},null,null,"R"]
[9,"2019-11-27",null,"LT","Buy","1330-1340",1270,null,"1450-1500","Open",{"$nulls":4},{"$f":"VLOOKUP(D18,Sheet2!A80:M1719,6,0)","v":1264.3},null,null,"H"]
[10,"2019-12-02",null,"TCS","Buy",2030,1895,2092,"2200-2250","Part Profit of Rs.62/-",{"$f":"H19-F19","v":62},{"$f":"K19/F19","v":{"v":0.030541871921182268,"d":"3.05%"}},"Successful","2019-12-05",{"$f":"VLOOKUP(D19,Sheet2!A81:M1720,6,0)","v":2041.9},null,"`","H"]
[11,"2019-12-02",null,"HAVELLS","Buy","662-667",632.7,null,"725-735","Open",{"$nulls":4},{"$f":"VLOOKUP(D20,Sheet2!A82:M1721,6,0)","v":635.45},null,null,"R"]
{"$rows_left_out":253}
{"sheet":"Sheet2","index":6,"n_rows":1899,"n_cols":14,"rows_kept":1899,"hidden":true}
["SYMBOL","SERIES","OPEN","HIGH","LOW","CLOSE","LAST","PREVCLOSE","TOTTRDQTY","TOTTRDVAL","TIMESTAMP","TOTALTRADES","ISIN","ISIN"]
["20MICRONS","EQ",32.05,32.4,31.65,32.25,32.05,32.1,20018,639128.3,"2019-12-11",305,"INE144J01027"]
["21STCENMGM","EQ",13.5,13.5,13.5,13.5,13.5,13.6,10,135,"2019-12-11",1,"INE253B01015"]
["3IINFOTECH","EQ",1.95,1.95,1.9,1.95,1.95,1.95,448628,865715,"2019-12-11",588,"INE748C01020"]
["3MINDIA","EQ",21200,21257.15,20900,21143.35,21179,21131.25,1402,29598584.95,"2019-12-11",667,"INE470A01017"]
["5PAISA","EQ",168.7,174.2,162.1,172.85,173.25,171.5,7885,1344740.35,"2019-12-11",297,"INE618L01018"]
["63MOONS","EQ",101.45,107.95,100.1,101.1,101,100.75,320718,33330935.8,"2019-12-11",6741,"INE111B01023"]
["A2ZINFRA","EQ",8.05,8.65,7.95,8.1,8.1,7.9,225367,1845314.85,"2019-12-11",535,"INE619I01012"]
["AARTIDRUGS","EQ",514.4,515,501.6,503.3,502.3,514.35,3811,1929962.2,"2019-12-11",377,"INE767A01016"]
["AARTIIND","EQ",787.8,798,778.2,780.95,783.8,784.65,89174,70256752.6,"2019-12-11",4669,"INE769A01020"]
["AARVEEDEN","EQ",12.35,12.35,11.1,11.2,11.35,11.6,7337,83974.3,"2019-12-11",204,"INE273D01019"]
["AAVAS","EQ",1812,1870,1804.7,1843.95,1848.65,1795.85,279746,508036264.2,"2019-12-11",6844,"INE216P01012"]
["ABAN","EQ",24.65,24.65,23.5,23.75,23.65,24.05,27858,665663.45,"2019-12-11",288,"INE421A01028"]
["ABB","EQ",1450.5,1469.8,1440,1458.9,1452,1450.4,77994,113255076.7,"2019-12-11",2627,"INE117A01022"]
["ABBOTINDIA","EQ",12500,12615.05,12329.25,12554.4,12580,12508.05,10195,127201520.7,"2019-12-11",2676,"INE358A01014"]
["ABCAPITAL","BE",90.15,96.5,88.55,95.8,95.9,91.95,1409428,133281257.3,"2019-12-11",5965,"INE674K01013"]
["ABFRL","EQ",224.45,226.5,221.4,225.35,224.1,224.9,692762,155357597.25,"2019-12-11",16933,"INE647O01011"]
["ABSLBANETF","EQ",312.67,312.67,311.31,311.31,311.31,309.78,2,623.98,"2019-12-11",2,"INF209KB1O58"]
["ACC","EQ",1439.8,1446.5,1401.15,1418.85,1417,1436.35,871405,1235287257.5,"2019-12-11",28685,"INE012A01025"]
["ACCELYA","EQ",948.05,952,942,949.95,950,949.5,32220,30597222.65,"2019-12-11",461,"INE793A01012"]
{"$rows_left_out":1699}
{"sheet":"Sheet1","index":7,"n_rows":0,"n_cols":0,"rows_kept":0,"hidden":true}

{"sheet":"Sheet3","index":8,"n_rows":0,"n_cols":0,"rows_kept":0,"hidden":true}

{"sheet":"Sheet4","index":9,"n_rows":0,"n_cols":0,"rows_kept":0,"hidden":true}

{"sheet":"Sheet5","index":10,"n_rows":0,"n_cols":0,"rows_kept":0,"hidden":true}