{"text_format":"3","workbook":"xlsx","n_sheets":11,"sheets":["Main","Future Intra","Cash Intra","MidCap Intra","Bulk Deals","Call Tracker (Equity & F&O)","Sheet2","Sheet1","Sheet3","Sheet4","Sheet5"],"not_rendered":{"images":4,"defined_names":5},"read":"whole","date_system":"1900"}

{"sheet":"Main","index":0,"n_rows":27,"n_cols":11,"rows_kept":27}
[null,"                                                                                                 "]
{"$rows_empty":8}
[null,"2019-09-12"]
[]
[null,"Sheet No.","Template Name","Summary"]
[null,1,"Future Intra","For Intraday trading in F&O segment"]
[null,2,"Cash Intra","For Intraday trading in cash market segment"]
[null,3,"Mid-cap Intra","For Intraday trading in Mid-cap stocks"]
[null,4,"Bulk Deals","Reveals Bulk Deals carried on NSE & BSE"]
[null,5,"Call Tracker"]
{"$rows_empty":9}
[{"$nulls":10},"`"]

{"sheet":"Future Intra","index":1,"n_rows":205,"n_cols":15,"rows_kept":205,"merged":[[8,0,9,0],[8,1,9,1],[8,2,9,2],[8,5,8,7],[8,8,8,10]]}
[]
[]
[]
[]
[{"$nulls":12},"Back to Main Page"]
["FOR INTRA DAY TRADING",{"$nulls":10},{"$f":"Main!B10","v":"2019-09-12"}]
[]
[]
["Sr.no","Sector","Scrip","CLOSE RATE","Pivot Point","Supports",null,null,"Resistances"]
[null,"Sector",null,"Point","Point","S1","S2","S3","R1","R2","R3","HIGH","LOW","OI","% Change in OI"]
[1,"Index","BANKNIFTY",{"v":27830.2,"d":"27830.20"},{"v":27773.86666666667,"d":"27773.87"},{"v":27650.733333333337,"d":"27650.73"},{"v":27471.26666666667,"d":"27471.27"},{"v":27348.13333333334,"d":"27348.13"},{"v":27953.333333333336,"d":"27953.33"},{"v":28076.466666666667,"d":"28076.47"},{"v":28255.933333333334,"d":"28255.93"},27897,27594.4,1784880,{"v":0.03373025066024186,"d":"3.37%"}]
[2,"Index","NIFTY",{"v":11060.8,"d":"11060.80"},{"v":11058.699999999999,"d":"11058.70"},{"v":11028.949999999997,"d":"11028.95"},{"v":10997.099999999999,"d":"10997.10"},{"v":10967.349999999997,"d":"10967.35"},{"v":11090.549999999997,"d":"11090.55"},{"v":11120.300000000001,"d":"11120.30"},{"v":11152.149999999998,"d":"11152.15"},11088.45,11026.85,18340350,{"v":0.02482670756954747,"d":"2.48%"}]
[3,"Index","NIFTYIT",{"v":15779,"d":"15779.00"},{"v":15818.666666666666,"d":"15818.67"},{"v":15712.333333333332,"d":"15712.33"},{"v":15645.666666666666,"d":"15645.67"},{"v":15539.333333333332,"d":"15539.33"},{"v":15885.333333333332,"d":"15885.33"},{"v":15991.666666666664,"d":"15991.67"},{"v":16058.333333333332,"d":"16058.33"},15925,15752,11650,{"v":0.2802197802197802,"d":"28.02%"}]
[4,"Cement","ACC",{"v":1491.8,"d":"1491.80"},{"v":1489.2166666666665,"d":"1489.22"},{"v":1480.683333333333,"d":"1480.68"},{"v":1469.5666666666664,"d":"1469.57"},{"v":1461.0333333333328,"d":"1461.03"},{"v":1500.333333333333,"d":"1500.33"},{"v":1508.8666666666663,"d":"1508.87"},{"v":1519.9833333333331,"d":"1519.98"},1497.75,1478.1,2298800,{"v":0.023144027060708564,"d":"2.31%"}]
[5,"Others","ADANIENT",144.05,{"v":143.06666666666666,"d":"143.07"},{"v":141.28333333333333,"d":"141.28"},{"v":138.51666666666668,"d":"138.52"},{"v":136.73333333333335,"d":"136.73"},{"v":145.83333333333331,"d":"145.83"},{"v":147.61666666666662,"d":"147.62"},{"v":150.3833333333333,"d":"150.38"},144.85,140.3,26364000,{"v":-0.008574007220216607,"d":"-0.86%"}]
[6,"Others","ADANIPORTS",373.15,{"v":371.76666666666665,"d":"371.77"},{"v":368.6833333333333,"d":"368.68"},{"v":364.21666666666664,"d":"364.22"},{"v":361.13333333333327,"d":"361.13"},{"v":376.2333333333333,"d":"376.23"},{"v":379.31666666666666,"d":"379.32"},{"v":383.7833333333333,"d":"383.78"},374.85,367.3,16075000,{"v":-0.005875077303648732,"d":"-0.59%"}]
[7,"Power","ADANIPOWER",{"v":63.8,"d":"63.80"},{"v":63.083333333333336,"d":"63.08"},{"v":61.46666666666667,"d":"61.47"},{"v":59.13333333333333,"d":"59.13"},{"v":57.516666666666666,"d":"57.52"},{"v":65.41666666666667,"d":"65.42"},{"v":67.03333333333333,"d":"67.03"},{"v":69.36666666666667,"d":"69.37"},64.7,60.75,97340000,{"v":0.005786319487497416,"d":"0.58%"}]
[8,"Automobile","AMARAJABAT",651.75,{"v":648.9499999999999,"d":"648.95"},{"v":643.7999999999998,"d":"643.80"},{"v":635.8499999999999,"d":"635.85"},{"v":630.6999999999998,"d":"630.70"},{"v":656.8999999999999,"d":"656.90"},662.05,{"v":669.9999999999999,"d":"670.00"},654.1,641,1498700,{"v":0.025383141762452106,"d":"2.54%"}]
[9,"Cement","AMBUJACEM",{"v":198.2,"d":"198.20"},{"v":197.83333333333334,"d":"197.83"},{"v":196.66666666666669,"d":"196.67"},{"v":195.13333333333335,"d":"195.13"},{"v":193.9666666666667,"d":"193.97"},{"v":199.36666666666667,"d":"199.37"},{"v":200.53333333333336,"d":"200.53"},{"v":202.06666666666666,"d":"202.07"},199,196.3,22832500,{"v":3.2858707557502739E-4,"d":"0.03%"}]
[10,"Others","APOLLOHOSP",{"v":1477.7,"d":"1477.70"},{"v":1478.3500000000001,"d":"1478.35"},{"v":1461.8500000000004,"d":"1461.85"},{"v":1446.0000000000002,"d":"1446.00"},{"v":1429.5000000000005,"d":"1429.50"},{"v":1494.2000000000003,"d":"1494.20"},{"v":1510.6999999999998,"d":"1510.70"},{"v":1526.5500000000002,"d":"1526.55"},1494.85,1462.5,1743500,{"v":0.11121733588272785,"d":"11.12%"}]
{"$rows_left_out":172}
{"sheet":"Cash Intra","index":2,"n_rows":247,"n_cols":13,"rows_kept":247,"merged":[[7,0,8,0],[7,1,8,1],[7,2,8,2],[7,3,8,3],[7,4,7,6],[7,7,7,9]]}
[]
[]
[]
[]
[{"$nulls":12},"Back to Main Page"]
["FOR INTRA DAY TRADING",{"$nulls":9},{"$f":"Main!B10","v":"2019-09-12"}]
[]
["Sr.no","Scrip","CLOSE RATE","Pivot Point","Supports",null,null,"Resistances"]
[null,null,"Point",null,"S1","S2","S3","R1","R2","R3","HIGH","LOW","Total Trade Quanity in Lakhs"]
[1,"Nifty 50",11035.7,{"v":11034.050000000001,"d":"11034.05"},{"v":11013.300000000003,"d":"11013.30"},{"v":10990.900000000001,"d":"10990.90"},{"v":10970.150000000003,"d":"10970.15"},{"v":11056.450000000003,"d":"11056.45"},{"v":11077.199999999999,"d":"11077.20"},{"v":11099.600000000002,"d":"11099.60"},11054.8,11011.65]
[2,"Nifty Bank",27776.2,{"v":27719.166666666668,"d":"27719.17"},{"v":27608.683333333334,"d":"27608.68"},{"v":27441.166666666668,"d":"27441.17"},{"v":27330.683333333334,"d":"27330.68"},{"v":27886.683333333334,"d":"27886.68"},{"v":27997.166666666664,"d":"27997.17"},{"v":28164.683333333334,"d":"28164.68"},27829.65,27551.65]
[3,"Nifty CPSE",1919.05,{"v":1931.8666666666668,"d":"1931.87"},{"v":1898.8333333333335,"d":"1898.83"},{"v":1878.6166666666668,"d":"1878.62"},{"v":1845.5833333333335,"d":"1845.58"},{"v":1952.0833333333335,"d":"1952.08"},{"v":1985.1166666666668,"d":"1985.12"},{"v":2005.3333333333335,"d":"2005.33"},1964.9,1911.65]
[4,"Nifty Infra",3074.55,{"v":3078.683333333333,"d":"3078.68"},{"v":3060.516666666666,"d":"3060.52"},{"v":3046.483333333333,"d":"3046.48"},{"v":3028.316666666666,"d":"3028.32"},{"v":3092.716666666666,"d":"3092.72"},{"v":3110.8833333333328,"d":"3110.88"},{"v":3124.9166666666656,"d":"3124.92"},3096.85,3064.65]
[5,"Nifty IT",15701.8,{"v":15775.433333333334,"d":"15775.43"},{"v":15595.666666666668,"d":"15595.67"},{"v":15489.533333333333,"d":"15489.53"},{"v":15309.766666666666,"d":"15309.77"},{"v":15881.56666666667,"d":"15881.57"},{"v":16061.333333333336,"d":"16061.33"},{"v":16167.46666666667,"d":"16167.47"},15955.2,15669.3]
[6,"Nifty PSE",3126.35,3139.15,3103.05,3079.75,3043.65,{"v":3162.4500000000003,"d":"3162.45"},{"v":3198.5499999999997,"d":"3198.55"},{"v":3221.8500000000004,"d":"3221.85"},3175.25,3115.85]
[7,"Nifty Midcap 50",4365.1,{"v":4351.849999999999,"d":"4351.85"},{"v":4333.949999999999,"d":"4333.95"},{"v":4302.799999999999,"d":"4302.80"},{"v":4284.899999999999,"d":"4284.90"},{"v":4382.999999999999,"d":"4383.00"},{"v":4400.899999999999,"d":"4400.90"},{"v":4432.049999999999,"d":"4432.05"},4369.75,4320.7]
[8,"ABB",1328.4,{"v":1331.4666666666667,"d":"1331.47"},{"v":1316.9333333333334,"d":"1316.93"},{"v":1305.4666666666667,"d":"1305.47"},{"v":1290.9333333333334,"d":"1290.93"},{"v":1342.9333333333334,"d":"1342.93"},{"v":1357.4666666666667,"d":"1357.47"},{"v":1368.9333333333334,"d":"1368.93"},1346,1320,0.35256]
[9,"ACC",1485,{"v":1484.8666666666668,"d":"1484.87"},{"v":1475.7333333333336,"d":"1475.73"},{"v":1466.4666666666667,"d":"1466.47"},{"v":1457.3333333333335,"d":"1457.33"},{"v":1494.1333333333337,"d":"1494.13"},{"v":1503.2666666666669,"d":"1503.27"},{"v":1512.5333333333338,"d":"1512.53"},1494,1475.6,3.97144]
[10,"AUBANK",662.6,{"v":664.1833333333334,"d":"664.18"},{"v":658.5166666666668,"d":"658.52"},{"v":654.4333333333334,"d":"654.43"},{"v":648.7666666666668,"d":"648.77"},{"v":668.2666666666668,"d":"668.27"},{"v":673.9333333333333,"d":"673.93"},{"v":678.0166666666668,"d":"678.02"},669.85,660.1,0.77402]
[11,"ADANIPORTS",373.35,{"v":371.59999999999997,"d":"371.60"},{"v":368.24999999999994,"d":"368.25"},363.15,{"v":359.79999999999995,"d":"359.80"},{"v":376.69999999999993,"d":"376.70"},{"v":380.04999999999995,"d":"380.05"},{"v":385.1499999999999,"d":"385.15"},374.95,366.5,33.41392]
{"$rows_left_out":228}
{"sheet":"MidCap Intra","index":3,"n_rows":545,"n_cols":13,"rows_kept":545,"merged":[[0,0,0,1],[8,0,9,0],[8,1,9,1],[8,2,9,2],[8,3,9,3],[8,4,8,6],[8,7,8,9]]}
[]
[]
[]
[]
[{"$nulls":11},"Back To Main Page"]
["FOR INTRA DAY TRADING",{"$nulls":9},{"$f":"Main!B10","v":"2019-09-12"}]
[null,null," "]
[]
["Sr.no","Scrip","CLOSE RATE","Pivot Point","Supports",null,null,"Resistances"]
[null,null,"Point",null,"S1","S2","S3","R1","R2","R3","HIGH","LOW","Total Trade Quanity in Lakhs"]
[1,"3MINDIA",20260.55,{"v":20403.516666666666,"d":"20403.52"},{"v":20007.033333333333,"d":"20007.03"},{"v":19753.516666666666,"d":"19753.52"},{"v":19357.033333333333,"d":"19357.03"},{"v":20657.033333333333,"d":"20657.03"},{"v":21053.516666666663,"d":"21053.52"},{"v":21307.033333333333,"d":"21307.03"},20800,20150,0.04281]
[2,"ABB",1328.4,{"v":1331.4666666666667,"d":"1331.47"},{"v":1316.9333333333334,"d":"1316.93"},{"v":1305.4666666666667,"d":"1305.47"},{"v":1290.9333333333334,"d":"1290.93"},{"v":1342.9333333333334,"d":"1342.93"},{"v":1357.4666666666667,"d":"1357.47"},{"v":1368.9333333333334,"d":"1368.93"},1346,1320,0.35256]
[3,"ACC",1485,{"v":1484.8666666666668,"d":"1484.87"},{"v":1475.7333333333336,"d":"1475.73"},{"v":1466.4666666666667,"d":"1466.47"},{"v":1457.3333333333335,"d":"1457.33"},{"v":1494.1333333333337,"d":"1494.13"},{"v":1503.2666666666669,"d":"1503.27"},{"v":1512.5333333333338,"d":"1512.53"},1494,1475.6,3.97144]
[4,"AIAENG",1510.25,{"v":1514.3833333333332,"d":"1514.38"},{"v":1499.8666666666663,"d":"1499.87"},{"v":1489.4833333333331,"d":"1489.48"},{"v":1474.9666666666662,"d":"1474.97"},{"v":1524.7666666666664,"d":"1524.77"},{"v":1539.2833333333333,"d":"1539.28"},{"v":1549.6666666666665,"d":"1549.67"},1528.9,1504,0.23151]
[5,"APLAPOLLO",1300.35,{"v":1297.0666666666666,"d":"1297.07"},{"v":1280.1333333333332,"d":"1280.13"},{"v":1259.9166666666665,"d":"1259.92"},{"v":1242.9833333333331,"d":"1242.98"},{"v":1317.2833333333333,"d":"1317.28"},{"v":1334.2166666666667,"d":"1334.22"},{"v":1354.4333333333334,"d":"1354.43"},1314,1276.85,0.26044]
[6,"AUBANK",662.6,{"v":664.1833333333334,"d":"664.18"},{"v":658.5166666666668,"d":"658.52"},{"v":654.4333333333334,"d":"654.43"},{"v":648.7666666666668,"d":"648.77"},{"v":668.2666666666668,"d":"668.27"},{"v":673.9333333333333,"d":"673.93"},{"v":678.0166666666668,"d":"678.02"},669.85,660.1,0.77402]
[7,"AAVAS",1549.9,{"v":1554.9666666666665,"d":"1554.97"},{"v":1529.933333333333,"d":"1529.93"},{"v":1509.9666666666665,"d":"1509.97"},{"v":1484.933333333333,"d":"1484.93"},{"v":1574.933333333333,"d":"1574.93"},{"v":1599.9666666666662,"d":"1599.97"},{"v":1619.933333333333,"d":"1619.93"},1580,1535,0.2971]
[8,"ADANIGREEN",48.3,{"v":47.63333333333333,"d":"47.63"},{"v":46.166666666666664,"d":"46.17"},{"v":44.03333333333333,"d":"44.03"},{"v":42.56666666666666,"d":"42.57"},{"v":49.766666666666666,"d":"49.77"},{"v":51.233333333333334,"d":"51.23"},{"v":53.36666666666667,"d":"53.37"},49.1,45.5,10.4031]
[9,"ADANIPORTS",373.35,{"v":371.59999999999997,"d":"371.60"},{"v":368.24999999999994,"d":"368.25"},363.15,{"v":359.79999999999995,"d":"359.80"},{"v":376.69999999999993,"d":"376.70"},{"v":380.04999999999995,"d":"380.05"},{"v":385.1499999999999,"d":"385.15"},374.95,366.5,33.41392]
[10,"ADANIPOWER",63.75,{"v":62.93333333333334,"d":"62.93"},{"v":61.366666666666674,"d":"61.37"},{"v":58.983333333333334,"d":"58.98"},{"v":57.41666666666667,"d":"57.42"},{"v":65.31666666666668,"d":"65.32"},{"v":66.88333333333334,"d":"66.88"},{"v":69.26666666666668,"d":"69.27"},64.5,60.55,155.89815]
{"$rows_left_out":513}
{"sheet":"Bulk Deals","index":4,"n_rows":116,"n_cols":8,"rows_kept":116,"merged":[[4,0,4,1],[4,2,4,3],[6,1,6,2]]}
[" "]
[]
[]
[]
[]
[{"$nulls":4},"Back To Main Page"]
["Subject :","BULK DEAL",null,{"$f":"Main!B10","v":"2019-09-12"}]
[]
["Date","Scrip code","Scrip Name","Client Name","Buy / Sell","Quantity Traded","Trade Price / Wt.Avg.trade price","Exchange  "]
["2019-09-11",541401,"ARIHANTINS","ARUNKUMAR DASHRATHBHAI PRAJAPATI","BUY",{"v":52000,"d":"52,000"},5.67,"BSE"]
["2019-09-11",541401,"ARIHANTINS","ARUNKUMAR DASHRATHBHAI PRAJAPATI","SELL",{"v":52000,"d":"52,000"},5.59,"BSE"]
["2019-09-11",590122,"ASHIKACR","DEEPAK KUMAR","BUY",{"v":36000,"d":"36,000"},37.5,"BSE"]
["2019-09-11",590122,"ASHIKACR","SEEMA","SELL",{"v":40000,"d":"40,000"},38,"BSE"]
["2019-09-11",539447,"BEARDSELL","ANUMOLU ANUMOLU BHARAT","SELL",{"v":1563694,"d":"1,563,694"},12,"BSE"]
["2019-09-11",539447,"BEARDSELL","JAGDISH AMRITLAL SHAH","BUY",{"v":200000,"d":"200,000"},12,"BSE"]
["2019-09-11",539447,"BEARDSELL","VINODCHANDRA MANSUKHLAL PAREKH","BUY",{"v":1300000,"d":"1,300,000"},12,"BSE"]
["2019-09-11",542641,"CKFSL","ALPHA LEON ENTERPRISES LLP","BUY",{"v":1300015,"d":"1,300,015"},0.52,"BSE"]
["2019-09-11",542641,"CKFSL","ALPHA LEON ENTERPRISES LLP","SELL",22,0.55,"BSE"]
["2019-09-11",542641,"CKFSL","KARST PEAK ASIA MASTER FUND","SELL",{"v":449838,"d":"449,838"},0.52,"BSE"]
["2019-09-11",542641,"CKFSL","THE BOARD OF REGENTS OF THE UNIVERSITY OF TEXAS SYSTEM - SAGA TREE CAPITAL ADVISORS PTE LTD","SELL",{"v":754005,"d":"754,005"},0.52,"BSE"]
{"$rows_left_out":97}
{"sheet":"Call Tracker (Equity & F&O)","index":5,"n_rows":278,"n_cols":18,"rows_kept":278,"merged":[[79,0,80,0],[79,1,80,1],[79,9,80,9],[79,11,80,11],[79,12,80,12],[79,13,80,13],[79,14,80,14],[81,0,82,0],[81,1,82,1],[81,9,82,9],[81,11,82,11],[81,12,82,12],[81,13,82,13],[81,14,82,14],[83,0,84,0],[83,1,84,1],[83,9,84,9],[83,11,84,11],[83,12,84,12],[83,13,84,13],[83,14,84,14],[96,0,97,0],[96,1,97,1],[96,9,97,9],[96,11,97,11],[96,12,97,12],[96,13,97,13],[96,14,97,14],[100,0,101,0],[100,1,101,1],[100,9,101,9],[100,11,101,11],[100,12,101,12],[100,13,101,13],[100,14,101,14]]}
[]
[]
[]
[]
[{"$nulls":12},"Back To Main Page"]
["Retail Research Technical Calls & Fundamental Performance Report for the month of September-2019 "]
[{"$nulls":12},{"$f":"Main!B10","v":"2019-09-12"}]
[null,"Positional  Call"]
["Sr.no","Date",null,"Company","Rec","Rec Price","Stop Loss***","Call Closed At","Target","Remark","Profit / Loss per Share","Gain / Loss  %","Status","Closed Date","NSE Closed Price"]
[1,"2019-08-01",null,"HDFCBANK","Buy","2205-2215",2130,null,"2320-2370","Open",{"$nulls":4},{"$f":"VLOOKUP(D10,Sheet2!A25:M1664,6,0)","v":2251.3},null,null,"H"]
[2,"2019-08-02",null,"LT","Buy","1345-1355",1270,null,1500,"Open",{"$nulls":4},{"$f":"VLOOKUP(D11,Sheet2!A26:M1665,6,0)","v":1363.65},null,null,"H"]
[3,"2019-08-09",null,"TATACHEM","Buy",566,534,583.5,"620-640","Profit of Rs.17.50/-",{"$f":"H12-F12","v":17.5},{"$f":"K12/F12","v":{"v":0.030918727915194347,"d":"3.09%"}},"Successful","2019-09-05",{"$nulls":3},"H"]
[4,"2019-08-19",null,"TATAELXSI","Buy",635,597,660.5,"700-720","Part Profit of Rs.25.50/-",{"$f":"H13-F13","v":25.5},{"$f":"K13/F13","v":{"v":0.04015748031496063,"d":"4.02%"}},"Successful","2019-08-27",{"$f":"VLOOKUP(D13,Sheet2!A36:M1675,6,0)","v":644.9},null,null,"R"]
[5,"2019-08-23",null,"IOC","Buy",122.5,114.4,122.75,135,"Neutral",{"$f":"H14-F14","v":0.25},{"$f":"K14/F14","v":{"v":2.0408163265306124E-3,"d":"0.20%"}},"Neutral","2019-09-03",{"$nulls":3},"H"]
[6,"2019-08-30",null,"BIOCON","Buy",229.5,214.3,237,"255-260","Part Profit of Rs.7.5/-",{"$f":"H15-F15","v":7.5},{"$f":"K15/F15","v":{"v":0.032679738562091505,"d":"3.27%"}},"Successful","2019-08-30",{"$f":"VLOOKUP(D15,Sheet2!A38:M1677,6,0)","v":234.8},null,null,"R"]
[7,"2019-09-03",null,"POWERGRID","Buy","197-199",186,null,"220-224","Open",{"$nulls":4},{"$f":"VLOOKUP(D16,Sheet2!A31:M1670,6,0)","v":201.4},null,null,"R"]
[8,"2019-09-04",null,"JUSTDIAL","Buy",709.5,673,734,"775-785","Part Profit of Rs.24.5/-",{"$f":"H17-F17","v":24.5},{"$f":"K17/F17","v":{"v":0.03453136011275546,"d":"3.45%"}},"Successful","2019-09-09",{"$f":"VLOOKUP(D17,Sheet2!A40:M1679,6,0)","v":725.8},null,null,"R"]
[9,"2019-09-09",null,"TATAGLOBAL","Buy","265-267",256,null,"281-285","Open",{"$nulls":4},{"$f":"VLOOKUP(D18,Sheet2!A33:M1672,6,0)","v":259.35},null,null,"R"]
[10,"2019-09-09",null,"TORNTPHARM","Sell","1710-1720",1808,null,"1560-1540","Open",{"$nulls":4},{"$f":"VLOOKUP(D19,Sheet2!A34:M1673,6,0)","v":1698.3},null,null,"R"]
[11,"2019-09-11",null,"LICHSGFIN","Buy","398-403",379,null,"440-450","Open",{"$nulls":4},{"$f":"VLOOKUP(D20,Sheet2!A35:M1674,6,0)","v":402.65}]
{"$rows_left_out":233}
{"sheet":"Sheet2","index":6,"n_rows":1899,"n_cols":14,"rows_kept":1899,"hidden":true}
["SYMBOL","SERIES","OPEN","HIGH","LOW","CLOSE","LAST","PREVCLOSE","TOTTRDQTY","TOTTRDVAL","TIMESTAMP","TOTALTRADES","ISIN","ISIN"]
["20MICRONS","EQ",34.9,36.8,34.55,35.8,35.65,34.3,94929,3421804.15,"2019-09-11",1356,"INE144J01027"]
["21STCENMGM","EQ",12.15,12.15,12.15,12.15,12.15,12.15,10,121.5,"2019-09-11",1,"INE253B01015"]
["3IINFOTECH","EQ",2.4,2.7,2.35,2.5,2.5,2.3,4799549,12308139.75,"2019-09-11",2096,"INE748C01020"]
["3MINDIA","EQ",20800,20800,20150,20260.55,20250,20604.35,4281,86917683.8,"2019-09-11",1021,"INE470A01017"]
["5PAISA","EQ",136,140.55,136,137.75,137.5,135.55,15262,2105088.8,"2019-09-11",342,"INE618L01018"]
["63MOONS","EQ",116.8,119.75,114.1,119.75,119.75,114.05,65226,7701673.5,"2019-09-11",600,"INE111B01023"]
["8KMILES","EQ",56,58.7,55.95,58.7,58.7,55.95,65519,3782017.2,"2019-09-11",502,"INE650K01021"]
["A2ZINFRA","EQ",9.8,10.55,9.55,10.3,10.35,9.55,968083,9913345.45,"2019-09-11",1077,"INE619I01012"]
["AARTIDRUGS","EQ",452.05,458.95,443,444.25,443,451.75,9401,4204312.6,"2019-09-11",641,"INE767A01016"]
["AARTIIND","EQ",1601,1603,1578,1598.7,1595.55,1584.7,35747,56936830.1,"2019-09-11",3233,"INE769A01020"]
["AARVEEDEN","EQ",15.25,16.8,15.25,16.05,15.8,15.25,7609,123066.1,"2019-09-11",349,"INE273D01019"]
["AAVAS","EQ",1580,1580,1535,1549.9,1550,1556.9,29710,46160051.4,"2019-09-11",1749,"INE216P01012"]
["ABAN","EQ",25.6,26.7,24.9,26.7,26.7,25.45,64619,1701980.45,"2019-09-11",493,"INE421A01028"]
["ABB","EQ",1330,1346,1320,1328.4,1327.2,1327.85,35256,47048653.7,"2019-09-11",3073,"INE117A01022"]
["ABBOTINDIA","EQ",9950,9979.9,9757,9800.55,9784,9944.4,17643,174777290.3,"2019-09-11",1810,"INE358A01014"]
["ABCAPITAL","EQ",95.1,97.5,95.1,96.65,96.5,94.45,1448632,139965662.35,"2019-09-11",22728,"INE674K01013"]
["ABFRL","EQ",189.4,191.6,187.1,187.65,187.75,189.4,296934,55945500.4,"2019-09-11",6361,"INE647O01011"]
["ABMINTLTD","BE",14.6,14.6,13.95,13.95,13.95,13.95,45,631.65,"2019-09-11",4,"INE251C01017"]
["ABSLNN50ET","EQ",264.49,264.49,264.49,264.49,264.49,263.01,25,6612.25,"2019-09-11",1,"INF209KB1B87"]
{"$rows_left_out":1695}
{"sheet":"Sheet1","index":7,"n_rows":0,"n_cols":0,"rows_kept":0,"hidden":true}

{"sheet":"Sheet3","index":8,"n_rows":0,"n_cols":0,"rows_kept":0,"hidden":true}

{"sheet":"Sheet4","index":9,"n_rows":0,"n_cols":0,"rows_kept":0,"hidden":true}

{"sheet":"Sheet5","index":10,"n_rows":0,"n_cols":0,"rows_kept":0,"hidden":true}