{"text_format":"3","workbook":"xlsx","n_sheets":6,"sheets":["Main","Future Intra","Cash Intra","MidCap Intra","Bulk Deals","Call Tracker (Equity & F&O)"],"not_rendered":{"images":4,"defined_names":1},"read":"whole","date_system":"1900"}

{"sheet":"Main","index":0,"n_rows":27,"n_cols":11,"rows_kept":27}
[null,"                                                                                                 "]
[]
[]
[]
[]
[{"$nulls":6}," "]
[]
[]
[]
[null,"2024-02-12"]
[]
[null,"Sheet No.","Template Name","Summary"]
[null,1,"Future Intra","For Intraday trading in F&O segment"]
[null,2,"Cash Intra","For Intraday trading in cash market segment"]
[null,3,"Mid-cap Intra","For Intraday trading in Mid-cap stocks"]
[null,4,"Bulk Deals","Reveals Bulk Deals carried on NSE & BSE"]
[null,5,"Call Tracker"]
{"$rows_empty":9}
[{"$nulls":10},"`"]

{"sheet":"Future Intra","index":1,"n_rows":236,"n_cols":16,"rows_kept":236,"merged":[[8,0,9,0],[8,1,9,1],[8,2,9,2],[8,3,9,3],[8,6,8,8],[8,9,8,11]]}
[]
[]
[]
[]
[{"$nulls":12},"Back to Main Page"]
["FOR INTRA DAY TRADING",{"$nulls":10},{"$f":"Main!B10","v":"2024-02-12"}]
[]
[]
["Sr.no","Sector","Scrip","Expiry Date","CLOSE RATE","Pivot Point","Supports",null,null,"Resistances"]
[{"$nulls":4},"Point","Point","S1","S2","S3","R1","R2","R3","HIGH","LOW","OI","% Change in OI"]
[1,"Index","NIFTY","2024-02-29",{"v":21842.6,"d":"21842.60"},{"v":21794.733333333334,"d":"21794.73"},{"v":21722.066666666666,"d":"21722.07"},{"v":21601.533333333333,"d":"21601.53"},{"v":21528.866666666665,"d":"21528.87"},{"v":21915.266666666666,"d":"21915.27"},{"v":21987.93333333333,"d":"21987.93"},{"v":22108.466666666667,"d":"22108.47"},21867.4,21674.2,13041000,{"v":-0.03889806025588114,"d":"-3.89%"}]
[2,"Index","BANKNIFTY","2024-02-29",45899.55,{"v":45661.56666666667,"d":"45661.57"},{"v":45348.133333333346,"d":"45348.13"},{"v":44796.716666666674,"d":"44796.72"},{"v":44483.28333333335,"d":"44483.28"},{"v":46212.983333333344,"d":"46212.98"},{"v":46526.41666666668,"d":"46526.42"},{"v":47077.83333333334,"d":"47077.83"},45975,45110.15,3404730,{"v":-0.05453318560110632,"d":"-5.45%"}]
[3,"Index","FINNIFTY","2024-02-27",20297.55,{"v":20227.566666666666,"d":"20227.57"},{"v":20132.98333333333,"d":"20132.98"},{"v":19968.416666666664,"d":"19968.42"},{"v":19873.83333333333,"d":"19873.83"},{"v":20392.13333333333,"d":"20392.13"},{"v":20486.716666666667,"d":"20486.72"},{"v":20651.283333333333,"d":"20651.28"},20322.15,20063,84680,{"v":0.004269449715370019,"d":"0.43%"}]
[4,"Index","MIDCPNIFTY","2024-02-26",10755.65,{"v":10730.033333333333,"d":"10730.03"},{"v":10613.766666666666,"d":"10613.77"},{"v":10471.883333333333,"d":"10471.88"},{"v":10355.616666666667,"d":"10355.62"},{"v":10871.916666666666,"d":"10871.92"},{"v":10988.183333333332,"d":"10988.18"},{"v":11130.066666666666,"d":"11130.07"},10846.3,10588.15,807825,{"v":-0.0189452591310684,"d":"-1.89%"}]
[5,"Chemical","AARTIIND","2024-02-29",666.25,{"v":653.6333333333333,"d":"653.63"},{"v":638.9166666666666,"d":"638.92"},{"v":611.5833333333333,"d":"611.58"},{"v":596.8666666666666,"d":"596.87"},{"v":680.9666666666667,"d":"680.97"},{"v":695.6833333333334,"d":"695.68"},{"v":723.0166666666668,"d":"723.02"},668.35,626.3,13365000,{"v":-0.02877697841726619,"d":"-2.88%"}]
[6,"Capital_Goods","ABB","2024-02-29",{"v":4503.5,"d":"4503.50"},4476.65,{"v":4442.249999999999,"d":"4442.25"},{"v":4380.999999999999,"d":"4381.00"},{"v":4346.5999999999985,"d":"4346.60"},{"v":4537.9,"d":"4537.90"},{"v":4572.300000000001,"d":"4572.30"},4633.55,4511.05,4415.4,1420250,{"v":-0.007772246965330539,"d":"-0.78%"}]
[7,"Pharma","ABBOTINDIA","2024-02-29",{"v":28242,"d":"28242.00"},{"v":28317.966666666664,"d":"28317.97"},{"v":28090.383333333328,"d":"28090.38"},{"v":27938.766666666663,"d":"27938.77"},{"v":27711.183333333327,"d":"27711.18"},{"v":28469.58333333333,"d":"28469.58"},{"v":28697.166666666664,"d":"28697.17"},{"v":28848.78333333333,"d":"28848.78"},28545.55,28166.35,185200,{"v":0.020948180815876516,"d":"2.09%"}]
[8,"Others","ABCAPITAL","2024-02-29",{"v":188.8,"d":"188.80"},{"v":187.1,"d":"187.10"},{"v":184.5,"d":"184.50"},{"v":180.20000000000002,"d":"180.20"},{"v":177.60000000000002,"d":"177.60"},{"v":191.39999999999998,"d":"191.40"},{"v":193.99999999999994,"d":"194.00"},{"v":198.29999999999995,"d":"198.30"},189.7,182.8,61938000,{"v":0.015134082662182495,"d":"1.51%"}]
[9,"Textile","ABFRL","2024-02-29",{"v":254,"d":"254.00"},{"v":254.8166666666667,"d":"254.82"},{"v":247.13333333333338,"d":"247.13"},{"v":240.26666666666668,"d":"240.27"},{"v":232.58333333333337,"d":"232.58"},{"v":261.6833333333334,"d":"261.68"},{"v":269.36666666666673,"d":"269.37"},{"v":276.2333333333334,"d":"276.23"},262.5,247.95,48412000,{"v":0.06540024031584368,"d":"6.54%"}]
[10,"Cement","ACC","2024-02-29",{"v":2640.6,"d":"2640.60"},{"v":2604.9999999999995,"d":"2605.00"},{"v":2552.0499999999993,"d":"2552.05"},{"v":2463.4999999999995,"d":"2463.50"},{"v":2410.5499999999993,"d":"2410.55"},{"v":2693.5499999999993,"d":"2693.55"},{"v":2746.499999999999,"d":"2746.50"},{"v":2835.0499999999993,"d":"2835.05"},2657.95,2516.45,4516200,{"v":0.12873959661093198,"d":"12.87%"}]
{"$rows_left_out":195}
{"sheet":"Cash Intra","index":2,"n_rows":245,"n_cols":13,"rows_kept":245,"merged":[[7,0,8,0],[7,1,8,1],[7,2,8,2],[7,3,8,3],[7,4,7,6],[7,7,7,9]]}
[]
[]
[]
[]
[{"$nulls":12},"Back to Main Page"]
["FOR INTRA DAY TRADING",{"$nulls":9},{"$f":"Main!B10","v":"2024-02-12"}]
[]
["Sr.no",null,"CLOSE RATE","Pivot Point","Supports",null,null,"Resistances"]
[{"$nulls":4},"S1","S2","S3","R1","R2","R3","HIGH","LOW","Total Trade Quanity in Lakhs"]
[1,"Nifty 50",{"v":21782.5,"d":"21782.50"},21738.95,21673.45,{"v":21564.4,"d":"21564.40"},{"v":21498.9,"d":"21498.90"},{"v":21848,"d":"21848.00"},{"v":21913.5,"d":"21913.50"},22022.55,21804.45,{"v":21629.9,"d":"21629.90"}]
[2,"Nifty Bank",45634.55,{"v":45403.950000000004,"d":"45403.95"},{"v":45089.75000000001,"d":"45089.75"},{"v":44544.950000000004,"d":"44544.95"},{"v":44230.75000000001,"d":"44230.75"},{"v":45948.75000000001,"d":"45948.75"},{"v":46262.950000000004,"d":"46262.95"},{"v":46807.75000000001,"d":"46807.75"},45718.15,44859.15]
[3,"Nifty CPSE",{"v":5711.5,"d":"5711.50"},{"v":5714.166666666667,"d":"5714.17"},{"v":5563.083333333334,"d":"5563.08"},{"v":5414.666666666667,"d":"5414.67"},{"v":5263.583333333334,"d":"5263.58"},{"v":5862.583333333334,"d":"5862.58"},{"v":6013.666666666668,"d":"6013.67"},{"v":6162.083333333334,"d":"6162.08"},5865.25,5565.75]
[4,"Nifty Infra",7977.05,{"v":7970.983333333333,"d":"7970.98"},{"v":7890.216666666665,"d":"7890.22"},{"v":7803.383333333332,"d":"7803.38"},{"v":7722.616666666665,"d":"7722.62"},{"v":8057.816666666666,"d":"8057.82"},{"v":8138.583333333334,"d":"8138.58"},{"v":8225.416666666666,"d":"8225.42"},8051.75,7884.15]
[5,"Nifty IT",37699.25,{"v":37741.683333333334,"d":"37741.68"},{"v":37401.316666666666,"d":"37401.32"},{"v":37103.38333333333,"d":"37103.38"},{"v":36763.01666666666,"d":"36763.02"},{"v":38039.61666666667,"d":"38039.62"},{"v":38379.98333333334,"d":"38379.98"},{"v":38677.91666666667,"d":"38677.92"},38082.05,37443.75]
[6,"Nifty PSE",9170.05,{"v":9194.883333333333,"d":"9194.88"},{"v":8911.616666666667,"d":"8911.62"},{"v":8653.183333333334,"d":"8653.18"},{"v":8369.916666666668,"d":"8369.92"},{"v":9453.316666666666,"d":"9453.32"},{"v":9736.583333333332,"d":"9736.58"},{"v":9995.016666666665,"d":"9995.02"},9478.15,8936.45]
[7,"Nifty Midcap 50",{"v":13840.9,"d":"13840.90"},{"v":13801.416666666666,"d":"13801.42"},{"v":13623.833333333332,"d":"13623.83"},{"v":13406.766666666666,"d":"13406.77"},{"v":13229.183333333332,"d":"13229.18"},{"v":14018.483333333332,"d":"14018.48"},{"v":14196.066666666664,"d":"14196.07"},{"v":14413.133333333331,"d":"14413.13"},{"v":13979,"d":"13979.00"},13584.35]
[8,"ABB",4489.45,{"v":4467.866666666666,"d":"4467.87"},{"v":4434.283333333332,"d":"4434.28"},{"v":4379.116666666666,"d":"4379.12"},{"v":4345.533333333332,"d":"4345.53"},{"v":4523.033333333332,"d":"4523.03"},{"v":4556.616666666666,"d":"4556.62"},{"v":4611.783333333332,"d":"4611.78"},4501.45,4412.7,2.03496]
[9,"ABBOTINDIA",28083.7,{"v":28184.400000000005,"d":"28184.40"},{"v":27919.95000000001,"d":"27919.95"},{"v":27756.200000000008,"d":"27756.20"},{"v":27491.750000000015,"d":"27491.75"},{"v":28348.15000000001,"d":"28348.15"},{"v":28612.6,"d":"28612.60"},{"v":28776.350000000006,"d":"28776.35"},28448.85,28020.65,0.13645]
[10,"ABCAPITAL",187.9,{"v":186.3166666666667,"d":"186.32"},{"v":183.5333333333334,"d":"183.53"},{"v":179.16666666666669,"d":"179.17"},{"v":176.38333333333338,"d":"176.38"},{"v":190.6833333333334,"d":"190.68"},{"v":193.4666666666667,"d":"193.47"},{"v":197.8333333333334,"d":"197.83"},189.1,181.95,52.82306]
[11,"ABFRL",252.85,{"v":253.6,"d":"253.60"},{"v":245.8,"d":"245.80"},{"v":238.75000000000003,"d":"238.75"},{"v":230.95000000000005,"d":"230.95"},260.65,268.45,{"v":275.49999999999994,"d":"275.50"},261.4,246.55,64.84466]
{"$rows_left_out":226}
{"sheet":"MidCap Intra","index":3,"n_rows":530,"n_cols":13,"rows_kept":530,"merged":[[0,0,0,1],[8,0,9,0],[8,1,9,1],[8,2,9,2],[8,3,9,3],[8,4,8,6],[8,7,8,9]]}
[]
[]
[]
[]
[{"$nulls":11},"Back To Main Page"]
["FOR INTRA DAY TRADING",{"$nulls":9},{"$f":"Main!B10","v":"2024-02-12"}]
[null,null," "]
[]
["Sr.no","Scrip","CLOSE RATE","Pivot Point","Supports",null,null,"Resistances"]
[{"$nulls":4},"S1","S2","S3","R1","R2","R3","HIGH","LOW","Total Trade Quanity in Lakhs"]
[1,"360ONE",654.3,{"v":652.6166666666667,"d":"652.62"},{"v":645.6833333333334,"d":"645.68"},{"v":637.0666666666667,"d":"637.07"},{"v":630.1333333333334,"d":"630.13"},{"v":661.2333333333333,"d":"661.23"},{"v":668.1666666666665,"d":"668.17"},{"v":676.7833333333333,"d":"676.78"},659.55,644,4.10126]
[2,"3MINDIA",32642.65,{"v":32851.2,"d":"32851.20"},{"v":31816.399999999994,"d":"31816.40"},{"v":30990.149999999998,"d":"30990.15"},{"v":29955.349999999995,"d":"29955.35"},33677.45,34712.25,{"v":35538.49999999999,"d":"35538.50"},33886,32024.95,0.07037]
[3,"AARTIDRUGS",532.45,{"v":536.8833333333333,"d":"536.88"},{"v":525.7666666666667,"d":"525.77"},{"v":519.0833333333334,"d":"519.08"},{"v":507.9666666666667,"d":"507.97"},{"v":543.5666666666666,"d":"543.57"},{"v":554.6833333333332,"d":"554.68"},{"v":561.3666666666666,"d":"561.37"},548,530.2,4.982]
[4,"AARTIIND",663.35,{"v":650.7833333333333,"d":"650.78"},{"v":635.5666666666666,"d":"635.57"},{"v":607.7833333333333,"d":"607.78"},{"v":592.5666666666666,"d":"592.57"},{"v":678.5666666666666,"d":"678.57"},{"v":693.7833333333333,"d":"693.78"},{"v":721.5666666666666,"d":"721.57"},666,623,61.26957]
[5,"AAVAS",1408.5,{"v":1413.8499999999997,"d":"1413.85"},{"v":1398.7499999999993,"d":"1398.75"},{"v":1388.9999999999995,"d":"1389.00"},{"v":1373.8999999999992,"d":"1373.90"},{"v":1423.5999999999995,"d":"1423.60"},{"v":1438.6999999999998,"d":"1438.70"},{"v":1448.4499999999996,"d":"1448.45"},1428.95,1404.1,1.16109]
[6,"ABB",4489.45,{"v":4467.866666666666,"d":"4467.87"},{"v":4434.283333333332,"d":"4434.28"},{"v":4379.116666666666,"d":"4379.12"},{"v":4345.533333333332,"d":"4345.53"},{"v":4523.033333333332,"d":"4523.03"},{"v":4556.616666666666,"d":"4556.62"},{"v":4611.783333333332,"d":"4611.78"},4501.45,4412.7,2.03496]
[7,"ABBOTINDIA",28083.7,{"v":28184.400000000005,"d":"28184.40"},{"v":27919.95000000001,"d":"27919.95"},{"v":27756.200000000008,"d":"27756.20"},{"v":27491.750000000015,"d":"27491.75"},{"v":28348.15000000001,"d":"28348.15"},{"v":28612.6,"d":"28612.60"},{"v":28776.350000000006,"d":"28776.35"},28448.85,28020.65,0.13645]
[8,"ACC",2628.05,{"v":2593.2833333333333,"d":"2593.28"},{"v":2541.5666666666666,"d":"2541.57"},{"v":2455.0833333333335,"d":"2455.08"},{"v":2403.366666666667,"d":"2403.37"},{"v":2679.7666666666664,"d":"2679.77"},{"v":2731.4833333333327,"d":"2731.48"},{"v":2817.9666666666662,"d":"2817.97"},2645,2506.8,18.28299]
[9,"ADANIENT",3215.2,{"v":3187.1166666666663,"d":"3187.12"},{"v":3149.283333333333,"d":"3149.28"},{"v":3083.3666666666663,"d":"3083.37"},{"v":3045.533333333333,"d":"3045.53"},{"v":3253.033333333333,"d":"3253.03"},{"v":3290.866666666666,"d":"3290.87"},{"v":3356.783333333333,"d":"3356.78"},3224.95,3121.2,15.72789]
[10,"ADANIGREEN",1880.7,{"v":1868.0833333333333,"d":"1868.08"},{"v":1818.1666666666665,"d":"1818.17"},{"v":1755.6333333333332,"d":"1755.63"},{"v":1705.7166666666665,"d":"1705.72"},{"v":1930.6166666666666,"d":"1930.62"},{"v":1980.533333333333,"d":"1980.53"},{"v":2043.0666666666666,"d":"2043.07"},1918,1805.55,31.59808]
{"$rows_left_out":511}
{"sheet":"Bulk Deals","index":4,"n_rows":235,"n_cols":8,"rows_kept":235,"merged":[[4,0,4,1],[4,2,4,3],[6,1,6,2]]}
[" "]
[]
[]
[]
[]
[{"$nulls":4},"Back To Main Page"]
["Subject :","BULK DEAL",null,{"$f":"Main!B10","v":"2024-02-12"}]
[]
["Date","Scrip code","Scrip Name","Client Name","Buy / Sell","Quantity Traded","Trade Price / Wt.Avg.trade price","Exchange  "]
["2024-02-09",539096,"AANANDALAK","LAXMI PAT DUDHERIA","BUY",{"v":20000,"d":"20,000"},14.23,"BSE"]
["2024-02-09",513119,"ABCGAS","SYAMALPRASAD DWARKAPRASAD SHOREWALA","SELL",{"v":15000,"d":"15,000"},55.1,"BSE"]
["2024-02-09",531525,"ACESOFT","MULTIPLIER SHARE & STOCK ADVISORS PRIVATE LIMITED","BUY",{"v":25000,"d":"25,000"},75.13,"BSE"]
["2024-02-09",543941,"AHASOLAR","RAUNAK DHANANIA .","BUY",{"v":20000,"d":"20,000"},467.55,"BSE"]
["2024-02-09",531991,"AMRAAGRI","K S MANIAN","SELL",{"v":697456,"d":"697,456"},1.12,"BSE"]
["2024-02-09",543443,"ASCENSIVE","PAWAN SHARMA","SELL",{"v":36000,"d":"36,000"},44.4,"BSE"]
["2024-02-09",541702,"ASHNI","AALPS COMMODITIES LLP","SELL",{"v":1385206,"d":"1,385,206"},7.78,"BSE"]
["2024-02-09",544052,"BENCHMARK","SUNFLOWER BROKING PRIVATE LIMITED","SELL",{"v":118000,"d":"118,000"},66.02,"BSE"]
["2024-02-09",544052,"BENCHMARK","SUNFLOWER BROKING PRIVATE LIMITED","BUY",{"v":50000,"d":"50,000"},66,"BSE"]
["2024-02-09",544052,"BENCHMARK","SPREAD X SECURITIES PRIVATE LIMITED","BUY",{"v":122000,"d":"122,000"},66.02,"BSE"]
["2024-02-09",539662,"BFLAFL","DREAM FINHOLD PRIVATE LIMITED","SELL",{"v":92547,"d":"92,547"},23.29,"BSE"]
{"$rows_left_out":216}
{"sheet":"Call Tracker (Equity & F&O)","index":5,"n_rows":302,"n_cols":19,"rows_kept":302,"merged":[[45,0,46,0],[45,1,46,1],[45,9,46,9],[45,14,46,14],[45,15,46,15],[49,0,50,0],[49,1,50,1],[49,9,50,9],[49,12,50,12],[49,14,50,14],[49,15,50,15],[55,0,56,0],[55,1,56,1],[55,9,56,9],[55,12,56,12],[55,14,56,14],[55,15,56,15],[60,0,61,0],[60,1,61,1],[60,9,61,9],[60,12,61,12],[60,14,61,14],[60,15,61,15],[62,0,63,0],[62,1,63,1],[62,9,63,9],[64,0,65,0],[64,1,65,1],[64,9,65,9],[66,0,67,0],[66,1,67,1],[66,9,67,9],[66,12,67,12],[66,14,67,14],[66,15,67,15]]}
[]
[]
[]
[]
[{"$nulls":12},"Back To Main Page"]
["Retail Research Technical Calls & Fundamental Performance Report for the month of February-2024"]
[{"$nulls":12},{"$f":"Main!B10","v":"2024-02-12"}]
[null,"Positional  Call"]
["Sr.no","Date",null,"Company","Rec","Rec Price","Stop Loss***","Call Closed At","Target","Remark","Profit / Loss per Share","All charges","Net Gain / Loss  %","Status","Closed Date","Market Closing Price","Second Buying Date"]
[1,"2023-12-18",null,"SBIN","Accu",632,593,670,"680-720","Profit of Rs.38/-",{"$f":"H10-F10","v":38},{"$f":"(F10*-0.3)/100","v":{"v":-1.896,"d":"-1.90"}},{"$f":"(K10+L10)/F10","v":{"v":0.05712658227848101,"d":"5.71%"}},"Successful","2024-02-07",null,"2024-01-10",null,"H"]
[2,"2023-12-28",null,"VINATIORGA","Accu",1725,1645,1645,"1860-1960","Loss of Rs.80/-",{"$f":"H11-F11","v":-80},{"$f":"(F11*-0.3)/100","v":{"v":-5.175,"d":"-5.18"}},{"v":-0.049376811594202895,"d":"-4.94%"},"Unsuccessful","2024-02-09",null,"2024-01-10",null,"H"]
[3,"2024-01-03",null,"MARUTI","Accu",9937.5,9340,10410,"10700-11200","Profit of Rs.472.5/-",{"$f":"H12-F12","v":472.5},{"$f":"(F12*-0.3)/100","v":{"v":-29.8125,"d":"-29.81"}},{"$f":"(K12+L12)/F12","v":{"v":0.04454716981132076,"d":"4.45%"}},"Successful","2024-02-01",{"$nulls":3},"H"]
[4,"2024-01-12",null,"JUBLFOOD","Accu",521.5,490,487,"555-575","Loss of Rs.34.5/-",{"$f":"H13-F13","v":-34.5},{"$f":"(F13*-0.3)/100","v":{"v":-1.5644999999999998,"d":"-1.56"}},{"$f":"(K13+L13)/F13","v":{"v":-0.06915532118887824,"d":"-6.92%"}},"Unsuccessful","2024-02-05",null,"2024-01-18",null,"K"]
[5,"2024-01-16",null,"CAPACITE ","Accu",267.5,237,282.5,"300-330","Profit of Rs.15/-",{"$f":"H14-F14","v":15},{"$f":"(F14*-0.3)/100","v":{"v":-0.8025,"d":"-0.80"}},{"v":0.053074766355140184,"d":"5.31%"},"Successful","2024-02-08",{"$nulls":3},"H"]
[6,"2024-01-25",null,"FLUOROCHEM","Accu","3395-3575",3280,null,"3900-4200","Open",{"$nulls":5},{"$f":"VLOOKUP(D15,'MidCap Intra'!$B$11:$C$568,2,0)","v":3520.45},null,null,"H"]
[7,"2024-01-25",null,"VGUARD","Accu",288,267,305,"305-325","Profit of Rs.17/-",{"$f":"H16-F16","v":17},{"$f":"(F16*-0.3)/100","v":{"v":-0.8639999999999999,"d":"-0.86"}},{"$f":"(K16+L16)/F16","v":{"v":0.056027777777777774,"d":"5.60%"}},"Successful","2024-02-01",{"$nulls":3},"H"]
[8,"2024-01-29",null,"GMMPFAUDLR","Accu",1502.5,1415,1400,"1650-1750","Loss of Rs.102.5/-",{"$f":"H17-F17","v":-102.5},{"$f":"(F17*-0.3)/100","v":{"v":-4.5075,"d":"-4.51"}},{"v":-0.07121963394342762,"d":"-7.12%"},"Unsuccessful","2024-02-09",{"$nulls":3},"H"]
[9,"2024-01-30",null,"RELIANCE","Accu","2870-2790",2640,null,"3100-3200","Open",{"$nulls":5},{"$f":"VLOOKUP(D18,'MidCap Intra'!$B$11:$C$568,2,0)","v":{"v":2921.5,"d":"2921.50"}},null,null,"H"]
[10,"2024-01-30",null,"JAMNAAUTO","Accu",115.5,106,123,"124-130","Profit of Rs.7.5/-",{"$f":"H19-F19","v":7.5},{"$f":"(F19*-0.3)/100","v":{"v":-0.3465,"d":"-0.35"}},{"$f":"(K19+L19)/F19","v":{"v":0.06193506493506494,"d":"6.19%"}},"Successful","2024-02-05",{"$nulls":3},"H"]
[11,"2024-02-02",null,"DATAPATTNS","Accu","1850-1910",1790,null,"2040-2140","Open",{"$nulls":5},{"$f":"VLOOKUP(D20,'MidCap Intra'!$B$11:$C$568,2,0)","v":{"v":1875.6,"d":"1875.60"}},null,null,"H"]
{"$rows_left_out":275}