{"text_format":"3","workbook":"xlsx","n_sheets":11,"sheets":["Main","Future Intra","Cash Intra","MidCap Intra","Bulk Deals","Call Tracker (Equity & F&O)","Sheet2","Sheet1","Sheet3","Sheet4","Sheet5"],"not_rendered":{"images":4,"defined_names":5},"read":"whole","date_system":"1900"}

{"sheet":"Main","index":0,"n_rows":27,"n_cols":11,"rows_kept":27}
[null,"                                                                                                 "]
{"$rows_empty":8}
[null,"2020-01-08"]
[]
[null,"Sheet No.","Template Name","Summary"]
[null,1,"Future Intra","For Intraday trading in F&O segment"]
[null,2,"Cash Intra","For Intraday trading in cash market segment"]
[null,3,"Mid-cap Intra","For Intraday trading in Mid-cap stocks"]
[null,4,"Bulk Deals","Reveals Bulk Deals carried on NSE & BSE"]
[null,5,"Call Tracker"]
{"$rows_empty":9}
[{"$nulls":10},"`"]

{"sheet":"Future Intra","index":1,"n_rows":190,"n_cols":15,"rows_kept":190,"merged":[[8,0,9,0],[8,1,9,1],[8,2,9,2],[8,5,8,7],[8,8,8,10]]}
[]
[]
[]
[]
[{"$nulls":12},"Back to Main Page"]
["FOR INTRA DAY TRADING",{"$nulls":10},{"$f":"Main!B10","v":"2020-01-08"}]
[]
[]
["Sr.no","Sector","Scrip","CLOSE RATE","Pivot Point","Supports",null,null,"Resistances"]
[null,"Sector",null,"Point","Point","S1","S2","S3","R1","R2","R3","HIGH","LOW","OI","% Change in OI"]
[1,"Index","BANKNIFTY",{"v":31492.8,"d":"31492.80"},{"v":31536.2,"d":"31536.20"},{"v":31156.600000000002,"d":"31156.60"},{"v":30820.4,"d":"30820.40"},{"v":30440.800000000003,"d":"30440.80"},{"v":31872.4,"d":"31872.40"},{"v":32252,"d":"32252.00"},{"v":32588.2,"d":"32588.20"},31915.8,31200,1489820,{"v":0.047060146465569344,"d":"4.71%"}]
[2,"Index","NIFTY",{"v":12106.7,"d":"12106.70"},{"v":12112.550000000001,"d":"12112.55"},{"v":12043.250000000002,"d":"12043.25"},{"v":11979.800000000001,"d":"11979.80"},{"v":11910.500000000002,"d":"11910.50"},{"v":12176.000000000002,"d":"12176.00"},{"v":12245.300000000001,"d":"12245.30"},{"v":12308.750000000002,"d":"12308.75"},12181.85,12049.1,13183650,{"v":6.3755905960038712E-4,"d":"0.06%"}]
[3,"Index","NIFTYIT",{"v":15902,"d":"15902.00"},{"v":15894.333333333334,"d":"15894.33"},{"v":15808.666666666668,"d":"15808.67"},{"v":15715.333333333334,"d":"15715.33"},{"v":15629.666666666668,"d":"15629.67"},{"v":15987.666666666668,"d":"15987.67"},{"v":16073.333333333336,"d":"16073.33"},{"v":16166.666666666668,"d":"16166.67"},15980,15801,6200,{"v":-0.03125,"d":"-3.13%"}]
[4,"Cement","ACC",1463.85,{"v":1458.5166666666664,"d":"1458.52"},{"v":1444.433333333333,"d":"1444.43"},{"v":1425.0166666666664,"d":"1425.02"},{"v":1410.933333333333,"d":"1410.93"},{"v":1477.933333333333,"d":"1477.93"},{"v":1492.0166666666664,"d":"1492.02"},{"v":1511.433333333333,"d":"1511.43"},1472.6,1439.1,3473600,{"v":0.0196078431372549,"d":"1.96%"}]
[5,"Others","ADANIENT",204.65,{"v":203.95000000000002,"d":"203.95"},{"v":202.10000000000002,"d":"202.10"},199.55,{"v":197.70000000000002,"d":"197.70"},{"v":206.50000000000003,"d":"206.50"},208.35,{"v":210.90000000000003,"d":"210.90"},205.8,201.4,28396000,{"v":-0.011143613316617913,"d":"-1.11%"}]
[6,"Others","ADANIPORTS",386.25,{"v":386.8333333333333,"d":"386.83"},{"v":382.91666666666663,"d":"382.92"},{"v":379.5833333333333,"d":"379.58"},{"v":375.66666666666663,"d":"375.67"},{"v":390.16666666666663,"d":"390.17"},{"v":394.08333333333326,"d":"394.08"},{"v":397.41666666666663,"d":"397.42"},390.75,383.5,32985000,{"v":-0.0433584686774942,"d":"-4.34%"}]
[7,"Power","ADANIPOWER",60.95,{"v":60.78333333333333,"d":"60.78"},{"v":59.81666666666666,"d":"59.82"},{"v":58.68333333333333,"d":"58.68"},{"v":57.71666666666666,"d":"57.72"},{"v":61.916666666666664,"d":"61.92"},{"v":62.88333333333333,"d":"62.88"},{"v":64.01666666666667,"d":"64.02"},61.75,59.65,72730000,{"v":0.002757479663587481,"d":"0.28%"}]
[8,"Automobile","AMARAJABAT",729.35,{"v":730.5333333333334,"d":"730.53"},{"v":720.3666666666668,"d":"720.37"},{"v":711.3833333333333,"d":"711.38"},{"v":701.2166666666667,"d":"701.22"},{"v":739.5166666666669,"d":"739.52"},{"v":749.6833333333336,"d":"749.68"},{"v":758.666666666667,"d":"758.67"},740.7,721.55,1373600,{"v":-0.05033185840707965,"d":"-5.03%"}]
[9,"Cement","AMBUJACEM",200.15,{"v":200.4333333333333,"d":"200.43"},{"v":197.26666666666662,"d":"197.27"},{"v":194.38333333333333,"d":"194.38"},{"v":191.21666666666664,"d":"191.22"},{"v":203.3166666666666,"d":"203.32"},{"v":206.4833333333333,"d":"206.48"},{"v":209.3666666666666,"d":"209.37"},203.6,197.55,18565000,{"v":0.04297752808988764,"d":"4.30%"}]
[10,"Others","APOLLOHOSP",{"v":1484.1,"d":"1484.10"},{"v":1487.7833333333335,"d":"1487.78"},{"v":1473.566666666667,"d":"1473.57"},{"v":1463.0333333333335,"d":"1463.03"},{"v":1448.816666666667,"d":"1448.82"},{"v":1498.316666666667,"d":"1498.32"},{"v":1512.5333333333338,"d":"1512.53"},{"v":1523.066666666667,"d":"1523.07"},1502,1477.25,1484000,{"v":-0.015588723051409618,"d":"-1.56%"}]
{"$rows_left_out":155}
{"sheet":"Cash Intra","index":2,"n_rows":247,"n_cols":13,"rows_kept":247,"merged":[[7,0,8,0],[7,1,8,1],[7,2,8,2],[7,3,8,3],[7,4,7,6],[7,7,7,9]]}
[]
[]
[]
[]
[{"$nulls":12},"Back to Main Page"]
["FOR INTRA DAY TRADING",{"$nulls":9},{"$f":"Main!B10","v":"2020-01-08"}]
[]
["Sr.no","Scrip","CLOSE RATE","Pivot Point","Supports",null,null,"Resistances"]
[null,null,"Point",null,"S1","S2","S3","R1","R2","R3","HIGH","LOW","Total Trade Quanity in Lakhs"]
[1,"Nifty 50",12052.95,12070.15,11988.15,11923.35,11841.35,{"v":12134.949999999999,"d":"12134.95"},{"v":12216.949999999999,"d":"12216.95"},{"v":12281.749999999998,"d":"12281.75"},12152.15,12005.35]
[2,"Nifty Bank",31399.4,{"v":31483.916666666668,"d":"31483.92"},{"v":31116.383333333335,"d":"31116.38"},{"v":30833.36666666667,"d":"30833.37"},{"v":30465.833333333336,"d":"30465.83"},{"v":31766.933333333334,"d":"31766.93"},{"v":32134.466666666667,"d":"32134.47"},{"v":32417.483333333334,"d":"32417.48"},31851.45,31200.9]
[3,"Nifty CPSE",1912.75,{"v":1916.2666666666667,"d":"1916.27"},{"v":1902.7833333333333,"d":"1902.78"},{"v":1892.8166666666666,"d":"1892.82"},{"v":1879.3333333333333,"d":"1879.33"},{"v":1926.2333333333333,"d":"1926.23"},{"v":1939.7166666666665,"d":"1939.72"},{"v":1949.6833333333334,"d":"1949.68"},1929.75,1906.3]
[4,"Nifty Infra",3256.7,{"v":3260.633333333333,"d":"3260.63"},{"v":3236.7166666666662,"d":"3236.72"},{"v":3216.733333333333,"d":"3216.73"},{"v":3192.816666666666,"d":"3192.82"},{"v":3280.6166666666663,"d":"3280.62"},{"v":3304.5333333333333,"d":"3304.53"},{"v":3324.5166666666664,"d":"3324.52"},3284.55,3240.65]
[5,"Nifty IT",15895.2,{"v":15894.566666666666,"d":"15894.57"},{"v":15800.43333333333,"d":"15800.43"},{"v":15705.666666666664,"d":"15705.67"},{"v":15611.53333333333,"d":"15611.53"},{"v":15989.333333333332,"d":"15989.33"},{"v":16083.466666666667,"d":"16083.47"},{"v":16178.233333333334,"d":"16178.23"},15988.7,15799.8]
[6,"Nifty PSE",3185.3,{"v":3193.2333333333336,"d":"3193.23"},{"v":3167.166666666667,"d":"3167.17"},{"v":3149.0333333333333,"d":"3149.03"},{"v":3122.9666666666667,"d":"3122.97"},{"v":3211.3666666666672,"d":"3211.37"},{"v":3237.433333333334,"d":"3237.43"},{"v":3255.5666666666675,"d":"3255.57"},3219.3,3175.1]
[7,"Nifty Midcap 50",4674.65,{"v":4681.583333333333,"d":"4681.58"},{"v":4640.616666666666,"d":"4640.62"},{"v":4606.583333333333,"d":"4606.58"},{"v":4565.616666666666,"d":"4565.62"},{"v":4715.616666666666,"d":"4715.62"},{"v":4756.583333333333,"d":"4756.58"},{"v":4790.616666666666,"d":"4790.62"},4722.55,4647.55]
[8,"ACC",1456,{"v":1452.3500000000001,"d":"1452.35"},{"v":1439.6500000000003,"d":"1439.65"},{"v":1423.3000000000002,"d":"1423.30"},{"v":1410.6000000000004,"d":"1410.60"},{"v":1468.7000000000003,"d":"1468.70"},{"v":1481.4,"d":"1481.40"},{"v":1497.7500000000002,"d":"1497.75"},1465.05,1436,8.63805]
[9,"AUBANK",800.7,{"v":798.9166666666666,"d":"798.92"},{"v":789.7833333333333,"d":"789.78"},{"v":778.8666666666667,"d":"778.87"},{"v":769.7333333333333,"d":"769.73"},{"v":809.8333333333333,"d":"809.83"},{"v":818.9666666666667,"d":"818.97"},{"v":829.8833333333332,"d":"829.88"},808.05,788,28.46702]
[10,"ADANIPORTS",384.8,{"v":385.6499999999999,"d":"385.65"},{"v":381.54999999999984,"d":"381.55"},{"v":378.2999999999999,"d":"378.30"},{"v":374.1999999999998,"d":"374.20"},{"v":388.89999999999986,"d":"388.90"},{"v":392.9999999999999,"d":"393.00"},{"v":396.2499999999999,"d":"396.25"},389.75,382.4,80.91465]
[11,"ADANIPOWER",61,{"v":60.800000000000004,"d":"60.80"},{"v":59.85000000000001,"d":"59.85"},{"v":58.7,"d":"58.70"},{"v":57.75000000000001,"d":"57.75"},{"v":61.95000000000001,"d":"61.95"},{"v":62.90000000000001,"d":"62.90"},{"v":64.05000000000001,"d":"64.05"},61.75,59.65,87.0402]
{"$rows_left_out":228}
{"sheet":"MidCap Intra","index":3,"n_rows":545,"n_cols":13,"rows_kept":545,"merged":[[0,0,0,1],[8,0,9,0],[8,1,9,1],[8,2,9,2],[8,3,9,3],[8,4,8,6],[8,7,8,9]]}
[]
[]
[]
[]
[{"$nulls":11},"Back To Main Page"]
["FOR INTRA DAY TRADING",{"$nulls":9},{"$f":"Main!B10","v":"2020-01-08"}]
[null,null," "]
[]
["Sr.no","Scrip","CLOSE RATE","Pivot Point","Supports",null,null,"Resistances"]
[null,null,"Point",null,"S1","S2","S3","R1","R2","R3","HIGH","LOW","Total Trade Quanity in Lakhs"]
[1,"3MINDIA",21660.4,{"v":21520.466666666667,"d":"21520.47"},{"v":21164.933333333334,"d":"21164.93"},{"v":20669.466666666667,"d":"20669.47"},{"v":20313.933333333334,"d":"20313.93"},{"v":22015.933333333334,"d":"22015.93"},{"v":22371.466666666667,"d":"22371.47"},{"v":22866.933333333334,"d":"22866.93"},21876,21025,0.06441]
[2,"ACC",1456,{"v":1452.3500000000001,"d":"1452.35"},{"v":1439.6500000000003,"d":"1439.65"},{"v":1423.3000000000002,"d":"1423.30"},{"v":1410.6000000000004,"d":"1410.60"},{"v":1468.7000000000003,"d":"1468.70"},{"v":1481.4,"d":"1481.40"},{"v":1497.7500000000002,"d":"1497.75"},1465.05,1436,8.63805]
[3,"AIAENG",1649.3,{"v":1641.9000000000003,"d":"1641.90"},{"v":1628.0500000000006,"d":"1628.05"},{"v":1606.8000000000004,"d":"1606.80"},{"v":1592.9500000000007,"d":"1592.95"},{"v":1663.1500000000005,"d":"1663.15"},{"v":1677.0000000000005,"d":"1677.00"},{"v":1698.2500000000005,"d":"1698.25"},1655.75,1620.65,0.3258]
[4,"APLAPOLLO",1842.5,{"v":1828.4166666666667,"d":"1828.42"},{"v":1806.7333333333336,"d":"1806.73"},{"v":1770.966666666667,"d":"1770.97"},{"v":1749.2833333333338,"d":"1749.28"},{"v":1864.1833333333334,"d":"1864.18"},{"v":1885.8666666666663,"d":"1885.87"},{"v":1921.6333333333332,"d":"1921.63"},1850.1,1792.65,0.27512]
[5,"AUBANK",800.7,{"v":798.9166666666666,"d":"798.92"},{"v":789.7833333333333,"d":"789.78"},{"v":778.8666666666667,"d":"778.87"},{"v":769.7333333333333,"d":"769.73"},{"v":809.8333333333333,"d":"809.83"},{"v":818.9666666666667,"d":"818.97"},{"v":829.8833333333332,"d":"829.88"},808.05,788,28.46702]
[6,"AARTIIND",892.25,{"v":885.7833333333333,"d":"885.78"},{"v":866.4666666666666,"d":"866.47"},{"v":840.6833333333333,"d":"840.68"},{"v":821.3666666666666,"d":"821.37"},{"v":911.5666666666666,"d":"911.57"},{"v":930.8833333333332,"d":"930.88"},{"v":956.6666666666666,"d":"956.67"},905.1,860,6.82246]
[7,"AAVAS",1970.8,{"v":2005.2166666666665,"d":"2005.22"},{"v":1931.433333333333,"d":"1931.43"},{"v":1892.0666666666664,"d":"1892.07"},{"v":1818.2833333333328,"d":"1818.28"},{"v":2044.583333333333,"d":"2044.58"},{"v":2118.3666666666663,"d":"2118.37"},{"v":2157.733333333333,"d":"2157.73"},2079,1965.85,0.80277]
[8,"ABBOTINDIA",12742.9,{"v":12824.949999999999,"d":"12824.95"},{"v":12574.949999999997,"d":"12574.95"},{"v":12406.999999999998,"d":"12407.00"},{"v":12156.999999999996,"d":"12157.00"},{"v":12992.899999999998,"d":"12992.90"},{"v":13242.900000000001,"d":"13242.90"},{"v":13410.849999999999,"d":"13410.85"},13074.95,12657,0.17812]
[9,"ADANIGAS",171.1,{"v":169.96666666666667,"d":"169.97"},{"v":166.93333333333334,"d":"166.93"},{"v":162.76666666666668,"d":"162.77"},{"v":159.73333333333335,"d":"159.73"},{"v":174.13333333333333,"d":"174.13"},{"v":177.16666666666669,"d":"177.17"},{"v":181.33333333333331,"d":"181.33"},173,165.8,36.98599]
[10,"ADANIGREEN",210.6,{"v":208.0666666666667,"d":"208.07"},{"v":205.5333333333334,"d":"205.53"},{"v":200.4666666666667,"d":"200.47"},{"v":197.9333333333334,"d":"197.93"},{"v":213.13333333333338,"d":"213.13"},{"v":215.66666666666669,"d":"215.67"},{"v":220.73333333333338,"d":"220.73"},210.6,203,21.26797]
{"$rows_left_out":513}
{"sheet":"Bulk Deals","index":4,"n_rows":73,"n_cols":8,"rows_kept":73,"merged":[[4,0,4,1],[4,2,4,3],[6,1,6,2]]}
[" "]
[]
[]
[]
[]
[{"$nulls":4},"Back To Main Page"]
["Subject :","BULK DEAL",null,{"$f":"Main!B10","v":"2020-01-08"}]
[]
["Date","Scrip code","Scrip Name","Client Name","Buy / Sell","Quantity Traded","Trade Price / Wt.Avg.trade price","Exchange  "]
["2020-01-07",539098,"FILTRA","RADHIKA RASTOGI","BUY",{"v":45000,"d":"45,000"},14.04,"BSE"]
["2020-01-07",541627,"HITECHWIND","RAJA CHANDRASHEKHAR VENKATRAMAN","BUY",{"v":40000,"d":"40,000"},26.05,"BSE"]
["2020-01-07",538765,"JSHL","RAJEEV KUMAR GUPTA","BUY",{"v":40000,"d":"40,000"},17.6,"BSE"]
["2020-01-07",538765,"JSHL","ANURAAG BAJPAI","BUY",{"v":35000,"d":"35,000"},17.65,"BSE"]
["2020-01-07",538765,"JSHL","RAM SAGAR TIWARI","SELL",{"v":35000,"d":"35,000"},17.7,"BSE"]
["2020-01-07",535387,"LAKHOTIA","GANNAYAK SALES PRIVATE LIMITED","BUY",{"v":150000,"d":"150,000"},8.84,"BSE"]
["2020-01-07",535387,"LAKHOTIA","INTENSIVE FINANCE PRIVATE LIMITED","SELL",{"v":150000,"d":"150,000"},8.84,"BSE"]
["2020-01-07",531515,"MAHANIN","RAHUL R MEHTA","SELL",{"v":500000,"d":"500,000"},0.19,"BSE"]
["2020-01-07",531515,"MAHANIN","SHARDA SHARMA","BUY",{"v":501900,"d":"501,900"},0.19,"BSE"]
["2020-01-07",542771,"NOVATEOR","VIMAL RAMNIKLAL AMBANI","BUY",{"v":60000,"d":"60,000"},{"v":17.8,"d":"17.80"},"BSE"]
["2020-01-07",542771,"NOVATEOR","PARSOTAM KANTILAL PUROHIT","SELL",{"v":66000,"d":"66,000"},17.8,"BSE"]
{"$rows_left_out":54}
{"sheet":"Call Tracker (Equity & F&O)","index":5,"n_rows":285,"n_cols":18,"rows_kept":285,"merged":[[89,0,90,0],[89,1,90,1],[89,9,90,9],[89,11,90,11],[89,12,90,12],[89,13,90,13],[89,14,90,14],[99,0,100,0],[99,1,100,1],[99,9,100,9],[99,11,100,11],[99,12,100,12],[99,13,100,13],[99,14,100,14],[103,0,104,0],[103,1,104,1],[103,9,104,9],[103,11,104,11],[103,12,104,12],[103,13,104,13],[103,14,104,14],[107,0,108,0],[107,1,108,1],[107,9,108,9],[107,11,108,11],[107,12,108,12],[107,13,108,13],[107,14,108,14],[109,0,110,0],[109,1,110,1],[109,9,110,9],[109,11,110,11],[109,12,110,12],[109,13,110,13],[109,14,110,14],[111,0,112,0],[111,1,112,1],[111,9,112,9],[111,11,112,11],[111,12,112,12],[111,13,112,13],[111,14,112,14],[113,0,114,0],[113,1,114,1],[113,9,114,9],[113,11,114,11],[113,12,114,12],[113,13,114,13],[113,14,114,14]]}
[]
[]
[]
[]
[{"$nulls":12},"Back To Main Page"]
["Retail Research Technical Calls & Fundamental Performance Report for the month of January-2020 "]
[{"$nulls":12},{"$f":"Main!B10","v":"2020-01-08"}]
[null,"Positional  Call"]
["Sr.no","Date",null,"Company","Rec","Rec Price","Stop Loss***","Call Closed At","Target","Remark","Profit / Loss per Share","Gain / Loss  %","Status","Closed Date","NSE Closed Price"]
[1,"2019-10-07",null,"PIDILITIND","Buy{}",1367.5,1297,1399.25,"1500-1520","Profit of Rs.31.75/-",{"$f":"H10-F10","v":31.75},{"$f":"K10/F10","v":{"v":0.023217550274223033,"d":"2.32%"}},"Successful","2020-01-06",{"$nulls":3},"R"]
[2,"2019-11-14",null,"HEIDELBERG","Buy{}",186.5,174,191.5,"205-210","Profit of Rs.5/-",{"$f":"H11-F11","v":5},{"$f":"K11/F11","v":{"v":0.02680965147453083,"d":"2.68%"}},"Successful","2020-01-07",{"$nulls":3},"H"]
[3,"2019-11-18",null,"BAJAJ-AUTO","Sell",3190,3356.7,3030,"2900-2850","Profit of Rs.160/-",{"$f":"F12-H12","v":160},{"v":0.050156739811912224,"d":"5.02%"},"Successful","2020-01-06",{"$nulls":3},"R"]
[4,"2019-11-20",null,"BRITANNIA","Buy","3075-3100",2930,null,"3380-3420","Open",{"$nulls":4},{"$f":"VLOOKUP(D13,Sheet2!A76:M1715,6,0)","v":3036.6},null,null,"H"]
[5,"2019-11-21",null,"HINDUNILVR","Buy{}",2020,1917,1999.75,"2200-2250","Loss of Rs.20/-",{"$f":"H14-F14","v":-20.25},{"$f":"K14/F14","v":{"v":-0.010024752475247525,"d":"-1.00%"}},"Successful","2020-01-06",{"$nulls":3},"H"]
[6,"2019-11-27",null,"LT","Buy","1330-1340",1270,null,"1450-1500","Open",{"$nulls":4},{"$f":"VLOOKUP(D15,Sheet2!A80:M1719,6,0)","v":1320.5},null,null,"H"]
[7,"2019-12-02",null,"HAVELLS","Buy","662-667",632.7,null,"725-735","Open",{"$nulls":4},{"$f":"VLOOKUP(D16,Sheet2!A82:M1721,6,0)","v":640.4},null,null,"R"]
[8,"2019-12-06",null,"ONGC","Buy",127.5,122,132.5,140,"Part Profit of Rs.5/-",{"$f":"H17-F17","v":5},{"$f":"K17/F17","v":{"v":0.0392156862745098,"d":"3.92%"}},"Successful","2020-01-03",{"$f":"VLOOKUP(D17,Sheet2!A87:M1726,6,0)","v":125.75},null,null,"H"]
[9,"2019-12-23",null,"CANBK","Sell",227,238.3,216,"216-213","Profit of Rs.11/-",{"$f":"F18-H18","v":11},{"$f":"K18/F18","v":{"v":0.048458149779735685,"d":"4.85%"}},"Successful","2020-01-06",{"$nulls":3},"R"]
[10,"2019-12-24",null,"SBIN","Sell",334,351.3,317,"305-300","Profit of Rs.17/-",{"$f":"F19-H19","v":17},{"v":0.05089820359281437,"d":"5.09%"},"Successful","2020-01-07",{"$nulls":3},"R"]
[11,"2019-12-30",null,"EIHOTEL","Buy",140,132,145.5,"152-156","Part Profit of Rs.5.50/-",{"$f":"H20-F20","v":5.5},{"$f":"K20/F20","v":{"v":0.039285714285714285,"d":"3.93%"}},"Successful","2020-01-01",{"$f":"VLOOKUP(D20,Sheet2!A90:M1729,6,0)","v":141.75},null,null,"H"]
{"$rows_left_out":256}
{"sheet":"Sheet2","index":6,"n_rows":1899,"n_cols":14,"rows_kept":1899,"hidden":true}
["SYMBOL","SERIES","OPEN","HIGH","LOW","CLOSE","LAST","PREVCLOSE","TOTTRDQTY","TOTTRDVAL","TIMESTAMP","TOTALTRADES","ISIN","ISIN"]
["20MICRONS","EQ",32.35,34.8,32.35,33.2,33.3,32.8,24770,835535.35,"2020-01-07",604,"INE144J01027"]
["21STCENMGM","EQ",16.5,16.5,16.5,16.5,16.5,16.2,2520,41580,"2020-01-07",10,"INE253B01015"]
["3IINFOTECH","EQ",2.2,2.35,2.15,2.25,2.3,2.15,7695279,17350494.95,"2020-01-07",1468,"INE748C01020"]
["3MINDIA","EQ",21300,21876,21025,21660.4,21850,21089.7,6441,137757946.1,"2020-01-07",1302,"INE470A01017"]
["3PLAND","EQ",6.45,6.45,5.85,6.4,6.4,6.15,180,1135.1,"2020-01-07",8,"INE105C01023"]
["5PAISA","EQ",207,210.45,200.75,204.75,204,198.05,17367,3548664.7,"2020-01-07",572,"INE618L01018"]
["63MOONS","EQ",105.2,110.35,105.2,107.75,107.5,104.2,244357,26308317.6,"2020-01-07",4796,"INE111B01023"]
["A2ZINFRA","EQ",8.5,8.5,8.15,8.2,8.15,8.05,127374,1051451.2,"2020-01-07",291,"INE619I01012"]
["AARTIDRUGS","EQ",563,587,563,573.1,573.05,562.15,10871,6277209.95,"2020-01-07",871,"INE767A01016"]
["AARTIIND","EQ",864.8,905.1,860,892.25,890,855.95,682246,608272141.15,"2020-01-07",14269,"INE769A01020"]
["AARVEEDEN","EQ",14.5,14.5,13.65,13.95,13.85,14.15,8993,125751.8,"2020-01-07",57,"INE273D01019"]
["AAVAS","EQ",1993.05,2079,1965.85,1970.8,1970.25,1990.2,80277,162029728.2,"2020-01-07",9838,"INE216P01012"]
["ABAN","EQ",28.75,28.85,27.15,27.5,27.5,28.25,76497,2132249.25,"2020-01-07",564,"INE421A01028"]
["ABB","EQ",1298,1315,1289,1306.75,1299.95,1287,27246,35498571.45,"2020-01-07",2127,"INE117A01022"]
["ABBOTINDIA","EQ",12881.1,13074.95,12657,12742.9,12749.85,12780.3,17812,228117434.75,"2020-01-07",4751,"INE358A01014"]
["ABCAPITAL","EQ",103.1,104.5,101.5,102.35,102.1,101.2,1932133,198888214.8,"2020-01-07",17100,"INE674K01013"]
["ABFRL","EQ",239.95,239.95,230.25,232.35,230.25,234.4,303954,70973806.3,"2020-01-07",6861,"INE647O01011"]
["ABMINTLTD","BE",14.75,14.75,14.75,14.75,14.75,14.75,38,560.5,"2020-01-07",1,"INE251C01017"]
["ABSLBANETF","EQ",317.6,317.6,315,315.22,315.22,311.26,18,5709.22,"2020-01-07",3,"INF209KB1O58"]
{"$rows_left_out":1695}
{"sheet":"Sheet1","index":7,"n_rows":0,"n_cols":0,"rows_kept":0,"hidden":true}

{"sheet":"Sheet3","index":8,"n_rows":0,"n_cols":0,"rows_kept":0,"hidden":true}

{"sheet":"Sheet4","index":9,"n_rows":0,"n_cols":0,"rows_kept":0,"hidden":true}

{"sheet":"Sheet5","index":10,"n_rows":0,"n_cols":0,"rows_kept":0,"hidden":true}