{"text_format":"3","workbook":"xlsx","n_sheets":6,"sheets":["Main","Future Intra","Cash Intra","MidCap Intra","Bulk Deals","Call Tracker (Equity & F&O)"],"not_rendered":{"images":4,"defined_names":1},"read":"whole","date_system":"1900"}

{"sheet":"Main","index":0,"n_rows":27,"n_cols":11,"rows_kept":27}
[null,"                                                                                                 "]
[]
[]
[]
[]
[{"$nulls":6}," "]
[]
[]
[]
[null,"2023-12-11"]
[]
[null,"Sheet No.","Template Name","Summary"]
[null,1,"Future Intra","For Intraday trading in F&O segment"]
[null,2,"Cash Intra","For Intraday trading in cash market segment"]
[null,3,"Mid-cap Intra","For Intraday trading in Mid-cap stocks"]
[null,4,"Bulk Deals","Reveals Bulk Deals carried on NSE & BSE"]
[null,5,"Call Tracker"]
{"$rows_empty":9}
[{"$nulls":10},"`"]

{"sheet":"Future Intra","index":1,"n_rows":236,"n_cols":16,"rows_kept":236,"merged":[[8,0,9,0],[8,1,9,1],[8,2,9,2],[8,3,9,3],[8,6,8,8],[8,9,8,11]]}
[]
[]
[]
[]
[{"$nulls":12},"Back to Main Page"]
["FOR INTRA DAY TRADING",{"$nulls":10},{"$f":"Main!B10","v":"2023-12-11"}]
[]
[]
["Sr.no","Sector","Scrip","Expiry Date","CLOSE RATE","Pivot Point","Supports",null,null,"Resistances"]
[{"$nulls":4},"Point","Point","S1","S2","S3","R1","R2","R3","HIGH","LOW","OI","% Change in OI"]
[1,"Index","NIFTY","2023-12-28",{"v":21075,"d":"21075.00"},{"v":21043.816666666666,"d":"21043.82"},{"v":20980.18333333333,"d":"20980.18"},{"v":20885.366666666665,"d":"20885.37"},{"v":20821.73333333333,"d":"20821.73"},{"v":21138.63333333333,"d":"21138.63"},{"v":21202.266666666663,"d":"21202.27"},{"v":21297.083333333332,"d":"21297.08"},21107.45,20949,13297950,{"v":-0.022823886453736807,"d":"-2.28%"}]
[2,"Index","BANKNIFTY","2023-12-28",{"v":47499.8,"d":"47499.80"},{"v":47353.36666666667,"d":"47353.37"},{"v":47107.73333333334,"d":"47107.73"},{"v":46715.66666666667,"d":"46715.67"},{"v":46470.03333333334,"d":"46470.03"},{"v":47745.433333333334,"d":"47745.43"},{"v":47991.066666666666,"d":"47991.07"},{"v":48383.13333333333,"d":"48383.13"},47599,46961.3,2385795,{"v":0.06797153024911032,"d":"6.80%"}]
[3,"Index","FINNIFTY","2023-12-26",{"v":21308.2,"d":"21308.20"},{"v":21246.399999999998,"d":"21246.40"},{"v":21161.849999999995,"d":"21161.85"},{"v":21015.499999999996,"d":"21015.50"},{"v":20930.949999999993,"d":"20930.95"},{"v":21392.749999999996,"d":"21392.75"},{"v":21477.3,"d":"21477.30"},{"v":21623.649999999998,"d":"21623.65"},21330.95,21100.05,67560,{"v":0.12675116744496331,"d":"12.68%"}]
[4,"Index","MIDCPNIFTY","2023-12-22",10002.75,{"v":9991.766666666666,"d":"9991.77"},{"v":9923.533333333333,"d":"9923.53"},{"v":9844.316666666666,"d":"9844.32"},{"v":9776.083333333332,"d":"9776.08"},{"v":10070.983333333334,"d":"10070.98"},{"v":10139.216666666667,"d":"10139.22"},{"v":10218.433333333334,"d":"10218.43"},10060,9912.55,497475,{"v":9.74273100928604E-3,"d":"0.97%"}]
[5,"Chemical","AARTIIND","2023-12-28",{"v":572,"d":"572.00"},{"v":572.3166666666667,"d":"572.32"},{"v":561.6333333333334,"d":"561.63"},{"v":551.2666666666668,"d":"551.27"},{"v":540.5833333333335,"d":"540.58"},{"v":582.6833333333334,"d":"582.68"},{"v":593.3666666666666,"d":"593.37"},{"v":603.7333333333333,"d":"603.73"},583,561.95,12499000,{"v":-0.0073856416772554,"d":"-0.74%"}]
[6,"Capital_Goods","ABB","2023-12-28",4758.45,{"v":4773.650000000001,"d":"4773.65"},{"v":4687.300000000001,"d":"4687.30"},{"v":4616.150000000001,"d":"4616.15"},{"v":4529.800000000001,"d":"4529.80"},{"v":4844.800000000001,"d":"4844.80"},{"v":4931.1500000000015,"d":"4931.15"},{"v":5002.300000000001,"d":"5002.30"},4860,4702.5,1103000,{"v":4.325062599590257E-3,"d":"0.43%"}]
[7,"Pharma","ABBOTINDIA","2023-12-28",{"v":22976.9,"d":"22976.90"},{"v":23018.933333333334,"d":"23018.93"},{"v":22772.86666666667,"d":"22772.87"},{"v":22568.833333333336,"d":"22568.83"},{"v":22322.76666666667,"d":"22322.77"},{"v":23222.966666666667,"d":"23222.97"},{"v":23469.033333333333,"d":"23469.03"},{"v":23673.066666666666,"d":"23673.07"},23265,22814.9,109640,{"v":-7.2912869121399923E-4,"d":"-0.07%"}]
[8,"Others","ABCAPITAL","2023-12-28",{"v":164.2,"d":"164.20"},{"v":165.04999999999998,"d":"165.05"},{"v":161.54999999999995,"d":"161.55"},{"v":158.89999999999998,"d":"158.90"},{"v":155.39999999999995,"d":"155.40"},{"v":167.69999999999996,"d":"167.70"},{"v":171.20000000000002,"d":"171.20"},{"v":173.84999999999997,"d":"173.85"},168.55,162.4,73639800,{"v":0.048274271658082867,"d":"4.83%"}]
[9,"Textile","ABFRL","2023-12-28",{"v":234.9,"d":"234.90"},{"v":236.13333333333335,"d":"236.13"},{"v":230.2166666666667,"d":"230.22"},{"v":225.53333333333333,"d":"225.53"},{"v":219.61666666666667,"d":"219.62"},{"v":240.81666666666672,"d":"240.82"},{"v":246.7333333333334,"d":"246.73"},{"v":251.41666666666674,"d":"251.42"},242.05,231.45,30427800,{"v":-0.011403953370501775,"d":"-1.14%"}]
[10,"Cement","ACC","2023-12-28",{"v":2144.4,"d":"2144.40"},{"v":2139.8333333333335,"d":"2139.83"},{"v":2109.066666666667,"d":"2109.07"},{"v":2073.7333333333336,"d":"2073.73"},{"v":2042.9666666666672,"d":"2042.97"},{"v":2175.166666666667,"d":"2175.17"},{"v":2205.9333333333334,"d":"2205.93"},{"v":2241.266666666667,"d":"2241.27"},2170.6,2104.5,4630800,{"v":-0.006372706791116833,"d":"-0.64%"}]
{"$rows_left_out":196}
{"sheet":"Cash Intra","index":2,"n_rows":245,"n_cols":13,"rows_kept":245,"merged":[[7,0,8,0],[7,1,8,1],[7,2,8,2],[7,3,8,3],[7,4,7,6],[7,7,7,9]]}
[]
[]
[]
[]
[{"$nulls":12},"Back to Main Page"]
["FOR INTRA DAY TRADING",{"$nulls":9},{"$f":"Main!B10","v":"2023-12-11"}]
[]
["Sr.no",null,"CLOSE RATE","Pivot Point","Supports",null,null,"Resistances"]
[{"$nulls":4},"S1","S2","S3","R1","R2","R3","HIGH","LOW","Total Trade Quanity in Lakhs"]
[1,"Nifty 50",{"v":20969.4,"d":"20969.40"},{"v":20946.066666666666,"d":"20946.07"},{"v":20886.033333333333,"d":"20886.03"},{"v":20802.666666666668,"d":"20802.67"},{"v":20742.633333333335,"d":"20742.63"},{"v":21029.43333333333,"d":"21029.43"},{"v":21089.466666666664,"d":"21089.47"},{"v":21172.83333333333,"d":"21172.83"},{"v":21006.1,"d":"21006.10"},{"v":20862.7,"d":"20862.70"}]
[2,"Nifty Bank",{"v":47262,"d":"47262.00"},47119.85,{"v":46936.049999999996,"d":"46936.05"},{"v":46610.1,"d":"46610.10"},{"v":46426.299999999996,"d":"46426.30"},{"v":47445.799999999996,"d":"47445.80"},{"v":47629.6,"d":"47629.60"},{"v":47955.549999999996,"d":"47955.55"},47303.65,{"v":46793.9,"d":"46793.90"}]
[3,"Nifty CPSE",4507.75,{"v":4520.366666666667,"d":"4520.37"},{"v":4447.283333333334,"d":"4447.28"},{"v":4386.816666666667,"d":"4386.82"},{"v":4313.733333333334,"d":"4313.73"},{"v":4580.833333333334,"d":"4580.83"},{"v":4653.916666666666,"d":"4653.92"},{"v":4714.383333333334,"d":"4714.38"},4593.45,{"v":4459.9,"d":"4459.90"}]
[4,"Nifty Infra",6951.25,{"v":6950.400000000001,"d":"6950.40"},{"v":6902.600000000001,"d":"6902.60"},{"v":6853.950000000001,"d":"6853.95"},{"v":6806.1500000000015,"d":"6806.15"},{"v":6999.050000000001,"d":"6999.05"},7046.85,{"v":7095.500000000001,"d":"7095.50"},{"v":6998.2,"d":"6998.20"},6901.75]
[5,"Nifty IT",{"v":33392.9,"d":"33392.90"},{"v":33286,"d":"33286.00"},{"v":33119.6,"d":"33119.60"},{"v":32846.299999999996,"d":"32846.30"},{"v":32679.899999999994,"d":"32679.90"},{"v":33559.3,"d":"33559.30"},{"v":33725.7,"d":"33725.70"},{"v":33999.00000000001,"d":"33999.00"},{"v":33452.4,"d":"33452.40"},{"v":33012.7,"d":"33012.70"}]
[6,"Nifty PSE",7329.55,{"v":7339.349999999999,"d":"7339.35"},{"v":7235.399999999999,"d":"7235.40"},{"v":7141.249999999999,"d":"7141.25"},{"v":7037.299999999998,"d":"7037.30"},{"v":7433.499999999999,"d":"7433.50"},7537.45,{"v":7631.599999999999,"d":"7631.60"},{"v":7443.3,"d":"7443.30"},{"v":7245.2,"d":"7245.20"}]
[7,"Nifty Midcap 50",{"v":12624.2,"d":"12624.20"},{"v":12616.133333333333,"d":"12616.13"},{"v":12520.416666666666,"d":"12520.42"},{"v":12416.633333333333,"d":"12416.63"},{"v":12320.916666666666,"d":"12320.92"},{"v":12719.916666666666,"d":"12719.92"},{"v":12815.633333333333,"d":"12815.63"},{"v":12919.416666666666,"d":"12919.42"},12711.85,12512.35]
[8,"ABB",4746.8,{"v":4758.200000000001,"d":"4758.20"},{"v":4673.050000000001,"d":"4673.05"},{"v":4599.3,"d":"4599.30"},{"v":4514.150000000001,"d":"4514.15"},{"v":4831.950000000002,"d":"4831.95"},{"v":4917.100000000001,"d":"4917.10"},{"v":4990.850000000002,"d":"4990.85"},4843.35,4684.45,2.31897]
[9,"ABBOTINDIA",22858,{"v":22912.216666666664,"d":"22912.22"},{"v":22674.433333333327,"d":"22674.43"},{"v":22490.866666666665,"d":"22490.87"},{"v":22253.08333333333,"d":"22253.08"},{"v":23095.783333333326,"d":"23095.78"},{"v":23333.56666666666,"d":"23333.57"},{"v":23517.133333333324,"d":"23517.13"},23150,22728.65,0.08428]
[10,"ABCAPITAL",163.2,{"v":164.51666666666668,"d":"164.52"},{"v":160.63333333333335,"d":"160.63"},{"v":158.06666666666666,"d":"158.07"},{"v":154.18333333333334,"d":"154.18"},{"v":167.08333333333337,"d":"167.08"},{"v":170.9666666666667,"d":"170.97"},{"v":173.5333333333334,"d":"173.53"},168.4,161.95,95.98951]
[11,"ABFRL",233.95,{"v":235.5333333333333,"d":"235.53"},{"v":229.61666666666662,"d":"229.62"},{"v":225.2833333333333,"d":"225.28"},{"v":219.36666666666662,"d":"219.37"},{"v":239.86666666666662,"d":"239.87"},{"v":245.7833333333333,"d":"245.78"},{"v":250.11666666666662,"d":"250.12"},241.45,231.2,20.51559]
{"$rows_left_out":226}
{"sheet":"MidCap Intra","index":3,"n_rows":530,"n_cols":13,"rows_kept":530,"merged":[[0,0,0,1],[8,0,9,0],[8,1,9,1],[8,2,9,2],[8,3,9,3],[8,4,8,6],[8,7,8,9]]}
[]
[]
[]
[]
[{"$nulls":11},"Back To Main Page"]
["FOR INTRA DAY TRADING",{"$nulls":9},{"$f":"Main!B10","v":"2023-12-11"}]
[null,null," "]
[]
["Sr.no","Scrip","CLOSE RATE","Pivot Point","Supports",null,null,"Resistances"]
[{"$nulls":4},"S1","S2","S3","R1","R2","R3","HIGH","LOW","Total Trade Quanity in Lakhs"]
[1,"360ONE",647.55,{"v":646.5166666666667,"d":"646.52"},{"v":641.0333333333333,"d":"641.03"},{"v":634.5166666666667,"d":"634.52"},{"v":629.0333333333333,"d":"629.03"},{"v":653.0333333333333,"d":"653.03"},{"v":658.5166666666667,"d":"658.52"},{"v":665.0333333333333,"d":"665.03"},652,640,5.38465]
[2,"3MINDIA",31479.7,{"v":31403.38333333333,"d":"31403.38"},{"v":31275.316666666662,"d":"31275.32"},{"v":31070.93333333333,"d":"31070.93"},{"v":30942.86666666666,"d":"30942.87"},{"v":31607.766666666663,"d":"31607.77"},{"v":31735.83333333333,"d":"31735.83"},{"v":31940.216666666664,"d":"31940.22"},31531.45,31199,0.00865]
[3,"AARTIDRUGS",487.5,{"v":489,"d":"489.00"},{"v":482.5,"d":"482.50"},{"v":477.5,"d":"477.50"},{"v":471,"d":"471.00"},{"v":494,"d":"494.00"},{"v":500.5,"d":"500.50"},{"v":505.5,"d":"505.50"},495.5,484,1.28912]
[4,"AARTIIND",569.35,{"v":569.5833333333334,"d":"569.58"},{"v":559.7666666666668,"d":"559.77"},{"v":550.1833333333334,"d":"550.18"},{"v":540.3666666666668,"d":"540.37"},{"v":579.1666666666667,"d":"579.17"},{"v":588.9833333333333,"d":"588.98"},{"v":598.5666666666667,"d":"598.57"},579.4,560,14.24768]
[5,"AAVAS",1490.95,{"v":1508.0833333333333,"d":"1508.08"},{"v":1464.3666666666666,"d":"1464.37"},{"v":1437.7833333333333,"d":"1437.78"},{"v":1394.0666666666666,"d":"1394.07"},{"v":1534.6666666666665,"d":"1534.67"},{"v":1578.3833333333332,"d":"1578.38"},{"v":1604.9666666666665,"d":"1604.97"},1551.8,1481.5,4.58794]
[6,"ABB",4746.8,{"v":4758.200000000001,"d":"4758.20"},{"v":4673.050000000001,"d":"4673.05"},{"v":4599.3,"d":"4599.30"},{"v":4514.150000000001,"d":"4514.15"},{"v":4831.950000000002,"d":"4831.95"},{"v":4917.100000000001,"d":"4917.10"},{"v":4990.850000000002,"d":"4990.85"},4843.35,4684.45,2.31897]
[7,"ABBOTINDIA",22858,{"v":22912.216666666664,"d":"22912.22"},{"v":22674.433333333327,"d":"22674.43"},{"v":22490.866666666665,"d":"22490.87"},{"v":22253.08333333333,"d":"22253.08"},{"v":23095.783333333326,"d":"23095.78"},{"v":23333.56666666666,"d":"23333.57"},{"v":23517.133333333324,"d":"23517.13"},23150,22728.65,0.08428]
[8,"ACC",2137.8,{"v":2132.0833333333335,"d":"2132.08"},{"v":2106.016666666667,"d":"2106.02"},{"v":2074.2333333333336,"d":"2074.23"},{"v":2048.166666666667,"d":"2048.17"},{"v":2163.866666666667,"d":"2163.87"},{"v":2189.9333333333334,"d":"2189.93"},{"v":2221.7166666666667,"d":"2221.72"},2158.15,2100.3,5.24686]
[9,"ADANIENT",2822.15,{"v":2836.383333333333,"d":"2836.38"},{"v":2745.7666666666664,"d":"2745.77"},{"v":2669.383333333333,"d":"2669.38"},{"v":2578.7666666666664,"d":"2578.77"},{"v":2912.7666666666664,"d":"2912.77"},{"v":3003.383333333333,"d":"3003.38"},{"v":3079.7666666666664,"d":"3079.77"},2927,2760,69.59428]
[10,"ADANIGREEN",1550.3,{"v":1571.3666666666668,"d":"1571.37"},{"v":1473.9333333333336,"d":"1473.93"},{"v":1397.5666666666668,"d":"1397.57"},{"v":1300.1333333333337,"d":"1300.13"},{"v":1647.7333333333336,"d":"1647.73"},{"v":1745.166666666667,"d":"1745.17"},{"v":1821.5333333333335,"d":"1821.53"},1668.8,1495,54.10307]
{"$rows_left_out":511}
{"sheet":"Bulk Deals","index":4,"n_rows":274,"n_cols":8,"rows_kept":274,"merged":[[4,0,4,1],[4,2,4,3],[6,1,6,2]]}
[" "]
[]
[]
[]
[]
[{"$nulls":4},"Back To Main Page"]
["Subject :","BULK DEAL",null,{"$f":"Main!B10","v":"2023-12-11"}]
[]
["Date","Scrip code","Scrip Name","Client Name","Buy / Sell","Quantity Traded","Trade Price / Wt.Avg.trade price","Exchange  "]
["2023-12-08",541144,"ACTIVE","LAXMAN SOPAN WAGHMODE","BUY",{"v":134349,"d":"134,349"},97.05,"BSE"]
["2023-12-08",539773,"ADVIKCA","SILVERTOSS SHOPPERS PRIVATE LIMITED","SELL",{"v":6143695,"d":"6,143,695"},2.42,"BSE"]
["2023-12-08",539773,"ADVIKCA","SILVERTOSS SHOPPERS PRIVATE LIMITED","BUY",{"v":694156,"d":"694,156"},2.54,"BSE"]
["2023-12-08",540718,"AKM","MAHADEV MANUBHAI MAKVANA","BUY",{"v":39000,"d":"39,000"},52.6,"BSE"]
["2023-12-08",540718,"AKM","MITHLESH CONSULTANCY LLP","SELL",{"v":45000,"d":"45,000"},52.61,"BSE"]
["2023-12-08",511463,"ALEXANDER","RAHUL KUMAR DAGA","SELL",{"v":75000,"d":"75,000"},18.5,"BSE"]
["2023-12-08",511463,"ALEXANDER","SHASHANK DIXIT","SELL",{"v":28583,"d":"28,583"},19.67,"BSE"]
["2023-12-08",511463,"ALEXANDER","SHASHANK DIXIT","BUY",{"v":418955,"d":"418,955"},18.95,"BSE"]
["2023-12-08",511463,"ALEXANDER","RAJVISATISHGOSRANI","SELL",{"v":48980,"d":"48,980"},20.34,"BSE"]
["2023-12-08",511463,"ALEXANDER","TEJESH HASMUKH SHAH","SELL",{"v":50310,"d":"50,310"},18.98,"BSE"]
["2023-12-08",544037,"AMIC","MULTIPLIER SHARE & STOCK ADVISORS PRIVATE LIMITED","BUY",{"v":63000,"d":"63,000"},277.05,"BSE"]
{"$rows_left_out":255}
{"sheet":"Call Tracker (Equity & F&O)","index":5,"n_rows":292,"n_cols":19,"rows_kept":292,"merged":[[58,0,59,0],[58,1,59,1],[58,9,59,9],[58,12,59,12],[58,14,59,14],[58,15,59,15],[60,0,61,0],[60,1,61,1],[60,9,61,9],[60,12,61,12],[60,14,61,14],[60,15,61,15],[65,0,66,0],[65,1,66,1],[65,9,66,9],[65,12,66,12],[65,14,66,14],[65,15,66,15]]}
[]
[]
[]
[]
[{"$nulls":12},"Back To Main Page"]
["Retail Research Technical Calls & Fundamental Performance Report for the month of December-2023"]
[{"$nulls":12},{"$f":"Main!B10","v":"2023-12-11"}]
[null,"Positional  Call"]
["Sr.no","Date",null,"Company","Rec","Rec Price","Stop Loss***","Call Closed At","Target","Remark","Profit / Loss per Share","All charges","Net Gain / Loss  %","Status","Closed Date","Market Closing Price","Second Buying Date"]
[1,"2023-09-20",null,"RELIANCE","Accu",2335,2235,2451,"2550-2700","Profit of Rs.116/-",{"$f":"H10-F10","v":116},{"$f":"(F10*-0.3)/100","v":{"v":-7.005,"d":"-7.01"}},{"$f":"(K10+L10)/F10","v":{"v":0.046678800856531054,"d":"4.67%"}},"Successful","2023-12-06",null,"2023-10-04",null,"H"]
[2,"2023-09-21",null,"VGUARD","Accu","285-305",276,null,"330-350","Open",{"$nulls":5},{"$f":"VLOOKUP(D11,'MidCap Intra'!$B$11:$C$568,2,0)","v":299.35},"2023-10-09",null,"K"]
[3,"2023-10-13",null,"TCS","Accu <>","3441-3541",3321,null,"3800-4000","Open",{"$nulls":5},{"$f":"VLOOKUP(D12,'MidCap Intra'!$B$11:$C$568,2,0)","v":{"v":3626.7,"d":"3626.70"}},"2023-10-19",null,"H"]
[4,"2023-10-25",null,"ICICIBANK","Accu",916,870,972.5,"990-1050","Profit of Rs.56.5/-",{"$f":"H13-F13","v":56.5},{"$f":"(F13*-0.3)/100","v":{"v":-2.748,"d":"-2.75"}},{"$f":"(K13+L13)/F13","v":{"v":0.05868122270742358,"d":"5.87%"}},"Successful","2023-12-04",null,"2023-10-26",null,"H"]
[5,"2023-11-06",null,"HEIDELBERG","Accu",189.5,177,200,"204-214","Profit of Rs.10.5/-",{"$f":"H14-F14","v":10.5},{"$f":"(F14*-0.3)/100","v":{"v":-0.5685,"d":"-0.57"}},{"$f":"(K14+L14)/F14","v":{"v":0.0524089709762533,"d":"5.24%"}},"Successful","2023-12-01",{"$nulls":3},"H"]
[6,"2023-11-08",null,"JAMNAAUTO","Accu<>","106.40-111.40",102.9,null,"119-125","Open",{"$nulls":5},{"$f":"VLOOKUP(D15,'MidCap Intra'!$B$11:$C$568,2,0)","v":109.95},null,null,"H"]
[7,"2023-11-17",null,"ASHOKLEY","Accu","169-174",163,null,"185-195","Open",{"$nulls":5},{"$f":"VLOOKUP(D16,'MidCap Intra'!$B$11:$C$568,2,0)","v":{"v":174.9,"d":"174.90"}},null,null,"K"]
[8,"2023-11-17",null,"AMBUJACEM","Accu",422.5,390,457.5,"450-470","Profit of Rs.35/-",{"$f":"H17-F17","v":35},{"$f":"(F17*-0.3)/100","v":{"v":-1.2675,"d":"-1.27"}},{"$f":"(K17+L17)/F17","v":{"v":0.07984023668639054,"d":"7.98%"}},"Successful","2023-12-04",{"$nulls":3},"H"]
[9,"2023-11-20",null,"TRIDENT","Accu","35.9-37",34.35,null,"40-42","Open",{"$nulls":5},{"$f":"VLOOKUP(D18,'MidCap Intra'!$B$11:$C$568,2,0)","v":36.65},null,null,"H"]
[10,"2023-11-20",null,"RVNL","Accu",164,152,174.25,"174-185","Profit of Rs.10.25/-",{"$f":"H19-F19","v":10.25},{"$f":"(F19*-0.3)/100","v":{"v":-0.49199999999999994,"d":"-0.49"}},{"$f":"(K19+L19)/F19","v":{"v":0.059500000000000004,"d":"5.95%"}},"Successful","2023-12-04",{"$nulls":3},"H"]
[11,"2023-11-22",null,"SCHAEFFLER","Accu",2805,2540,2990,"3100-3200","Profit of Rs.185/-",{"$f":"H20-F20","v":185},{"$f":"(F20*-0.3)/100","v":{"v":-8.415,"d":"-8.42"}},{"$f":"(K20+L20)/F20","v":{"v":0.06295365418894831,"d":"6.30%"}},"Successful","2023-12-06",{"$nulls":3},"H"]
{"$rows_left_out":265}