{"text_format":"3","workbook":"xlsx","n_sheets":11,"sheets":["Main","Future Intra","Cash Intra","MidCap Intra","Bulk Deals","Call Tracker (Equity & F&O)","Sheet2","Sheet1","Sheet3","Sheet4","Sheet5"],"not_rendered":{"images":4,"defined_names":5},"read":"whole","date_system":"1900"}

{"sheet":"Main","index":0,"n_rows":27,"n_cols":11,"rows_kept":27}
[null,"                                                                                                 "]
{"$rows_empty":8}
[null,"2019-11-11"]
[]
[null,"Sheet No.","Template Name","Summary"]
[null,1,"Future Intra","For Intraday trading in F&O segment"]
[null,2,"Cash Intra","For Intraday trading in cash market segment"]
[null,3,"Mid-cap Intra","For Intraday trading in Mid-cap stocks"]
[null,4,"Bulk Deals","Reveals Bulk Deals carried on NSE & BSE"]
[null,5,"Call Tracker"]
{"$rows_empty":9}
[{"$nulls":10},"`"]

{"sheet":"Future Intra","index":1,"n_rows":193,"n_cols":15,"rows_kept":193,"merged":[[8,0,9,0],[8,1,9,1],[8,2,9,2],[8,5,8,7],[8,8,8,10]]}
[]
[]
[]
[]
[{"$nulls":12},"Back to Main Page"]
["FOR INTRA DAY TRADING",{"$nulls":10},{"$f":"Main!B10","v":"2019-11-11"}]
[]
[]
["Sr.no","Sector","Scrip","CLOSE RATE","Pivot Point","Supports",null,null,"Resistances"]
[null,"Sector",null,"Point","Point","S1","S2","S3","R1","R2","R3","HIGH","LOW","OI","% Change in OI"]
[1,"Index","BANKNIFTY",{"v":30759,"d":"30759.00"},{"v":30783.850000000002,"d":"30783.85"},{"v":30468.700000000004,"d":"30468.70"},{"v":30178.4,"d":"30178.40"},{"v":29863.250000000004,"d":"29863.25"},{"v":31074.150000000005,"d":"31074.15"},{"v":31389.300000000007,"d":"31389.30"},{"v":31679.600000000006,"d":"31679.60"},31099,30493.55,1738200,{"v":0.1859665402145138,"d":"18.60%"}]
[2,"Index","NIFTY",11945.35,{"v":11982.566666666666,"d":"11982.57"},{"v":11896.133333333331,"d":"11896.13"},{"v":11846.916666666666,"d":"11846.92"},{"v":11760.483333333332,"d":"11760.48"},{"v":12031.783333333331,"d":"12031.78"},{"v":12118.216666666665,"d":"12118.22"},{"v":12167.43333333333,"d":"12167.43"},12069,11933.35,16551300,{"v":-0.02277839771861771,"d":"-2.28%"}]
[3,"Index","NIFTYIT",{"v":15505,"d":"15505.00"},{"v":15578,"d":"15578.00"},{"v":15399,"d":"15399.00"},{"v":15293,"d":"15293.00"},{"v":15114,"d":"15114.00"},{"v":15684,"d":"15684.00"},{"v":15863,"d":"15863.00"},{"v":15969,"d":"15969.00"},15757,15472,8450,{"v":0.2158273381294964,"d":"21.58%"}]
[4,"Cement","ACC",{"v":1509,"d":"1509.00"},{"v":1520.3333333333333,"d":"1520.33"},{"v":1490.6666666666665,"d":"1490.67"},{"v":1472.3333333333333,"d":"1472.33"},{"v":1442.6666666666665,"d":"1442.67"},{"v":1538.6666666666665,"d":"1538.67"},{"v":1568.333333333333,"d":"1568.33"},{"v":1586.6666666666665,"d":"1586.67"},1550,1502,2952400,{"v":0.023717059639389738,"d":"2.37%"}]
[5,"Others","ADANIENT",208.35,{"v":209.16666666666666,"d":"209.17"},{"v":205.83333333333331,"d":"205.83"},{"v":203.31666666666666,"d":"203.32"},{"v":199.98333333333332,"d":"199.98"},{"v":211.6833333333333,"d":"211.68"},{"v":215.01666666666662,"d":"215.02"},{"v":217.5333333333333,"d":"217.53"},212.5,206.65,30280000,{"v":-0.007603565810173046,"d":"-0.76%"}]
[6,"Others","ADANIPORTS",{"v":386.9,"d":"386.90"},{"v":388.4666666666667,"d":"388.47"},{"v":384.58333333333337,"d":"384.58"},{"v":382.26666666666665,"d":"382.27"},{"v":378.3833333333333,"d":"378.38"},{"v":390.7833333333334,"d":"390.78"},{"v":394.66666666666674,"d":"394.67"},{"v":396.98333333333346,"d":"396.98"},392.35,386.15,17122500,{"v":4.8415492957746475E-3,"d":"0.48%"}]
[7,"Power","ADANIPOWER",{"v":68.9,"d":"68.90"},{"v":69.91666666666667,"d":"69.92"},{"v":67.48333333333335,"d":"67.48"},{"v":66.06666666666668,"d":"66.07"},{"v":63.633333333333354,"d":"63.63"},{"v":71.33333333333334,"d":"71.33"},{"v":73.76666666666665,"d":"73.77"},{"v":75.18333333333334,"d":"75.18"},72.35,68.5,78340000,{"v":-0.0155818044734858,"d":"-1.56%"}]
[8,"Automobile","AMARAJABAT",{"v":654.6,"d":"654.60"},{"v":660.0833333333334,"d":"660.08"},{"v":646.5166666666668,"d":"646.52"},{"v":638.4333333333334,"d":"638.43"},{"v":624.8666666666668,"d":"624.87"},{"v":668.1666666666667,"d":"668.17"},{"v":681.7333333333333,"d":"681.73"},{"v":689.8166666666667,"d":"689.82"},673.65,652,1290200,{"v":-0.03203541150874034,"d":"-3.20%"}]
[9,"Cement","AMBUJACEM",{"v":201.8,"d":"201.80"},202.35,199.35,{"v":196.9,"d":"196.90"},{"v":193.9,"d":"193.90"},{"v":204.79999999999998,"d":"204.80"},{"v":207.79999999999998,"d":"207.80"},{"v":210.24999999999997,"d":"210.25"},205.35,199.9,19042500,{"v":-0.02968152866242038,"d":"-2.97%"}]
[10,"Others","APOLLOHOSP",{"v":1419.7,"d":"1419.70"},{"v":1433.4166666666667,"d":"1433.42"},{"v":1399.8833333333334,"d":"1399.88"},{"v":1380.0666666666666,"d":"1380.07"},{"v":1346.5333333333333,"d":"1346.53"},{"v":1453.2333333333336,"d":"1453.23"},{"v":1486.7666666666669,"d":"1486.77"},{"v":1506.5833333333337,"d":"1506.58"},1466.95,1413.6,1664000,{"v":-0.013048635824436536,"d":"-1.30%"}]
{"$rows_left_out":159}
{"sheet":"Cash Intra","index":2,"n_rows":247,"n_cols":13,"rows_kept":247,"merged":[[7,0,8,0],[7,1,8,1],[7,2,8,2],[7,3,8,3],[7,4,7,6],[7,7,7,9]]}
[]
[]
[]
[]
[{"$nulls":12},"Back to Main Page"]
["FOR INTRA DAY TRADING",{"$nulls":9},{"$f":"Main!B10","v":"2019-11-11"}]
[]
["Sr.no","Scrip","CLOSE RATE","Pivot Point","Supports",null,null,"Resistances"]
[null,null,"Point",null,"S1","S2","S3","R1","R2","R3","HIGH","LOW","Total Trade Quanity in Lakhs"]
[1,"Nifty 50",11908.15,{"v":11943.683333333334,"d":"11943.68"},{"v":11853.216666666669,"d":"11853.22"},{"v":11798.283333333335,"d":"11798.28"},{"v":11707.81666666667,"d":"11707.82"},{"v":11998.616666666669,"d":"11998.62"},{"v":12089.083333333336,"d":"12089.08"},{"v":12144.016666666668,"d":"12144.02"},12034.15,11888.75]
[2,"Nifty Bank",30749.4,{"v":30787.283333333336,"d":"30787.28"},{"v":30466.16666666667,"d":"30466.17"},{"v":30182.933333333334,"d":"30182.93"},{"v":29861.81666666667,"d":"29861.82"},{"v":31070.516666666674,"d":"31070.52"},{"v":31391.633333333335,"d":"31391.63"},{"v":31674.866666666676,"d":"31674.87"},31108.4,30504.05]
[3,"Nifty CPSE",1990,{"v":2003,"d":"2003.00"},{"v":1973.7,"d":"1973.70"},{"v":1957.4,"d":"1957.40"},{"v":1928.1000000000001,"d":"1928.10"},{"v":2019.3,"d":"2019.30"},{"v":2048.6000000000004,"d":"2048.60"},{"v":2064.8999999999996,"d":"2064.90"},2032.3,1986.7]
[4,"Nifty Infra",3254.6,{"v":3263.933333333333,"d":"3263.93"},{"v":3240.516666666666,"d":"3240.52"},{"v":3226.433333333333,"d":"3226.43"},{"v":3203.016666666666,"d":"3203.02"},{"v":3278.016666666666,"d":"3278.02"},{"v":3301.433333333333,"d":"3301.43"},{"v":3315.516666666666,"d":"3315.52"},3287.35,3249.85]
[5,"Nifty IT",15383.3,{"v":15465.716666666665,"d":"15465.72"},{"v":15273.283333333331,"d":"15273.28"},{"v":15163.266666666666,"d":"15163.27"},{"v":14970.833333333332,"d":"14970.83"},{"v":15575.73333333333,"d":"15575.73"},{"v":15768.166666666664,"d":"15768.17"},{"v":15878.183333333329,"d":"15878.18"},15658.15,15355.7]
[6,"Nifty PSE",3301.85,{"v":3323.5499999999997,"d":"3323.55"},{"v":3273.9999999999995,"d":"3274.00"},{"v":3246.1499999999996,"d":"3246.15"},{"v":3196.5999999999995,"d":"3196.60"},{"v":3351.3999999999996,"d":"3351.40"},3400.95,{"v":3428.7999999999997,"d":"3428.80"},3373.1,3295.7]
[7,"Nifty Midcap 50",4595.65,{"v":4616.2,"d":"4616.20"},{"v":4568.599999999999,"d":"4568.60"},{"v":4541.549999999999,"d":"4541.55"},{"v":4493.949999999999,"d":"4493.95"},4643.25,4690.85,{"v":4717.900000000001,"d":"4717.90"},4663.8,4589.15]
[8,"ACC",1506.4,{"v":1516.4833333333333,"d":"1516.48"},{"v":1488.9666666666667,"d":"1488.97"},{"v":1471.5333333333333,"d":"1471.53"},{"v":1444.0166666666667,"d":"1444.02"},{"v":1533.9166666666667,"d":"1533.92"},{"v":1561.4333333333336,"d":"1561.43"},{"v":1578.8666666666668,"d":"1578.87"},1544,1499.05,6.35287]
[9,"AUBANK",689.5,{"v":687.5,"d":"687.50"},{"v":678,"d":"678.00"},{"v":666.5,"d":"666.50"},{"v":657,"d":"657.00"},{"v":699,"d":"699.00"},{"v":708.5,"d":"708.50"},{"v":720,"d":"720.00"},697,676,2.67306]
[10,"ADANIPORTS",386.15,{"v":387.6166666666666,"d":"387.62"},{"v":384.03333333333325,"d":"384.03"},{"v":381.91666666666663,"d":"381.92"},{"v":378.33333333333326,"d":"378.33"},{"v":389.73333333333323,"d":"389.73"},{"v":393.3166666666666,"d":"393.32"},{"v":395.4333333333332,"d":"395.43"},391.2,385.5,12.06504]
[11,"ADANIPOWER",68.7,{"v":69.7,"d":"69.70"},{"v":67.30000000000001,"d":"67.30"},{"v":65.9,"d":"65.90"},{"v":63.500000000000014,"d":"63.50"},{"v":71.10000000000001,"d":"71.10"},{"v":73.50000000000001,"d":"73.50"},{"v":74.9,"d":"74.90"},72.1,68.3,85.59882]
{"$rows_left_out":228}
{"sheet":"MidCap Intra","index":3,"n_rows":545,"n_cols":13,"rows_kept":545,"merged":[[0,0,0,1],[8,0,9,0],[8,1,9,1],[8,2,9,2],[8,3,9,3],[8,4,8,6],[8,7,8,9]]}
[]
[]
[]
[]
[{"$nulls":11},"Back To Main Page"]
["FOR INTRA DAY TRADING",{"$nulls":9},{"$f":"Main!B10","v":"2019-11-11"}]
[null,null," "]
[]
["Sr.no","Scrip","CLOSE RATE","Pivot Point","Supports",null,null,"Resistances"]
[null,null,"Point",null,"S1","S2","S3","R1","R2","R3","HIGH","LOW","Total Trade Quanity in Lakhs"]
[1,"3MINDIA",22392.9,{"v":22507.516666666666,"d":"22507.52"},{"v":22171.033333333333,"d":"22171.03"},{"v":21949.166666666668,"d":"21949.17"},{"v":21612.683333333334,"d":"21612.68"},{"v":22729.38333333333,"d":"22729.38"},{"v":23065.86666666666,"d":"23065.87"},{"v":23287.73333333333,"d":"23287.73"},22844,22285.65,0.01601]
[2,"ACC",1506.4,{"v":1516.4833333333333,"d":"1516.48"},{"v":1488.9666666666667,"d":"1488.97"},{"v":1471.5333333333333,"d":"1471.53"},{"v":1444.0166666666667,"d":"1444.02"},{"v":1533.9166666666667,"d":"1533.92"},{"v":1561.4333333333336,"d":"1561.43"},{"v":1578.8666666666668,"d":"1578.87"},1544,1499.05,6.35287]
[3,"AIAENG",1686,{"v":1686,"d":"1686.00"},{"v":1670,"d":"1670.00"},{"v":1654,"d":"1654.00"},{"v":1638,"d":"1638.00"},{"v":1702,"d":"1702.00"},{"v":1718,"d":"1718.00"},{"v":1734,"d":"1734.00"},1702,1670,0.33519]
[4,"APLAPOLLO",1438.55,{"v":1450.3333333333333,"d":"1450.33"},{"v":1414.6666666666665,"d":"1414.67"},{"v":1390.7833333333333,"d":"1390.78"},{"v":1355.1166666666666,"d":"1355.12"},{"v":1474.2166666666665,"d":"1474.22"},{"v":1509.883333333333,"d":"1509.88"},{"v":1533.7666666666664,"d":"1533.77"},1486,1426.45,0.10272]
[5,"AUBANK",689.5,{"v":687.5,"d":"687.50"},{"v":678,"d":"678.00"},{"v":666.5,"d":"666.50"},{"v":657,"d":"657.00"},{"v":699,"d":"699.00"},{"v":708.5,"d":"708.50"},{"v":720,"d":"720.00"},697,676,2.67306]
[6,"AAVAS",1564.2,{"v":1561.7333333333333,"d":"1561.73"},{"v":1522.4666666666667,"d":"1522.47"},{"v":1480.7333333333333,"d":"1480.73"},{"v":1441.4666666666667,"d":"1441.47"},{"v":1603.4666666666667,"d":"1603.47"},{"v":1642.7333333333336,"d":"1642.73"},{"v":1684.4666666666667,"d":"1684.47"},1601,1520,1.81039]
[7,"ABBOTINDIA",11502.95,{"v":11537.983333333332,"d":"11537.98"},{"v":11364.966666666664,"d":"11364.97"},{"v":11226.983333333332,"d":"11226.98"},{"v":11053.966666666664,"d":"11053.97"},{"v":11675.966666666664,"d":"11675.97"},{"v":11848.98333333333,"d":"11848.98"},{"v":11986.966666666664,"d":"11986.97"},11711,11400,0.05622]
[8,"ADANIGAS",146.8,{"v":147.36666666666667,"d":"147.37"},{"v":146.03333333333336,"d":"146.03"},{"v":145.26666666666668,"d":"145.27"},{"v":143.93333333333337,"d":"143.93"},{"v":148.13333333333335,"d":"148.13"},{"v":149.46666666666667,"d":"149.47"},{"v":150.23333333333335,"d":"150.23"},148.7,146.6,5.57647]
[9,"ADANIGREEN",86.7,{"v":86.63333333333333,"d":"86.63"},{"v":83.66666666666666,"d":"83.67"},{"v":80.63333333333333,"d":"80.63"},{"v":77.66666666666666,"d":"77.67"},{"v":89.66666666666666,"d":"89.67"},{"v":92.63333333333333,"d":"92.63"},{"v":95.66666666666666,"d":"95.67"},89.6,83.6,14.03419]
[10,"ADANIPORTS",386.15,{"v":387.6166666666666,"d":"387.62"},{"v":384.03333333333325,"d":"384.03"},{"v":381.91666666666663,"d":"381.92"},{"v":378.33333333333326,"d":"378.33"},{"v":389.73333333333323,"d":"389.73"},{"v":393.3166666666666,"d":"393.32"},{"v":395.4333333333332,"d":"395.43"},391.2,385.5,12.06504]
{"$rows_left_out":513}
{"sheet":"Bulk Deals","index":4,"n_rows":90,"n_cols":8,"rows_kept":90,"merged":[[4,0,4,1],[4,2,4,3],[6,1,6,2]]}
[" "]
[]
[]
[]
[]
[{"$nulls":4},"Back To Main Page"]
["Subject :","BULK DEAL",null,{"$f":"Main!B10","v":"2019-11-11"}]
[]
["Date","Scrip code","Scrip Name","Client Name","Buy / Sell","Quantity Traded","Trade Price / Wt.Avg.trade price","Exchange  "]
["2019-11-08",538812,"AANCHALISP","NANDKISORE KAKANI","BUY",{"v":200000,"d":"200,000"},17.44,"BSE"]
["2019-11-08",538812,"AANCHALISP","TWINKLE STOCK CONSULTANTS P LTD","BUY",{"v":200000,"d":"200,000"},16.14,"BSE"]
["2019-11-08",538812,"AANCHALISP","TWINKLE STOCK CONSULTANTS P LTD","SELL",{"v":200000,"d":"200,000"},17.44,"BSE"]
["2019-11-08",530187,"ATHARVENT","ABHISHEK MUKUND BAJAJ","BUY",{"v":87198,"d":"87,198"},1.16,"BSE"]
["2019-11-08",539251,"BALKRISHNA","PAWAN KUMAR PODDAR","BUY",{"v":164279,"d":"164,279"},19.05,"BSE"]
["2019-11-08",539251,"BALKRISHNA","AVNISH PODDAR","BUY",{"v":227566,"d":"227,566"},19.05,"BSE"]
["2019-11-08",539251,"BALKRISHNA","KHUSHBOO RAJIV PODDAR","SELL",{"v":421823,"d":"421,823"},19.05,"BSE"]
["2019-11-08",533144,"COX&KINGS","PRITESH PRAVIN VORA","BUY",{"v":1000000,"d":"1,000,000"},1.31,"BSE"]
["2019-11-08",533144,"COX&KINGS","PRITESH PRAVIN VORA","SELL",{"v":1000000,"d":"1,000,000"},1.31,"BSE"]
["2019-11-08",533144,"COX&KINGS","MULTIPLIER SHARE & STOCK ADVISORS PRIVATE LIMITED","BUY",{"v":1601666,"d":"1,601,666"},1.32,"BSE"]
["2019-11-08",533144,"COX&KINGS","MULTIPLIER SHARE & STOCK ADVISORS PRIVATE LIMITED","SELL",{"v":701666,"d":"701,666"},1.43,"BSE"]
{"$rows_left_out":71}
{"sheet":"Call Tracker (Equity & F&O)","index":5,"n_rows":297,"n_cols":18,"rows_kept":297,"merged":[[77,0,78,0],[77,1,78,1],[77,9,78,9],[77,11,78,11],[77,12,78,12],[77,13,78,13],[77,14,78,14],[79,0,80,0],[79,1,80,1],[79,9,80,9],[79,11,80,11],[79,12,80,12],[79,13,80,13],[79,14,80,14],[81,0,82,0],[81,1,82,1],[81,9,82,9],[81,11,82,11],[81,12,82,12],[81,13,82,13],[81,14,82,14],[83,0,84,0],[83,1,84,1],[83,9,84,9],[83,11,84,11],[83,12,84,12],[83,13,84,13],[83,14,84,14],[85,0,86,0],[85,1,86,1],[85,9,86,9],[85,11,86,11],[85,12,86,12],[85,13,86,13],[85,14,86,14],[87,0,88,0],[87,1,88,1],[87,9,88,9],[87,11,88,11],[87,12,88,12],[87,13,88,13],[87,14,88,14],[89,0,90,0],[89,1,90,1],[89,9,90,9],[89,11,90,11],[89,12,90,12],[89,13,90,13],[89,14,90,14],[91,0,92,0],[91,1,92,1],[91,9,92,9],[91,11,92,11],[91,12,92,12],[91,13,92,13],[91,14,92,14],[93,0,94,0],[93,1,94,1],[93,9,94,9],[93,11,94,11],[93,12,94,12],[93,13,94,13],[93,14,94,14],[95,0,96,0],[95,1,96,1],[95,9,96,9],[95,11,96,11],[95,12,96,12],[95,13,96,13],[95,14,96,14],[97,0,98,0],[97,1,98,1],[97,9,98,9],[97,11,98,11],[97,12,98,12],[97,13,98,13],[97,14,98,14],[99,0,100,0],[99,1,100,1],[99,9,100,9],[99,11,100,11],[99,12,100,12],[99,13,100,13],[99,14,100,14],[101,0,102,0],[101,1,102,1],[101,9,102,9],[101,11,102,11],[101,12,102,12],[101,13,102,13],[101,14,102,14],[103,0,104,0],[103,1,104,1],[103,9,104,9],[103,11,104,11],[103,12,104,12],[103,13,104,13],[103,14,104,14],[105,0,106,0],[105,1,106,1],[105,9,106,9],[105,11,106,11],[105,12,106,12],[105,13,106,13],[105,14,106,14],[112,0,113,0],[112,1,113,1],[112,9,113,9],[112,11,113,11],[112,12,113,12],[112,13,113,13],[112,14,113,14],[114,0,115,0],[114,1,115,1],[114,9,115,9],[114,11,115,11],[114,12,115,12],[114,13,115,13],[114,14,115,14],[117,0,118,0],[117,1,118,1],[117,9,118,9],[117,11,118,11],[117,12,118,12],[117,13,118,13],[117,14,118,14],[119,0,120,0],[119,1,120,1],[119,9,120,9],[119,11,120,11],[119,12,120,12],[119,13,120,13],[119,14,120,14]]}
[]
[]
[]
[]
[{"$nulls":12},"Back To Main Page"]
["Retail Research Technical Calls & Fundamental Performance Report for the month of November-2019 "]
[{"$nulls":12},{"$f":"Main!B10","v":"2019-11-11"}]
[null,"Positional  Call"]
["Sr.no","Date",null,"Company","Rec","Rec Price","Stop Loss***","Call Closed At","Target","Remark","Profit / Loss per Share","Gain / Loss  %","Status","Closed Date","NSE Closed Price"]
[1,"2019-09-26",null,"HDFC","Buy",2070,1940,2165,"2250-2300","Profit of Rs.95/-",{"$f":"H10-F10","v":95},{"$f":"K10/F10","v":{"v":0.04589371980676329,"d":"4.59%"}},"Successful","2019-11-01",{"$nulls":3},"H"]
[2,"2019-10-01",null,"UPL","Buy{}",595,564,599.5,"650-660","Profit of Rs.4.50/-",4.5,{"v":0.007563025210084034,"d":"0.76%"},"Neutral","2019-11-07",{"$nulls":3},"R"]
[3,"2019-10-07",null,"PIDILITIND","Buy{}",1367.5,1297,1413.5,"1500-1520","Part Profit of Rs.46/-",{"$f":"H12-F12","v":46},{"$f":"K12/F12","v":{"v":0.03363802559414991,"d":"3.36%"}},"Successful","2019-10-31",{"$f":"VLOOKUP(D12,Sheet2!A51:M1690,6,0)","v":1354.15},null,null,"R"]
[4,"2019-10-22",null,"HEIDELBERG","Buy",188.5,178,199,"205-210","Profit of Rs.10.50/-",10.5,{"v":0.05570291777188329,"d":"5.57%"},"Successful","2019-11-05",{"$nulls":3},"H"]
[5,"2019-10-27",null,"AMBUJACEM","Buy{}",197,185.4,203.5,"216-220","Part Profit of Rs.6.5/-",{"$f":"H14-F14","v":6.5},{"$f":"K14/F14","v":{"v":0.03299492385786802,"d":"3.30%"}},"Successful","2019-10-30",{"$f":"VLOOKUP(D14,Sheet2!A60:M1699,6,0)","v":202.25},null,null,"R"]
[6,"2019-11-04",null,"UBL","Buy{}",1240,1178,1292.5,"1340-1360","Profit of Rs.52.5/-",{"$f":"H15-F15","v":52.5},{"$f":"K15/F15","v":{"v":0.04233870967741935,"d":"4.23%"}},"Successful","2019-11-08",{"$nulls":3},"H"]
[7,"2019-11-05",null,"TATAMOTORS","Sell","172-174",183.3,null,"158-155","Open",{"$nulls":4},{"$f":"VLOOKUP(D16,Sheet2!A62:M1701,6,0)","v":169.05},null,null,"R"]
[8,"2019-11-06",null,"BANDHANBNK","Buy","570-575",538,null,"630-650","Open",{"$nulls":4},{"$f":"VLOOKUP(D17,Sheet2!A63:M1702,6,0)","v":550.8},null,null,"H"]
[9,"2019-11-07",null,"PRESTIGE","Buy","310-314",288,null,"340-360","Open",{"$nulls":4},{"$f":"VLOOKUP(D18,Sheet2!A64:M1703,6,0)","v":310.3},null,null,"H"]
[10,"2019-11-07",null,"JINDALSTEL","Sell",138,148.3,143,"120-117","Loss of Rs.5/-",{"$f":"F19-H19","v":-5},{"$f":"K19/F19","v":{"v":-0.036231884057971016,"d":"-3.62%"}},"Unsuccessful","2019-11-07",{"$nulls":3},"R"]
[11,"2019-11-08",null,"CIPLA","Sell","464-466",491.3,null,"425-418","Open",{"$nulls":4},{"$f":"VLOOKUP(D20,Sheet2!A66:M1705,6,0)","v":462.5},null,null,"R"]
{"$rows_left_out":251}
{"sheet":"Sheet2","index":6,"n_rows":1899,"n_cols":14,"rows_kept":1899,"hidden":true}
["SYMBOL","SERIES","OPEN","HIGH","LOW","CLOSE","LAST","PREVCLOSE","TOTTRDQTY","TOTTRDVAL","TIMESTAMP","TOTALTRADES","ISIN","ISIN"]
["20MICRONS","EQ",38.45,38.45,36.65,37.1,37.4,39.05,101367,3809072.4,"2019-11-08",886,"INE144J01027"]
["21STCENMGM","EQ",14,14,14,14,14,14,6,84,"2019-11-08",2,"INE253B01015"]
["3IINFOTECH","EQ",1.95,2,1.95,1.95,2,2,859134,1699724.7,"2019-11-08",455,"INE748C01020"]
["3MINDIA","EQ",22285.65,22844,22285.65,22392.9,22350,22463.45,1601,36182186.45,"2019-11-08",787,"INE470A01017"]
["3PLAND","EQ",6.3,6.3,6.3,6.3,6.3,6.3,3,18.9,"2019-11-08",1,"INE105C01023"]
["5PAISA","EQ",169.45,169.5,165.1,165.85,168,167.35,4080,682729.7,"2019-11-08",177,"INE618L01018"]
["63MOONS","EQ",117.9,119.65,115,115.85,115.9,118.2,85270,9998494.55,"2019-11-08",1122,"INE111B01023"]
["A2ZINFRA","EQ",9.85,10.3,9.6,10.05,10.05,9.7,354119,3568827.6,"2019-11-08",661,"INE619I01012"]
["AARTIDRUGS","EQ",528,537.85,515.95,518.85,520,523.1,18692,9837991.05,"2019-11-08",1542,"INE767A01016"]
["AARTIIND","EQ",819.9,822.4,808.1,812.2,811.1,819.55,51620,42085725.25,"2019-11-08",3141,"INE769A01020"]
["AARVEEDEN","EQ",13.75,14.2,13.7,14.05,14.05,13.75,3816,53210.45,"2019-11-08",34,"INE273D01019"]
["AAVAS","EQ",1556,1601,1520,1564.2,1570,1545.2,181039,288846891.55,"2019-11-08",4058,"INE216P01012"]
["ABAN","BE",31,32.85,30.6,31,31,32.2,60639,1866606.9,"2019-11-08",370,"INE421A01028"]
["ABB","EQ",1474.5,1479.9,1441.65,1462.7,1470,1482.75,73375,107088200.95,"2019-11-08",4817,"INE117A01022"]
["ABBOTINDIA","EQ",11700,11711,11400,11502.95,11410,11695.25,5622,65154854.55,"2019-11-08",1821,"INE358A01014"]
["ABCAPITAL","EQ",85.6,88.6,85.6,86.85,86.85,84.7,6258041,545890906.4,"2019-11-08",35698,"INE674K01013"]
["ABFRL","EQ",200.5,227.7,200.5,204.6,205.5,202.5,468140,97467117.1,"2019-11-08",9092,"INE647O01011"]
["ABSLBANETF","EQ",308,308,308,308,308,308,49,15092,"2019-11-08",2,"INF209KB1O58"]
["ABSLNN50ET","EQ",288.74,288.74,288.74,288.74,288.74,287.57,88,25409.12,"2019-11-08",1,"INF209KB1B87"]
{"$rows_left_out":1701}
{"sheet":"Sheet1","index":7,"n_rows":0,"n_cols":0,"rows_kept":0,"hidden":true}

{"sheet":"Sheet3","index":8,"n_rows":0,"n_cols":0,"rows_kept":0,"hidden":true}

{"sheet":"Sheet4","index":9,"n_rows":0,"n_cols":0,"rows_kept":0,"hidden":true}

{"sheet":"Sheet5","index":10,"n_rows":0,"n_cols":0,"rows_kept":0,"hidden":true}