{"text_format":"3","workbook":"xlsx","n_sheets":6,"sheets":["Main","Future Intra","Cash Intra","MidCap Intra","Bulk Deals","Call Tracker (Equity & F&O)"],"not_rendered":{"images":2,"defined_names":1},"read":"whole","date_system":"1900"}

{"sheet":"Main","index":0,"n_rows":27,"n_cols":11,"rows_kept":27}
[null,"                                                                                                 "]
[]
[]
[]
[]
[{"$nulls":6}," "]
[]
[]
[]
[null,"2023-09-11"]
[]
[null,"Sheet No.","Template Name","Summary"]
[null,1,"Future Intra","For Intraday trading in F&O segment"]
[null,2,"Cash Intra","For Intraday trading in cash market segment"]
[null,3,"Mid-cap Intra","For Intraday trading in Mid-cap stocks"]
[null,4,"Bulk Deals","Reveals Bulk Deals carried on NSE & BSE"]
[null,5,"Call Tracker"]
{"$rows_empty":9}
[{"$nulls":10},"`"]

{"sheet":"Future Intra","index":1,"n_rows":236,"n_cols":16,"rows_kept":236,"merged":[[8,0,9,0],[8,1,9,1],[8,2,9,2],[8,3,9,3],[8,6,8,8],[8,9,8,11]]}
[]
[]
[]
[]
[{"$nulls":12},"Back to Main Page"]
["FOR INTRA DAY TRADING",{"$nulls":10},{"$f":"Main!B10","v":"2023-09-11"}]
[]
[]
["Sr.no","Sector","Scrip","Expiry Date","CLOSE RATE","Pivot Point","Supports",null,null,"Resistances"]
[{"$nulls":4},"Point","Point","S1","S2","S3","R1","R2","R3","HIGH","LOW","OI","% Change in OI"]
[1,"Index","NIFTY","2023-09-28",19872.45,{"v":19853.583333333332,"d":"19853.58"},{"v":19791.166666666664,"d":"19791.17"},{"v":19709.88333333333,"d":"19709.88"},{"v":19647.466666666664,"d":"19647.47"},{"v":19934.866666666665,"d":"19934.87"},{"v":19997.28333333333,"d":"19997.28"},{"v":20078.566666666666,"d":"20078.57"},19916,19772.3,11082650,{"v":1.7943016234587988E-3,"d":"0%"}]
[2,"Index","BANKNIFTY","2023-09-28",45319.65,{"v":45286.416666666664,"d":"45286.42"},{"v":45009.68333333333,"d":"45009.68"},{"v":44699.71666666666,"d":"44699.72"},{"v":44422.98333333332,"d":"44422.98"},{"v":45596.38333333333,"d":"45596.38"},{"v":45873.11666666667,"d":"45873.12"},{"v":46183.083333333336,"d":"46183.08"},45563.15,44976.45,2271420,{"v":-0.005503526722971642,"d":"-1%"}]
[3,"Index","FINNIFTY","2023-09-26",{"v":20189.9,"d":"20189.90"},20178.25,{"v":20057.5,"d":"20057.50"},{"v":19925.1,"d":"19925.10"},19804.35,20310.65,{"v":20431.4,"d":"20431.40"},{"v":20563.800000000003,"d":"20563.80"},20299,20045.85,79240,{"v":0.14310444316214657,"d":"14%"}]
[4,"Index","MIDCPNIFTY","2023-09-25",9137.95,{"v":9121.033333333333,"d":"9121.03"},{"v":9086.816666666666,"d":"9086.82"},{"v":9035.683333333332,"d":"9035.68"},{"v":9001.466666666665,"d":"9001.47"},{"v":9172.166666666666,"d":"9172.17"},{"v":9206.383333333333,"d":"9206.38"},{"v":9257.516666666666,"d":"9257.52"},9155.25,9069.9,188025,{"v":-0.01493123772102161,"d":"-1%"}]
[5,"Chemical","AARTIIND","2023-09-28",{"v":518.7,"d":"518.70"},{"v":520.7333333333335,"d":"520.73"},{"v":515.1166666666669,"d":"515.12"},{"v":511.5333333333334,"d":"511.53"},{"v":505.91666666666686,"d":"505.92"},{"v":524.316666666667,"d":"524.32"},{"v":529.9333333333335,"d":"529.93"},{"v":533.516666666667,"d":"533.52"},526.35,517.15,12699000,{"v":-0.014282387642629821,"d":"-1%"}]
[6,"Capital_Goods","ABB","2023-09-28",4481.85,{"v":4488.383333333334,"d":"4488.38"},{"v":4449.466666666668,"d":"4449.47"},{"v":4417.083333333334,"d":"4417.08"},{"v":4378.166666666668,"d":"4378.17"},{"v":4520.766666666668,"d":"4520.77"},{"v":4559.683333333334,"d":"4559.68"},{"v":4592.066666666668,"d":"4592.07"},4527.3,4456,1216000,{"v":8.2304526748971192E-4,"d":"0%"}]
[7,"Pharma","ABBOTINDIA","2023-09-28",{"v":23046.5,"d":"23046.50"},{"v":23069.600000000002,"d":"23069.60"},{"v":22894.300000000003,"d":"22894.30"},{"v":22742.100000000002,"d":"22742.10"},{"v":22566.800000000003,"d":"22566.80"},{"v":23221.800000000003,"d":"23221.80"},{"v":23397.1,"d":"23397.10"},{"v":23549.300000000003,"d":"23549.30"},23244.9,22917.4,74160,{"v":0.003789929615592853,"d":"0%"}]
[8,"Others","ABCAPITAL","2023-09-28",187.65,{"v":188.26666666666665,"d":"188.27"},{"v":186.58333333333331,"d":"186.58"},{"v":185.51666666666665,"d":"185.52"},{"v":183.83333333333331,"d":"183.83"},{"v":189.33333333333331,"d":"189.33"},{"v":191.01666666666665,"d":"191.02"},{"v":192.08333333333331,"d":"192.08"},189.95,187.2,38377800,{"v":-0.010855949895615866,"d":"-1%"}]
[9,"Textile","ABFRL","2023-09-28",{"v":229.8,"d":"229.80"},230.75,228.55,{"v":227.3,"d":"227.30"},{"v":225.10000000000002,"d":"225.10"},{"v":232,"d":"232.00"},{"v":234.2,"d":"234.20"},235.45,232.95,229.5,30154800,{"v":-0.009395285275025624,"d":"-1%"}]
[10,"Cement","ACC","2023-09-28",{"v":2033.1,"d":"2033.10"},{"v":2042.4000000000003,"d":"2042.40"},{"v":2017.0500000000006,"d":"2017.05"},{"v":2001.0000000000002,"d":"2001.00"},{"v":1975.6500000000005,"d":"1975.65"},{"v":2058.4500000000007,"d":"2058.45"},{"v":2083.8000000000006,"d":"2083.80"},{"v":2099.850000000001,"d":"2099.85"},2067.75,2026.35,6214200,{"v":-0.007379720145677593,"d":"-1%"}]
{"$rows_left_out":202}
{"sheet":"Cash Intra","index":2,"n_rows":245,"n_cols":13,"rows_kept":245,"merged":[[7,0,8,0],[7,1,8,1],[7,2,8,2],[7,3,8,3],[7,4,7,6],[7,7,7,9]]}
[]
[]
[]
[]
[{"$nulls":12},"Back to Main Page"]
["FOR INTRA DAY TRADING",{"$nulls":9},{"$f":"Main!B10","v":"2023-09-11"}]
[]
["Sr.no",null,"CLOSE RATE","Pivot Point","Supports",null,null,"Resistances"]
[{"$nulls":4},"S1","S2","S3","R1","R2","R3","HIGH","LOW","Total Trade Quanity in Lakhs"]
[1,"Nifty 50",19819.95,{"v":19804.71666666667,"d":"19804.72"},{"v":19742.28333333334,"d":"19742.28"},{"v":19664.61666666667,"d":"19664.62"},{"v":19602.183333333338,"d":"19602.18"},{"v":19882.383333333342,"d":"19882.38"},{"v":19944.81666666667,"d":"19944.82"},{"v":20022.483333333344,"d":"20022.48"},19867.15,19727.05]
[2,"Nifty Bank",{"v":45156.4,"d":"45156.40"},{"v":45117.299999999996,"d":"45117.30"},{"v":44851.24999999999,"d":"44851.25"},{"v":44546.1,"d":"44546.10"},{"v":44280.049999999996,"d":"44280.05"},{"v":45422.44999999999,"d":"45422.45"},{"v":45688.49999999999,"d":"45688.50"},{"v":45993.64999999999,"d":"45993.65"},45383.35,44812.15]
[3,"Nifty CPSE",{"v":3828.3,"d":"3828.30"},{"v":3812.7833333333333,"d":"3812.78"},{"v":3776.0666666666666,"d":"3776.07"},{"v":3723.8333333333335,"d":"3723.83"},{"v":3687.116666666667,"d":"3687.12"},{"v":3865.0166666666664,"d":"3865.02"},{"v":3901.7333333333327,"d":"3901.73"},{"v":3953.9666666666662,"d":"3953.97"},{"v":3849.5,"d":"3849.50"},3760.55]
[4,"Nifty Infra",6229.15,6210.05,6177.35,6125.55,6092.85,6261.85,{"v":6294.549999999999,"d":"6294.55"},6346.35,6242.75,6158.25]
[5,"Nifty IT",32415.65,{"v":32443.433333333334,"d":"32443.43"},{"v":32325.61666666667,"d":"32325.62"},{"v":32235.583333333336,"d":"32235.58"},{"v":32117.76666666667,"d":"32117.77"},{"v":32533.466666666667,"d":"32533.47"},{"v":32651.283333333333,"d":"32651.28"},{"v":32741.316666666666,"d":"32741.32"},32561.25,{"v":32353.4,"d":"32353.40"}]
[6,"Nifty PSE",{"v":5965.9,"d":"5965.90"},{"v":5924.133333333332,"d":"5924.13"},{"v":5854.566666666665,"d":"5854.57"},{"v":5743.233333333333,"d":"5743.23"},{"v":5673.666666666665,"d":"5673.67"},{"v":6035.466666666664,"d":"6035.47"},{"v":6105.033333333332,"d":"6105.03"},{"v":6216.366666666664,"d":"6216.37"},{"v":5993.7,"d":"5993.70"},{"v":5812.8,"d":"5812.80"}]
[7,"Nifty Midcap 50",11647.15,{"v":11608.266666666668,"d":"11608.27"},{"v":11559.683333333336,"d":"11559.68"},{"v":11472.216666666667,"d":"11472.22"},{"v":11423.633333333335,"d":"11423.63"},{"v":11695.733333333337,"d":"11695.73"},{"v":11744.31666666667,"d":"11744.32"},{"v":11831.783333333338,"d":"11831.78"},11656.85,{"v":11520.8,"d":"11520.80"}]
[8,"ABB",4458.55,{"v":4469.516666666666,"d":"4469.52"},{"v":4424.033333333333,"d":"4424.03"},{"v":4389.516666666666,"d":"4389.52"},{"v":4344.033333333333,"d":"4344.03"},{"v":4504.033333333333,"d":"4504.03"},{"v":4549.516666666666,"d":"4549.52"},{"v":4584.033333333333,"d":"4584.03"},4515,4435,2.31272]
[9,"ABBOTINDIA",23002.3,22985.45,{"v":22816.9,"d":"22816.90"},{"v":22631.5,"d":"22631.50"},22462.95,{"v":23170.850000000002,"d":"23170.85"},{"v":23339.399999999998,"d":"23339.40"},{"v":23524.800000000003,"d":"23524.80"},23154,22800.05,0.08725]
[10,"ABCAPITAL",186.9,{"v":187.41666666666666,"d":"187.42"},{"v":185.98333333333332,"d":"185.98"},{"v":185.06666666666666,"d":"185.07"},{"v":183.63333333333333,"d":"183.63"},{"v":188.33333333333331,"d":"188.33"},{"v":189.76666666666665,"d":"189.77"},{"v":190.6833333333333,"d":"190.68"},188.85,186.5,26.13359]
[11,"ABFRL",229.35,{"v":230.33333333333334,"d":"230.33"},{"v":228.01666666666668,"d":"228.02"},{"v":226.68333333333334,"d":"226.68"},{"v":224.36666666666667,"d":"224.37"},{"v":231.66666666666669,"d":"231.67"},{"v":233.98333333333335,"d":"233.98"},{"v":235.3166666666667,"d":"235.32"},232.65,229,22.53393]
{"$rows_left_out":226}
{"sheet":"MidCap Intra","index":3,"n_rows":530,"n_cols":13,"rows_kept":530,"merged":[[0,0,0,1],[8,0,9,0],[8,1,9,1],[8,2,9,2],[8,3,9,3],[8,4,8,6],[8,7,8,9]]}
[]
[]
[]
[]
[{"$nulls":11},"Back To Main Page"]
["FOR INTRA DAY TRADING",{"$nulls":9},{"$f":"Main!B10","v":"2023-09-11"}]
[null,null," "]
[]
["Sr.no","Scrip","CLOSE RATE","Pivot Point","Supports",null,null,"Resistances"]
[{"$nulls":4},"S1","S2","S3","R1","R2","R3","HIGH","LOW","Total Trade Quanity in Lakhs"]
[1,"360ONE",520.35,{"v":520.4666666666667,"d":"520.47"},{"v":513.3833333333334,"d":"513.38"},{"v":506.41666666666674,"d":"506.42"},{"v":499.3333333333335,"d":"499.33"},{"v":527.4333333333334,"d":"527.43"},{"v":534.5166666666667,"d":"534.52"},{"v":541.4833333333333,"d":"541.48"},527.55,513.5,14.18883]
[2,"3MINDIA",32914.85,{"v":32707.7,"d":"32707.70"},{"v":32222.300000000003,"d":"32222.30"},{"v":31529.750000000004,"d":"31529.75"},{"v":31044.350000000006,"d":"31044.35"},33400.25,33885.65,{"v":34578.2,"d":"34578.20"},33193.1,32015.15,0.03707]
[3,"AARTIDRUGS",619.55,618.85,{"v":613.4000000000001,"d":"613.40"},{"v":607.2500000000001,"d":"607.25"},{"v":601.8000000000002,"d":"601.80"},{"v":625,"d":"625.00"},630.45,{"v":636.5999999999999,"d":"636.60"},624.3,612.7,5.14248]
[4,"AARTIIND",517.3,{"v":519.2666666666665,"d":"519.27"},{"v":513.6333333333331,"d":"513.63"},{"v":509.9666666666666,"d":"509.97"},{"v":504.33333333333314,"d":"504.33"},{"v":522.933333333333,"d":"522.93"},{"v":528.5666666666665,"d":"528.57"},{"v":532.233333333333,"d":"532.23"},524.9,515.6,15.58053]
[5,"AAVAS",1665.05,{"v":1671.2833333333335,"d":"1671.28"},{"v":1643.766666666667,"d":"1643.77"},{"v":1622.4833333333336,"d":"1622.48"},{"v":1594.9666666666672,"d":"1594.97"},{"v":1692.566666666667,"d":"1692.57"},{"v":1720.0833333333335,"d":"1720.08"},{"v":1741.366666666667,"d":"1741.37"},1698.8,1650,3.75061]
[6,"ABB",4458.55,{"v":4469.516666666666,"d":"4469.52"},{"v":4424.033333333333,"d":"4424.03"},{"v":4389.516666666666,"d":"4389.52"},{"v":4344.033333333333,"d":"4344.03"},{"v":4504.033333333333,"d":"4504.03"},{"v":4549.516666666666,"d":"4549.52"},{"v":4584.033333333333,"d":"4584.03"},4515,4435,2.31272]
[7,"ABBOTINDIA",23002.3,22985.45,{"v":22816.9,"d":"22816.90"},{"v":22631.5,"d":"22631.50"},22462.95,{"v":23170.850000000002,"d":"23170.85"},{"v":23339.399999999998,"d":"23339.40"},{"v":23524.800000000003,"d":"23524.80"},23154,22800.05,0.08725]
[8,"ACC",2024.25,{"v":2032.4166666666667,"d":"2032.42"},{"v":2007.8333333333335,"d":"2007.83"},{"v":1991.4166666666667,"d":"1991.42"},{"v":1966.8333333333335,"d":"1966.83"},{"v":2048.8333333333335,"d":"2048.83"},{"v":2073.416666666667,"d":"2073.42"},{"v":2089.8333333333335,"d":"2089.83"},2057,2016,6.55333]
[9,"ADANIENT",2519.3,{"v":2521.3333333333335,"d":"2521.33"},{"v":2504.066666666667,"d":"2504.07"},{"v":2488.8333333333335,"d":"2488.83"},{"v":2471.566666666667,"d":"2471.57"},{"v":2536.566666666667,"d":"2536.57"},{"v":2553.8333333333335,"d":"2553.83"},{"v":2569.066666666667,"d":"2569.07"},2538.6,2506.1,56.40973]
[10,"ADANIGREEN",1001.2,1003.85,995.35,{"v":989.5,"d":"989.50"},{"v":981,"d":"981.00"},{"v":1009.7,"d":"1009.70"},{"v":1018.2,"d":"1018.20"},{"v":1024.0500000000002,"d":"1024.05"},1012.35,998,52.54899]
{"$rows_left_out":511}
{"sheet":"Bulk Deals","index":4,"n_rows":167,"n_cols":8,"rows_kept":167,"merged":[[4,0,4,1],[4,2,4,3],[6,1,6,2]]}
[" "]
[]
[]
[]
[]
[{"$nulls":4},"Back To Main Page"]
["Subject :","BULK DEAL",null,{"$f":"Main!B10","v":"2023-09-11"}]
[]
["Date","Scrip code","Scrip Name","Client Name","Buy / Sell","Quantity Traded","Trade Price / Wt.Avg.trade price","Exchange  "]
["2023-09-08",540615,"7NR","AGRAWAL NIKUNJ","SELL",{"v":7650000,"d":"7,650,000"},0.56,"BSE"]
["2023-09-08",543938,"ACCELERATE","SHETH BROTHER","SELL",{"v":11200,"d":"11,200"},296.56,"BSE"]
["2023-09-08",543938,"ACCELERATE","SHETH BROTHER","BUY",{"v":9600,"d":"9,600"},293.04,"BSE"]
["2023-09-08",543938,"ACCELERATE","SUMICKSHA","SELL",{"v":24000,"d":"24,000"},304.56,"BSE"]
["2023-09-08",543938,"ACCELERATE","SUMICKSHA","BUY",{"v":22400,"d":"22,400"},300.56,"BSE"]
["2023-09-08",543938,"ACCELERATE","LATIN MANHARLAL SECURITIES PVT LTD","BUY",{"v":20800,"d":"20,800"},299.75,"BSE"]
["2023-09-08",543938,"ACCELERATE","LATIN MANHARLAL SECURITIES PVT LTD","SELL",{"v":9600,"d":"9,600"},294.43,"BSE"]
["2023-09-08",543938,"ACCELERATE","YUGA STOCKS AND COMMODITIES PRIVATE LIMITED .","SELL",{"v":22400,"d":"22,400"},308.28,"BSE"]
["2023-09-08",543938,"ACCELERATE","YUGA STOCKS AND COMMODITIES PRIVATE LIMITED .","BUY",{"v":16000,"d":"16,000"},308.7,"BSE"]
["2023-09-08",543941,"AHASOLAR","SUNFLOWER BROKING PRIVATE LIMITED","BUY",{"v":4000,"d":"4,000"},340.47,"BSE"]
["2023-09-08",543941,"AHASOLAR","SUNFLOWER BROKING PRIVATE LIMITED","SELL",{"v":32000,"d":"32,000"},340.26,"BSE"]
{"$rows_left_out":148}
{"sheet":"Call Tracker (Equity & F&O)","index":5,"n_rows":282,"n_cols":18,"rows_kept":282}
[]
[]
[]
[]
[{"$nulls":12},"Back To Main Page"]
["Retail Research Technical Calls & Fundamental Performance Report for the month of September-2023"]
[{"$nulls":12},{"$f":"Main!B10","v":"2023-09-11"}]
[null,"Positional  Call"]
["Sr.no","Date",null,"Company","Rec","Rec Price","Stop Loss***","Call Closed At","Target","Remark","Profit / Loss per Share","All charges","Net Gain / Loss  %","Status","Closed Date","Market Closing Price"]
[1,"2023-07-12",null,"HDFCBANK","Accu","1595-1655",1540,null,"1800-1900","Open",{"$nulls":5},{"$f":"VLOOKUP(D10,'MidCap Intra'!$B$11:$C$568,2,0)","v":{"v":1623.4,"d":"1623.40"}},null,"H"]
[2,"2023-07-26",null,"BANKBARODA","Accu","191-197",185,null,"215-225","Open",{"$nulls":5},{"$f":"VLOOKUP(D11,'MidCap Intra'!$B$11:$C$568,2,0)","v":{"v":197.8,"d":"197.80"}},null,"H"]
[3,"2023-07-26",null,"RVNL","Accu",127.5,118,134.75,"145-150","Profit of Rs.7.25/-",{"$f":"H12-F12","v":7.25},{"$f":"(F12*-0.3)/100","v":{"v":-0.3825,"d":"-0.38"}},{"$f":"(K12+L12)/F12","v":{"v":0.05386274509803921,"d":"5.39%"}},"Successful","2023-09-01"," ",null,"H"]
[4,"2023-08-04",null,"VINATIORGA","Accu <>",1823,1738,1925,"1993-2043","Profit of Rs.102/-",{"$f":"H13-F13","v":102},{"$f":"(F13*-0.3)/100","v":{"v":-5.468999999999999,"d":"-5.47"}},{"$f":"(K13+L13)/F13","v":{"v":0.05295172792100933,"d":"5.30%"}},"Successful","2023-09-05"," ",null,"H"]
[5,"2023-08-07",null,"TATAMTRDVR","Accu","381-399",365,null,"440-460","Open",{"$nulls":5},{"$f":"VLOOKUP(D14,'MidCap Intra'!$B$11:$C$568,2,0)","v":{"v":424.6,"d":"424.60"}},null,"H"]
[6,"2023-08-29",null,"FLUOROCHEM","Accu",2935,2700,3125,"3180-3380","Profit of Rs.190/-",{"$f":"H15-F15","v":190},{"$f":"(F15*-0.3)/100","v":{"v":-8.805,"d":"-8.81"}},{"$f":"(K15+L15)/F15","v":{"v":0.06173594548551959,"d":"6.17%"}},"Successful","2023-09-04"," ",null,"H"]
[7,"2023-08-29",null,"JAMNAAUTO","Accu",114.5,105,122.25,"124-130","Profit of Rs.7.75/-",{"$f":"H16-F16","v":7.75},{"$f":"(F16*-0.3)/100","v":{"v":-0.3435,"d":"-0.34"}},{"$f":"(K16+L16)/F16","v":{"v":0.06468558951965066,"d":"6.47%"}},"Successful","2023-09-01"," ",null,"H"]
[8,"2023-08-30",null,"AMARAJABAT","Accu",627,577,671,"670-700","Profit of Rs.44/-",{"$f":"H17-F17","v":44},{"$f":"(F17*-0.3)/100","v":{"v":-1.881,"d":"-1.88"}},{"$f":"(K17+L17)/F17","v":{"v":0.06717543859649122,"d":"6.72%"}},"Successful","2023-09-08"," ",null,"H"]
[9,"2023-08-31",null,"GMMPFAUDLR","Accu",1530,1415,1612.5,"1640-1700","Profit of Rs.82.5/-",{"$f":"H18-F18","v":82.5},{"$f":"(F18*-0.3)/100","v":-4.59},{"$f":"(K18+L18)/F18","v":{"v":0.05092156862745098,"d":"5.09%"}},"Successful","2023-09-01"," ",null,"H"]
[10,"2023-09-01",null,"TATASTEEL","Accu","123.5-126.5",119,null,"134-140","Open",{"$nulls":5},{"$f":"VLOOKUP(D19,'MidCap Intra'!$B$11:$C$568,2,0)","v":{"v":129.5,"d":"129.50"}}]
[11,"2023-09-01",null,"FEDERALBNK","Accu","136.5-141.5",133,null,"149-155","Open",{"$nulls":5},{"$f":"VLOOKUP(D20,'MidCap Intra'!$B$11:$C$568,2,0)","v":{"v":147.5,"d":"147.50"}}]
{"$rows_left_out":249}