{"text_format":"3","workbook":"xlsx","n_sheets":6,"sheets":["Main","Future Intra","Cash Intra","MidCap Intra","Bulk Deals","Call Tracker (Equity & F&O)"],"not_rendered":{"images":4,"defined_names":1},"read":"whole","date_system":"1900"}

{"sheet":"Main","index":0,"n_rows":27,"n_cols":11,"rows_kept":27}
[null,"                                                                                                 "]
[]
[]
[]
[]
[{"$nulls":6}," "]
[]
[]
[]
[null,"2024-08-09"]
[]
[null,"Sheet No.","Template Name","Summary"]
[null,1,"Future Intra","For Intraday trading in F&O segment"]
[null,2,"Cash Intra","For Intraday trading in cash market segment"]
[null,3,"Mid-cap Intra","For Intraday trading in Mid-cap stocks"]
[null,4,"Bulk Deals","Reveals Bulk Deals carried on NSE & BSE"]
[null,5,"Call Tracker"]
{"$rows_empty":9}
[{"$nulls":10},"`"]

{"sheet":"Future Intra","index":1,"n_rows":225,"n_cols":16,"rows_kept":225,"merged":[[8,0,9,0],[8,1,9,1],[8,2,9,2],[8,3,9,3],[8,6,8,8],[8,9,8,11]]}
[]
[]
[]
[]
[{"$nulls":12},"Back to Main Page"]
["FOR INTRA DAY TRADING",{"$nulls":10},{"$f":"Main!B10","v":"2024-08-09"}]
[]
[]
["Sr.no","Sector","Scrip","Expiry Date","CLOSE RATE","Pivot Point","Supports",null,null,"Resistances"]
[{"$nulls":4},"Point","Point","S1","S2","S3","R1","R2","R3","HIGH","LOW","OI","% Change in OI"]
[1,"Index","NIFTY","2024-08-29",24136.55,{"v":24201.766666666666,"d":"24201.77"},{"v":24045.783333333333,"d":"24045.78"},{"v":23955.016666666666,"d":"23955.02"},{"v":23799.033333333333,"d":"23799.03"},{"v":24292.533333333333,"d":"24292.53"},{"v":24448.516666666663,"d":"24448.52"},{"v":24539.283333333333,"d":"24539.28"},24357.75,24111,14089975,{"v":-0.01273324130972484,"d":"-1.27%"}]
[2,"Index","BANKNIFTY","2024-08-28",{"v":50205.9,"d":"50205.90"},{"v":50239.26666666666,"d":"50239.27"},{"v":49946.633333333324,"d":"49946.63"},{"v":49687.36666666666,"d":"49687.37"},{"v":49394.73333333332,"d":"49394.73"},{"v":50498.533333333326,"d":"50498.53"},{"v":50791.16666666666,"d":"50791.17"},{"v":51050.43333333333,"d":"51050.43"},50531.9,49980,3347850,{"v":5.9177433671959761E-4,"d":"0.06%"}]
[3,"Index","FINNIFTY","2024-08-27",{"v":22852.1,"d":"22852.10"},{"v":22873.033333333336,"d":"22873.03"},{"v":22729.066666666673,"d":"22729.07"},{"v":22606.033333333336,"d":"22606.03"},{"v":22462.066666666673,"d":"22462.07"},{"v":22996.066666666673,"d":"22996.07"},{"v":23140.03333333334,"d":"23140.03"},{"v":23263.066666666673,"d":"23263.07"},23017,22750,76250,{"v":-0.08215467950647005,"d":"-8.22%"}]
[4,"Index","MIDCPNIFTY","2024-08-26",{"v":12529.7,"d":"12529.70"},{"v":12556.166666666666,"d":"12556.17"},{"v":12483.533333333333,"d":"12483.53"},{"v":12437.366666666667,"d":"12437.37"},{"v":12364.733333333334,"d":"12364.73"},{"v":12602.333333333332,"d":"12602.33"},{"v":12674.966666666667,"d":"12674.97"},{"v":12721.133333333331,"d":"12721.13"},12628.8,12510,2367800,{"v":5.136477480154519E-3,"d":"0.51%"}]
[5,"Index","NIFTYNXT50","2024-08-30",72007.95,{"v":72059.31666666667,"d":"72059.32"},{"v":71448.63333333333,"d":"71448.63"},{"v":70889.31666666667,"d":"70889.32"},{"v":70278.63333333333,"d":"70278.63"},{"v":72618.63333333333,"d":"72618.63"},{"v":73229.31666666665,"d":"73229.32"},{"v":73788.63333333333,"d":"73788.63"},72670,71500,12100,{"v":0.024555461473327687,"d":"2.46%"}]
[6,"Chemicals","AARTIIND","2024-08-29",750.95,{"v":755.9,"d":"755.90"},{"v":743.3,"d":"743.30"},735.65,723.05,763.55,{"v":776.1500000000001,"d":"776.15"},{"v":783.8,"d":"783.80"},768.5,748.25,14137000,{"v":0.03704518779342723,"d":"3.70%"}]
[7,"Capital_Goods","ABB","2024-08-29",7960.15,{"v":7978.616666666666,"d":"7978.62"},{"v":7791.533333333332,"d":"7791.53"},{"v":7622.916666666666,"d":"7622.92"},{"v":7435.833333333332,"d":"7435.83"},{"v":8147.233333333332,"d":"8147.23"},{"v":8334.316666666666,"d":"8334.32"},{"v":8502.93333333333,"d":"8502.93"},8165.7,7810,1811125,{"v":0.06803774141235441,"d":"6.80%"}]
[8,"Pharma","ABBOTINDIA","2024-08-29",27260.55,{"v":28028.966666666664,"d":"28028.97"},{"v":26406.983333333326,"d":"26406.98"},{"v":25553.416666666664,"d":"25553.42"},{"v":23931.433333333327,"d":"23931.43"},{"v":28882.533333333326,"d":"28882.53"},{"v":30504.516666666663,"d":"30504.52"},{"v":31358.083333333325,"d":"31358.08"},29650.95,27175.4,155560,{"v":0.03320935175345377,"d":"3.32%"}]
[9,"Finance","ABCAPITAL","2024-08-29",211.65,{"v":211.7833333333333,"d":"211.78"},{"v":209.0666666666666,"d":"209.07"},{"v":206.4833333333333,"d":"206.48"},{"v":203.7666666666666,"d":"203.77"},{"v":214.36666666666662,"d":"214.37"},{"v":217.08333333333331,"d":"217.08"},{"v":219.66666666666663,"d":"219.67"},214.5,209.2,82857600,{"v":-0.013374485596707819,"d":"-1.34%"}]
[10,"Textile","ABFRL","2024-08-29",319.25,320.75,{"v":314.5,"d":"314.50"},309.75,{"v":303.5,"d":"303.50"},{"v":325.5,"d":"325.50"},331.75,{"v":336.5,"d":"336.50"},327,316,51264200,{"v":-0.03447431565545272,"d":"-3.45%"}]
{"$rows_left_out":194}
{"sheet":"Cash Intra","index":2,"n_rows":243,"n_cols":13,"rows_kept":243,"merged":[[7,0,8,0],[7,1,8,1],[7,2,8,2],[7,3,8,3],[7,4,7,6],[7,7,7,9]]}
[]
[]
[]
[]
[{"$nulls":12},"Back to Main Page"]
["FOR INTRA DAY TRADING",{"$nulls":9},{"$f":"Main!B10","v":"2024-08-09"}]
[]
["Sr.no",null,"CLOSE RATE","Pivot Point","Supports",null,null,"Resistances"]
[{"$nulls":4},"S1","S2","S3","R1","R2","R3","HIGH","LOW","Total Trade Quanity in Lakhs"]
[1,"Nifty 50",{"v":24117,"d":"24117.00"},{"v":24179.066666666666,"d":"24179.07"},{"v":24017.63333333333,"d":"24017.63"},{"v":23918.266666666666,"d":"23918.27"},{"v":23756.833333333332,"d":"23756.83"},{"v":24278.43333333333,"d":"24278.43"},{"v":24439.866666666665,"d":"24439.87"},{"v":24539.23333333333,"d":"24539.23"},{"v":24340.5,"d":"24340.50"},{"v":24079.7,"d":"24079.70"}]
[2,"Nifty Bank",{"v":50156.7,"d":"50156.70"},50142.35,49843.95,{"v":49531.2,"d":"49531.20"},{"v":49232.799999999996,"d":"49232.80"},{"v":50455.1,"d":"50455.10"},{"v":50753.50000000001,"d":"50753.50"},51066.25,50440.75,{"v":49829.6,"d":"49829.60"}]
[3,"Nifty CPSE",7315.05,{"v":7360.583333333333,"d":"7360.58"},{"v":7250.616666666666,"d":"7250.62"},{"v":7186.1833333333325,"d":"7186.18"},{"v":7076.216666666665,"d":"7076.22"},{"v":7425.016666666666,"d":"7425.02"},{"v":7534.983333333334,"d":"7534.98"},{"v":7599.416666666667,"d":"7599.42"},7470.55,7296.15]
[4,"Nifty Infra",{"v":9077.5,"d":"9077.50"},{"v":9111,"d":"9111.00"},{"v":9028.5,"d":"9028.50"},{"v":8979.5,"d":"8979.50"},{"v":8897,"d":"8897.00"},{"v":9160,"d":"9160.00"},{"v":9242.5,"d":"9242.50"},{"v":9291.5,"d":"9291.50"},{"v":9193.5,"d":"9193.50"},{"v":9062,"d":"9062.00"}]
[5,"Nifty IT",{"v":38448.3,"d":"38448.30"},{"v":38639.4,"d":"38639.40"},38180.05,{"v":37911.8,"d":"37911.80"},{"v":37452.450000000004,"d":"37452.45"},38907.65,{"v":39366.99999999999,"d":"39367.00"},39635.25,39098.75,38371.15]
[6,"Nifty PSE",11199.25,{"v":11259.233333333332,"d":"11259.23"},{"v":11115.066666666664,"d":"11115.07"},{"v":11030.883333333331,"d":"11030.88"},{"v":10886.716666666664,"d":"10886.72"},{"v":11343.416666666664,"d":"11343.42"},{"v":11487.583333333332,"d":"11487.58"},{"v":11571.766666666665,"d":"11571.77"},{"v":11403.4,"d":"11403.40"},11175.05]
[7,"Nifty Midcap 50",{"v":16052.6,"d":"16052.60"},{"v":16080.016666666668,"d":"16080.02"},{"v":15980.633333333337,"d":"15980.63"},{"v":15908.666666666668,"d":"15908.67"},{"v":15809.283333333336,"d":"15809.28"},{"v":16151.983333333337,"d":"16151.98"},{"v":16251.366666666669,"d":"16251.37"},{"v":16323.333333333338,"d":"16323.33"},{"v":16179.4,"d":"16179.40"},16008.05]
[8,"ABB",7942.3,{"v":7957.433333333333,"d":"7957.43"},{"v":7760.866666666667,"d":"7760.87"},{"v":7579.433333333333,"d":"7579.43"},{"v":7382.866666666667,"d":"7382.87"},{"v":8138.866666666667,"d":"8138.87"},{"v":8335.433333333334,"d":"8335.43"},{"v":8516.866666666667,"d":"8516.87"},8154,7776,6.30662]
[9,"ACC",2357.2,{"v":2367.4,"d":"2367.40"},{"v":2339.8,"d":"2339.80"},{"v":2322.4,"d":"2322.40"},{"v":2294.8,"d":"2294.80"},{"v":2384.8,"d":"2384.80"},{"v":2412.3999999999996,"d":"2412.40"},{"v":2429.8,"d":"2429.80"},2395,2350,2.26629]
[10,"APLAPOLLO",1435.45,{"v":1425.8166666666666,"d":"1425.82"},{"v":1406.6333333333332,"d":"1406.63"},{"v":1377.8166666666666,"d":"1377.82"},{"v":1358.6333333333332,"d":"1358.63"},{"v":1454.6333333333332,"d":"1454.63"},{"v":1473.8166666666666,"d":"1473.82"},{"v":1502.6333333333332,"d":"1502.63"},1445,1397,4.40998]
[11,"AUBANK",626.1,628.65,{"v":622,"d":"622.00"},{"v":617.9,"d":"617.90"},611.25,632.75,{"v":639.3999999999999,"d":"639.40"},{"v":643.5,"d":"643.50"},635.3,624.55,13.74881]
{"$rows_left_out":224}
{"sheet":"MidCap Intra","index":3,"n_rows":533,"n_cols":13,"rows_kept":533,"merged":[[0,0,0,1],[8,0,9,0],[8,1,9,1],[8,2,9,2],[8,3,9,3],[8,4,8,6],[8,7,8,9]]}
[]
[]
[]
[]
[{"$nulls":11},"Back To Main Page"]
["FOR INTRA DAY TRADING",{"$nulls":9},{"$f":"Main!B10","v":"2024-08-09"}]
[null,null," "]
[]
["Sr.no","Scrip","CLOSE RATE","Pivot Point","Supports",null,null,"Resistances"]
[{"$nulls":4},"S1","S2","S3","R1","R2","R3","HIGH","LOW","Total Trade Quanity in Lakhs"]
[1,"360ONE",1030.35,{"v":1023.4499999999999,"d":"1023.45"},{"v":1004.8999999999999,"d":"1004.90"},{"v":979.4499999999999,"d":"979.45"},{"v":960.8999999999999,"d":"960.90"},{"v":1048.8999999999999,"d":"1048.90"},{"v":1067.4499999999998,"d":"1067.45"},{"v":1092.8999999999999,"d":"1092.90"},1042,998,3.1755]
[2,"3MINDIA",37122.2,{"v":37347.799999999996,"d":"37347.80"},{"v":36777.399999999994,"d":"36777.40"},{"v":36432.6,"d":"36432.60"},{"v":35862.2,"d":"35862.20"},{"v":37692.59999999999,"d":"37692.60"},{"v":38263,"d":"38263.00"},{"v":38607.79999999999,"d":"38607.80"},37918.2,37003,0.02296]
[3,"ABB",7942.3,{"v":7957.433333333333,"d":"7957.43"},{"v":7760.866666666667,"d":"7760.87"},{"v":7579.433333333333,"d":"7579.43"},{"v":7382.866666666667,"d":"7382.87"},{"v":8138.866666666667,"d":"8138.87"},{"v":8335.433333333334,"d":"8335.43"},{"v":8516.866666666667,"d":"8516.87"},8154,7776,6.30662]
[4,"ACC",2357.2,{"v":2367.4,"d":"2367.40"},{"v":2339.8,"d":"2339.80"},{"v":2322.4,"d":"2322.40"},{"v":2294.8,"d":"2294.80"},{"v":2384.8,"d":"2384.80"},{"v":2412.3999999999996,"d":"2412.40"},{"v":2429.8,"d":"2429.80"},2395,2350,2.26629]
[5,"AIAENG",4593.3,{"v":4569.599999999999,"d":"4569.60"},{"v":4523.699999999999,"d":"4523.70"},{"v":4454.099999999999,"d":"4454.10"},{"v":4408.199999999999,"d":"4408.20"},{"v":4639.199999999999,"d":"4639.20"},{"v":4685.0999999999985,"d":"4685.10"},{"v":4754.699999999999,"d":"4754.70"},4615.5,4500,0.66081]
[6,"APLAPOLLO",1435.45,{"v":1425.8166666666666,"d":"1425.82"},{"v":1406.6333333333332,"d":"1406.63"},{"v":1377.8166666666666,"d":"1377.82"},{"v":1358.6333333333332,"d":"1358.63"},{"v":1454.6333333333332,"d":"1454.63"},{"v":1473.8166666666666,"d":"1473.82"},{"v":1502.6333333333332,"d":"1502.63"},1445,1397,4.40998]
[7,"AUBANK",626.1,628.65,{"v":622,"d":"622.00"},{"v":617.9,"d":"617.90"},611.25,632.75,{"v":639.3999999999999,"d":"639.40"},{"v":643.5,"d":"643.50"},635.3,624.55,13.74881]
[8,"AARTIIND",747.7,{"v":752.7333333333332,"d":"752.73"},{"v":739.9666666666665,"d":"739.97"},{"v":732.2333333333332,"d":"732.23"},{"v":719.4666666666665,"d":"719.47"},{"v":760.4666666666665,"d":"760.47"},{"v":773.2333333333331,"d":"773.23"},{"v":780.9666666666665,"d":"780.97"},765.5,745,16.61511]
[9,"AAVAS",1648.15,{"v":1634.1499999999999,"d":"1634.15"},{"v":1617.2999999999997,"d":"1617.30"},{"v":1586.4499999999998,"d":"1586.45"},{"v":1569.5999999999997,"d":"1569.60"},{"v":1664.9999999999998,"d":"1665.00"},{"v":1681.8499999999997,"d":"1681.85"},{"v":1712.6999999999998,"d":"1712.70"},1651,1603.3,0.83487]
[10,"ABBOTINDIA",27219.7,{"v":27941.599999999995,"d":"27941.60"},{"v":26382.19999999999,"d":"26382.20"},{"v":25544.699999999993,"d":"25544.70"},{"v":23985.29999999999,"d":"23985.30"},{"v":28779.09999999999,"d":"28779.10"},{"v":30338.499999999993,"d":"30338.50"},{"v":31175.999999999993,"d":"31176.00"},29501,27104.1,0.84434]
{"$rows_left_out":508}
{"sheet":"Bulk Deals","index":4,"n_rows":241,"n_cols":8,"rows_kept":241,"merged":[[4,0,4,1],[4,2,4,3],[6,1,6,2]]}
[" "]
[]
[]
[]
[]
[{"$nulls":4},"Back To Main Page"]
["Subject :","BULK DEAL",null,{"$f":"Main!B10","v":"2024-08-09"}]
[]
["Date","Scrip code","Scrip Name","Client Name","Buy / Sell","Quantity Traded","Trade Price / Wt.Avg.trade price","Exchange  "]
["2024-08-08",538351,"AFEL","SHAILESH KANJIBHAI DHAMELIYA","SELL",{"v":122259,"d":"122,259"},17.9,"BSE"]
["2024-08-08",538351,"AFEL","SEIFER RICHARD MASCARENHAS","BUY",{"v":50000,"d":"50,000"},17.9,"BSE"]
["2024-08-08",538351,"AFEL","SEIFER RICHARD MASCARENHAS","SELL",{"v":165249,"d":"165,249"},17.9,"BSE"]
["2024-08-08",541303,"AKSHAR","SANJAYBHAIBHAGWANBHAIJALODRA","BUY",{"v":1700000,"d":"1,700,000"},2.19,"BSE"]
["2024-08-08",541303,"AKSHAR","SILONI UPPAL","BUY",{"v":1773222,"d":"1,773,222"},2.24,"BSE"]
["2024-08-08",541303,"AKSHAR","SILONI UPPAL","SELL",{"v":1757537,"d":"1,757,537"},2.21,"BSE"]
["2024-08-08",541303,"AKSHAR","VIKRAMBHAI GOKALBHAI CHAUDHARI","BUY",{"v":1504396,"d":"1,504,396"},2.19,"BSE"]
["2024-08-08",541303,"AKSHAR","VIKRAMBHAI GOKALBHAI CHAUDHARI","SELL",{"v":504396,"d":"504,396"},2.19,"BSE"]
["2024-08-08",526662,"ARENTERP","BONANZA PORTFOLIO LIMITED","SELL",{"v":7488,"d":"7,488"},78.02,"BSE"]
["2024-08-08",526662,"ARENTERP","BONANZA PORTFOLIO LIMITED","BUY",{"v":30008,"d":"30,008"},78.96,"BSE"]
["2024-08-08",526662,"ARENTERP","KIRAN TRIVEDI HUF","SELL",{"v":20158,"d":"20,158"},79.08,"BSE"]
{"$rows_left_out":222}
{"sheet":"Call Tracker (Equity & F&O)","index":5,"n_rows":292,"n_cols":18,"rows_kept":292}
[]
[]
[]
[]
[{"$nulls":12},"Back To Main Page"]
["Retail Research Technical Calls & Fundamental Performance Report for the month of July-2024"]
[{"$nulls":12},{"$f":"Main!B10","v":"2024-08-09"}]
[null,"Positional  Call"]
["Sr.no","Date",null,"Company","Rec","Rec Price","Stop Loss***","Call Closed At","Target","Remark","Profit / Loss per Share","All charges","Net Gain / Loss  %","Status","Closed Date","Market Closing Price","Second Buying Date"]
[1,"2024-06-25",null,"HAPPSTMNDS","Accu",830,795,780,"900-950","Loss of Rs.50/-",{"$f":"H10-F10","v":-50},{"$f":"(F10*-0.3)/100","v":-2.49},{"$f":"(K10+L10)/F10","v":{"v":-0.06324096385542169,"d":"-6.32%"}},"Unsuccessful","2024-08-05",null,null,"H"]
[2,"2024-06-27",null,"BAJAJ-AUTO","Accu",9325,8900,9825,"10000-10400","Profit of Rs.500/-",{"$f":"H11-F11","v":500},{"$f":"(F11*-0.3)/100","v":{"v":-27.975,"d":"-27.98"}},{"$f":"(K11+L11)/F11","v":{"v":0.05061930294906166,"d":"5.06%"}},"Successful","2024-08-01",null,null,"H"]
[3,"2024-07-01",null,"RELIANCE","Accu",3075,2940,2900,"3300-3500","Loss of Rs.175/-",-175,{"v":-9.225,"d":"-9.23"},{"v":-0.05991056910569106,"d":"-5.99%"},"Unsuccessful","2024-08-05",null,null,"H"]
[4,"2024-07-19",null,"BAJAJFINSV","Accu",1617,1560,1555,"1720-1800","Loss of Rs.62/-",{"$f":"H13-F13","v":-62},{"$f":"(F13*-0.3)/100","v":{"v":-4.851,"d":"-4.85"}},{"$f":"(K13+L13)/F13","v":{"v":-0.0413426097711812,"d":"-4.13%"}},"Unsuccessful","2024-08-08",null,null,"H"]
[5,"2024-07-25",null,"NESTLEIND","Accu","2390-2470",2330,null,"2650-2800","Open",{"$nulls":5},{"$f":"VLOOKUP(D14,'MidCap Intra'!$B$11:$C$571,2,0)","v":{"v":2489.1,"d":"2489.10"}},null,"H"]
[6,"2024-07-26",null,"LTF","Accu","170.5-176.5",164,null,"195-205","Open",{"$nulls":5},{"$f":"VLOOKUP(D15,'MidCap Intra'!$B$11:$C$571,2,0)","v":165.65},null,"H"]
[7,"2024-07-26",null,"RKFORGE","Accu",840,790,882,"900-950","Profit of Rs.42/-",{"$f":"H16-F16","v":42},{"$f":"(F16*-0.3)/100","v":-2.52},{"$f":"(K16+L16)/F16","v":{"v":0.04699999999999999,"d":"4.70%"}},"Successful","2024-08-02",null,null,"H"]
[8,"2024-07-29",null,"CARBORUNIV","Accu",1710,1645,1605,"1840-1940","Loss of Rs.105/-",-105,-5.13,{"v":-0.06440350877192982,"d":"-6.44%"},"Unsuccessful","2024-08-05",null,null,"H"]
[9,"2024-07-30",null,"LTTS","Accu","5040-5170",4800,null,"5540-5900","Open",{"$nulls":5},{"$f":"VLOOKUP(D18,'MidCap Intra'!$B$11:$C$571,2,0)","v":4896.35},null,"K"]
[10,"2024-07-30",null,"VBL","Accu",1565,1495,1490,"1700-1800","Loss of Rs.75/-",{"$f":"H19-F19","v":-75},{"$f":"(F19*-0.3)/100","v":{"v":-4.695,"d":"-4.70"}},{"$f":"(K19+L19)/F19","v":{"v":-0.050923322683706064,"d":"-5.09%"}},"Unsuccessful","2024-08-06",null,null,"H"]
[11,"2024-07-30",null,"IOC","Accu",177.5,167,167,"195-210","Loss of Rs.10.5/-",{"$f":"H20-F20","v":-10.5},{"$f":"(F20*-0.3)/100","v":{"v":-0.5325,"d":"-0.53"}},{"$f":"(K20+L20)/F20","v":{"v":-0.06215492957746479,"d":"-6.22%"}},"Unsuccessful","2024-08-06",null,null,"H"]
{"$rows_left_out":265}