{"text_format":"3","workbook":"xlsx","n_sheets":11,"sheets":["Main","Future Intra","Cash Intra","MidCap Intra","Bulk Deals","Call Tracker (Equity & F&O)","Sheet2","Sheet1","Sheet3","Sheet4","Sheet5"],"not_rendered":{"images":4,"defined_names":5},"read":"whole","date_system":"1900"}

{"sheet":"Main","index":0,"n_rows":27,"n_cols":11,"rows_kept":27}
[null,"                                                                                                 "]
{"$rows_empty":8}
[null,"2019-11-08"]
[]
[null,"Sheet No.","Template Name","Summary"]
[null,1,"Future Intra","For Intraday trading in F&O segment"]
[null,2,"Cash Intra","For Intraday trading in cash market segment"]
[null,3,"Mid-cap Intra","For Intraday trading in Mid-cap stocks"]
[null,4,"Bulk Deals","Reveals Bulk Deals carried on NSE & BSE"]
[null,5,"Call Tracker"]
{"$rows_empty":9}
[{"$nulls":10},"`"]

{"sheet":"Future Intra","index":1,"n_rows":193,"n_cols":15,"rows_kept":193,"merged":[[8,0,9,0],[8,1,9,1],[8,2,9,2],[8,5,8,7],[8,8,8,10]]}
[]
[]
[]
[]
[{"$nulls":12},"Back to Main Page"]
["FOR INTRA DAY TRADING",{"$nulls":10},{"$f":"Main!B10","v":"2019-11-08"}]
[]
[]
["Sr.no","Sector","Scrip","CLOSE RATE","Pivot Point","Supports",null,null,"Resistances"]
[null,"Sector",null,"Point","Point","S1","S2","S3","R1","R2","R3","HIGH","LOW","OI","% Change in OI"]
[1,"Index","BANKNIFTY",30664.35,{"v":30658.766666666666,"d":"30658.77"},{"v":30468.583333333332,"d":"30468.58"},{"v":30272.816666666666,"d":"30272.82"},{"v":30082.63333333333,"d":"30082.63"},{"v":30854.533333333333,"d":"30854.53"},{"v":31044.716666666667,"d":"31044.72"},{"v":31240.483333333334,"d":"31240.48"},30848.95,30463,1465640,{"v":0.06268942415058223,"d":"6.27%"}]
[2,"Index","NIFTY",12047.95,{"v":12026.083333333334,"d":"12026.08"},{"v":11994.166666666668,"d":"11994.17"},{"v":11940.383333333333,"d":"11940.38"},{"v":11908.466666666667,"d":"11908.47"},{"v":12079.866666666669,"d":"12079.87"},{"v":12111.783333333336,"d":"12111.78"},{"v":12165.56666666667,"d":"12165.57"},12058,11972.3,16937100,{"v":0.027789661481326403,"d":"2.78%"}]
[3,"Index","NIFTYIT",{"v":15720,"d":"15720.00"},{"v":15698.333333333334,"d":"15698.33"},{"v":15646.666666666668,"d":"15646.67"},{"v":15573.333333333334,"d":"15573.33"},{"v":15521.666666666668,"d":"15521.67"},{"v":15771.666666666668,"d":"15771.67"},{"v":15823.333333333336,"d":"15823.33"},{"v":15896.666666666668,"d":"15896.67"},15750,15625,6950,{"v":-0.027972027972027972,"d":"-2.80%"}]
[4,"Cement","ACC",1534.05,{"v":1536.6333333333332,"d":"1536.63"},{"v":1523.4666666666665,"d":"1523.47"},{"v":1512.8833333333332,"d":"1512.88"},{"v":1499.7166666666665,"d":"1499.72"},{"v":1547.2166666666665,"d":"1547.22"},{"v":1560.3833333333334,"d":"1560.38"},{"v":1570.9666666666665,"d":"1570.97"},1549.8,1526.05,2884000,{"v":-2.2142264046498754E-3,"d":"-0.22%"}]
[5,"Others","ADANIENT",{"v":210,"d":"210.00"},{"v":208.95000000000002,"d":"208.95"},{"v":206.90000000000003,"d":"206.90"},{"v":203.8,"d":"203.80"},{"v":201.75000000000003,"d":"201.75"},{"v":212.05000000000004,"d":"212.05"},{"v":214.10000000000005,"d":"214.10"},{"v":217.20000000000005,"d":"217.20"},211,205.85,30512000,{"v":3.0243261012491782E-3,"d":"0.30%"}]
[6,"Others","ADANIPORTS",{"v":391.7,"d":"391.70"},{"v":391.4166666666667,"d":"391.42"},{"v":389.28333333333336,"d":"389.28"},{"v":386.8666666666667,"d":"386.87"},{"v":384.73333333333335,"d":"384.73"},{"v":393.83333333333337,"d":"393.83"},{"v":395.9666666666667,"d":"395.97"},{"v":398.3833333333334,"d":"398.38"},393.55,389,17040000,{"v":0.021123595505617977,"d":"2.11%"}]
[7,"Power","ADANIPOWER",{"v":70.8,"d":"70.80"},{"v":71.03333333333333,"d":"71.03"},{"v":70.36666666666666,"d":"70.37"},{"v":69.93333333333332,"d":"69.93"},{"v":69.26666666666665,"d":"69.27"},{"v":71.46666666666667,"d":"71.47"},{"v":72.13333333333335,"d":"72.13"},{"v":72.56666666666668,"d":"72.57"},71.7,70.6,79580000,{"v":-0.009089777113684472,"d":"-0.91%"}]
[8,"Automobile","AMARAJABAT",{"v":664.2,"d":"664.20"},{"v":664.2833333333334,"d":"664.28"},{"v":659.3666666666668,"d":"659.37"},{"v":654.5333333333334,"d":"654.53"},{"v":649.6166666666668,"d":"649.62"},{"v":669.1166666666668,"d":"669.12"},{"v":674.0333333333335,"d":"674.03"},{"v":678.8666666666668,"d":"678.87"},669.2,659.45,1332900,{"v":0.010614906361361741,"d":"1.06%"}]
[9,"Cement","AMBUJACEM",203.65,{"v":203.91666666666666,"d":"203.92"},{"v":202.33333333333331,"d":"202.33"},{"v":201.01666666666665,"d":"201.02"},{"v":199.4333333333333,"d":"199.43"},{"v":205.23333333333332,"d":"205.23"},{"v":206.81666666666663,"d":"206.82"},{"v":208.13333333333333,"d":"208.13"},205.5,202.6,19625000,{"v":0.002682334908672883,"d":"0.27%"}]
[10,"Others","APOLLOHOSP",1464.35,{"v":1454.1499999999999,"d":"1454.15"},{"v":1438.1999999999998,"d":"1438.20"},1412.05,{"v":1396.1,"d":"1396.10"},{"v":1480.2999999999997,"d":"1480.30"},1496.25,{"v":1522.3999999999996,"d":"1522.40"},1470.1,1428,1686000,{"v":-0.06592797783933518,"d":"-6.59%"}]
{"$rows_left_out":159}
{"sheet":"Cash Intra","index":2,"n_rows":247,"n_cols":13,"rows_kept":247,"merged":[[7,0,8,0],[7,1,8,1],[7,2,8,2],[7,3,8,3],[7,4,7,6],[7,7,7,9]]}
[]
[]
[]
[]
[{"$nulls":12},"Back to Main Page"]
["FOR INTRA DAY TRADING",{"$nulls":9},{"$f":"Main!B10","v":"2019-11-08"}]
[]
["Sr.no","Scrip","CLOSE RATE","Pivot Point","Supports",null,null,"Resistances"]
[null,null,"Point",null,"S1","S2","S3","R1","R2","R3","HIGH","LOW","Total Trade Quanity in Lakhs"]
[1,"Nifty 50",12012.05,{"v":11993.433333333332,"d":"11993.43"},{"v":11965.466666666665,"d":"11965.47"},{"v":11918.883333333333,"d":"11918.88"},{"v":11890.916666666666,"d":"11890.92"},{"v":12040.016666666665,"d":"12040.02"},{"v":12067.983333333332,"d":"12067.98"},{"v":12114.566666666664,"d":"12114.57"},12021.4,11946.85]
[2,"Nifty Bank",30633.15,{"v":30639.016666666666,"d":"30639.02"},{"v":30456.683333333334,"d":"30456.68"},{"v":30280.216666666667,"d":"30280.22"},{"v":30097.883333333335,"d":"30097.88"},{"v":30815.483333333334,"d":"30815.48"},{"v":30997.81666666667,"d":"30997.82"},{"v":31174.283333333333,"d":"31174.28"},30821.35,30462.55]
[3,"Nifty CPSE",2023.2,{"v":2026.8500000000001,"d":"2026.85"},{"v":2011.2500000000002,"d":"2011.25"},{"v":1999.3000000000002,"d":"1999.30"},{"v":1983.7000000000003,"d":"1983.70"},{"v":2038.8000000000002,"d":"2038.80"},{"v":2054.4,"d":"2054.40"},{"v":2066.3500000000004,"d":"2066.35"},2042.45,2014.9]
[4,"Nifty Infra",3286.85,{"v":3287.5833333333335,"d":"3287.58"},{"v":3273.266666666667,"d":"3273.27"},{"v":3259.6833333333334,"d":"3259.68"},{"v":3245.366666666667,"d":"3245.37"},{"v":3301.166666666667,"d":"3301.17"},{"v":3315.4833333333336,"d":"3315.48"},{"v":3329.066666666667,"d":"3329.07"},3301.9,3274]
[5,"Nifty IT",15624.4,15598.75,{"v":15557.8,"d":"15557.80"},{"v":15491.199999999999,"d":"15491.20"},{"v":15450.249999999998,"d":"15450.25"},15665.35,{"v":15706.300000000001,"d":"15706.30"},{"v":15772.900000000001,"d":"15772.90"},15639.7,15532.15]
[6,"Nifty PSE",3374.8,{"v":3386.816666666667,"d":"3386.82"},{"v":3356.1833333333343,"d":"3356.18"},{"v":3337.566666666667,"d":"3337.57"},{"v":3306.9333333333343,"d":"3306.93"},{"v":3405.4333333333343,"d":"3405.43"},{"v":3436.0666666666666,"d":"3436.07"},{"v":3454.6833333333343,"d":"3454.68"},3417.45,3368.2]
[7,"Nifty Midcap 50",4630.6,{"v":4623.566666666667,"d":"4623.57"},{"v":4611.833333333333,"d":"4611.83"},{"v":4593.066666666667,"d":"4593.07"},{"v":4581.333333333333,"d":"4581.33"},{"v":4642.333333333333,"d":"4642.33"},{"v":4654.066666666667,"d":"4654.07"},{"v":4672.833333333333,"d":"4672.83"},4635.3,4604.8]
[8,"ACC",1527.15,{"v":1531.1000000000001,"d":"1531.10"},{"v":1516.0500000000002,"d":"1516.05"},1504.95,{"v":1489.9,"d":"1489.90"},{"v":1542.2000000000003,"d":"1542.20"},1557.25,{"v":1568.3500000000004,"d":"1568.35"},1546.15,1520,8.24638]
[9,"AUBANK",685.1,{"v":681.1999999999999,"d":"681.20"},{"v":671.3999999999999,"d":"671.40"},{"v":657.6999999999999,"d":"657.70"},{"v":647.8999999999999,"d":"647.90"},{"v":694.8999999999999,"d":"694.90"},{"v":704.6999999999998,"d":"704.70"},{"v":718.3999999999999,"d":"718.40"},691,667.5,3.58799]
[10,"ADANIPORTS",390.45,{"v":390.1666666666667,"d":"390.17"},{"v":388.33333333333337,"d":"388.33"},{"v":386.2166666666667,"d":"386.22"},{"v":384.3833333333334,"d":"384.38"},{"v":392.28333333333336,"d":"392.28"},{"v":394.11666666666673,"d":"394.12"},{"v":396.23333333333335,"d":"396.23"},392,388.05,16.15593]
[11,"ADANIPOWER",70.55,{"v":70.76666666666667,"d":"70.77"},{"v":70.03333333333333,"d":"70.03"},{"v":69.51666666666667,"d":"69.52"},{"v":68.78333333333333,"d":"68.78"},{"v":71.28333333333333,"d":"71.28"},{"v":72.01666666666665,"d":"72.02"},{"v":72.53333333333333,"d":"72.53"},71.5,70.25,55.64428]
{"$rows_left_out":228}
{"sheet":"MidCap Intra","index":3,"n_rows":545,"n_cols":13,"rows_kept":545,"merged":[[0,0,0,1],[8,0,9,0],[8,1,9,1],[8,2,9,2],[8,3,9,3],[8,4,8,6],[8,7,8,9]]}
[]
[]
[]
[]
[{"$nulls":11},"Back To Main Page"]
["FOR INTRA DAY TRADING",{"$nulls":9},{"$f":"Main!B10","v":"2019-11-08"}]
[null,null," "]
[]
["Sr.no","Scrip","CLOSE RATE","Pivot Point","Supports",null,null,"Resistances"]
[null,null,"Point",null,"S1","S2","S3","R1","R2","R3","HIGH","LOW","Total Trade Quanity in Lakhs"]
[1,"3MINDIA",22463.45,{"v":22454.483333333334,"d":"22454.48"},{"v":22308.966666666667,"d":"22308.97"},{"v":22154.483333333334,"d":"22154.48"},{"v":22008.966666666667,"d":"22008.97"},{"v":22608.966666666667,"d":"22608.97"},{"v":22754.483333333337,"d":"22754.48"},{"v":22908.966666666667,"d":"22908.97"},22600,22300,0.00648]
[2,"ACC",1527.15,{"v":1531.1000000000001,"d":"1531.10"},{"v":1516.0500000000002,"d":"1516.05"},1504.95,{"v":1489.9,"d":"1489.90"},{"v":1542.2000000000003,"d":"1542.20"},1557.25,{"v":1568.3500000000004,"d":"1568.35"},1546.15,1520,8.24638]
[3,"AIAENG",1692.7,{"v":1696.8500000000001,"d":"1696.85"},{"v":1675.8000000000002,"d":"1675.80"},{"v":1658.9,"d":"1658.90"},{"v":1637.8500000000001,"d":"1637.85"},{"v":1713.7500000000002,"d":"1713.75"},{"v":1734.8,"d":"1734.80"},{"v":1751.7000000000003,"d":"1751.70"},1717.9,1679.95,0.1857]
[4,"APLAPOLLO",1454.15,{"v":1460.6666666666667,"d":"1460.67"},{"v":1436.2833333333335,"d":"1436.28"},{"v":1418.4166666666667,"d":"1418.42"},{"v":1394.0333333333335,"d":"1394.03"},{"v":1478.5333333333335,"d":"1478.53"},{"v":1502.9166666666667,"d":"1502.92"},{"v":1520.7833333333335,"d":"1520.78"},1485.05,1442.8,0.17439]
[5,"AUBANK",685.1,{"v":681.1999999999999,"d":"681.20"},{"v":671.3999999999999,"d":"671.40"},{"v":657.6999999999999,"d":"657.70"},{"v":647.8999999999999,"d":"647.90"},{"v":694.8999999999999,"d":"694.90"},{"v":704.6999999999998,"d":"704.70"},{"v":718.3999999999999,"d":"718.40"},691,667.5,3.58799]
[6,"AAVAS",1545.2,{"v":1536.0666666666666,"d":"1536.07"},{"v":1507.1333333333332,"d":"1507.13"},{"v":1469.0666666666666,"d":"1469.07"},{"v":1440.1333333333332,"d":"1440.13"},{"v":1574.1333333333332,"d":"1574.13"},{"v":1603.0666666666666,"d":"1603.07"},{"v":1641.1333333333332,"d":"1641.13"},1565,1498,0.4471]
[7,"ABBOTINDIA",11695.25,{"v":11655.083333333334,"d":"11655.08"},{"v":11550.166666666668,"d":"11550.17"},{"v":11405.083333333334,"d":"11405.08"},{"v":11300.166666666668,"d":"11300.17"},{"v":11800.166666666668,"d":"11800.17"},{"v":11905.083333333336,"d":"11905.08"},{"v":12050.166666666668,"d":"12050.17"},11760,11510,0.05421]
[8,"ADANIGAS",147.35,{"v":147.71666666666667,"d":"147.72"},{"v":146.73333333333335,"d":"146.73"},{"v":146.11666666666667,"d":"146.12"},{"v":145.13333333333335,"d":"145.13"},{"v":148.33333333333334,"d":"148.33"},{"v":149.31666666666663,"d":"149.32"},{"v":149.93333333333334,"d":"149.93"},148.7,147.1,3.85595]
[9,"ADANIGREEN",88.7,{"v":89.39999999999999,"d":"89.40"},{"v":87.59999999999998,"d":"87.60"},{"v":86.49999999999999,"d":"86.50"},{"v":84.69999999999997,"d":"84.70"},{"v":90.49999999999999,"d":"90.50"},{"v":92.3,"d":"92.30"},{"v":93.39999999999999,"d":"93.40"},91.2,88.3,9.11495]
[10,"ADANIPORTS",390.45,{"v":390.1666666666667,"d":"390.17"},{"v":388.33333333333337,"d":"388.33"},{"v":386.2166666666667,"d":"386.22"},{"v":384.3833333333334,"d":"384.38"},{"v":392.28333333333336,"d":"392.28"},{"v":394.11666666666673,"d":"394.12"},{"v":396.23333333333335,"d":"396.23"},392,388.05,16.15593]
{"$rows_left_out":513}
{"sheet":"Bulk Deals","index":4,"n_rows":68,"n_cols":8,"rows_kept":68,"merged":[[4,0,4,1],[4,2,4,3],[6,1,6,2]]}
[" "]
[]
[]
[]
[]
[{"$nulls":4},"Back To Main Page"]
["Subject :","BULK DEAL",null,{"$f":"Main!B10","v":"2019-11-08"}]
[]
["Date","Scrip code","Scrip Name","Client Name","Buy / Sell","Quantity Traded","Trade Price / Wt.Avg.trade price","Exchange  "]
["2019-11-07",542580,"AARTECH","FORTUNE FUTURES PRIVATE LIMITED CO","BUY",{"v":56000,"d":"56,000"},34.13,"BSE"]
["2019-11-07",542580,"AARTECH","NIKESH AGRO FARMS AND INFRASTRUCTURE PRIVATE LTD","SELL",{"v":56000,"d":"56,000"},34.13,"BSE"]
["2019-11-07",541401,"ARIHANTINS","ASHISH HASAMUKHLAL SHAH","BUY",{"v":84000,"d":"84,000"},6.44,"BSE"]
["2019-11-07",541401,"ARIHANTINS","DHAVAL VIPULBHAI SHAH","SELL",{"v":56000,"d":"56,000"},6.38,"BSE"]
["2019-11-07",539266,"CONCRETE","SURESH RAJA","BUY",{"v":41705,"d":"41,705"},4.62,"BSE"]
["2019-11-07",539770,"DARJEELING","VIDHI NIKUNJ SHAH","BUY",{"v":21176,"d":"21,176"},96.25,"BSE"]
["2019-11-07",539770,"DARJEELING","VIDHI NIKUNJ SHAH","SELL",{"v":3500,"d":"3,500"},95.6,"BSE"]
["2019-11-07",542666,"GKP","DIMPLE VIPUL PATEL .","SELL",{"v":56000,"d":"56,000"},{"v":34.3,"d":"34.30"},"BSE"]
["2019-11-07",542666,"GKP","H V VORA HUF","BUY",{"v":56000,"d":"56,000"},{"v":34.3,"d":"34.30"},"BSE"]
["2019-11-07",538765,"JSHL","VIVEK DWIVEDI","BUY",{"v":55000,"d":"55,000"},10.47,"BSE"]
["2019-11-07",538765,"JSHL","VIVEK DWIVEDI","SELL",{"v":65000,"d":"65,000"},10.45,"BSE"]
{"$rows_left_out":49}
{"sheet":"Call Tracker (Equity & F&O)","index":5,"n_rows":297,"n_cols":18,"rows_kept":297,"merged":[[77,0,78,0],[77,1,78,1],[77,9,78,9],[77,11,78,11],[77,12,78,12],[77,13,78,13],[77,14,78,14],[79,0,80,0],[79,1,80,1],[79,9,80,9],[79,11,80,11],[79,12,80,12],[79,13,80,13],[79,14,80,14],[81,0,82,0],[81,1,82,1],[81,9,82,9],[81,11,82,11],[81,12,82,12],[81,13,82,13],[81,14,82,14],[83,0,84,0],[83,1,84,1],[83,9,84,9],[83,11,84,11],[83,12,84,12],[83,13,84,13],[83,14,84,14],[85,0,86,0],[85,1,86,1],[85,9,86,9],[85,11,86,11],[85,12,86,12],[85,13,86,13],[85,14,86,14],[87,0,88,0],[87,1,88,1],[87,9,88,9],[87,11,88,11],[87,12,88,12],[87,13,88,13],[87,14,88,14],[89,0,90,0],[89,1,90,1],[89,9,90,9],[89,11,90,11],[89,12,90,12],[89,13,90,13],[89,14,90,14],[91,0,92,0],[91,1,92,1],[91,9,92,9],[91,11,92,11],[91,12,92,12],[91,13,92,13],[91,14,92,14],[93,0,94,0],[93,1,94,1],[93,9,94,9],[93,11,94,11],[93,12,94,12],[93,13,94,13],[93,14,94,14],[95,0,96,0],[95,1,96,1],[95,9,96,9],[95,11,96,11],[95,12,96,12],[95,13,96,13],[95,14,96,14],[97,0,98,0],[97,1,98,1],[97,9,98,9],[97,11,98,11],[97,12,98,12],[97,13,98,13],[97,14,98,14],[99,0,100,0],[99,1,100,1],[99,9,100,9],[99,11,100,11],[99,12,100,12],[99,13,100,13],[99,14,100,14],[101,0,102,0],[101,1,102,1],[101,9,102,9],[101,11,102,11],[101,12,102,12],[101,13,102,13],[101,14,102,14],[103,0,104,0],[103,1,104,1],[103,9,104,9],[103,11,104,11],[103,12,104,12],[103,13,104,13],[103,14,104,14],[105,0,106,0],[105,1,106,1],[105,9,106,9],[105,11,106,11],[105,12,106,12],[105,13,106,13],[105,14,106,14],[112,0,113,0],[112,1,113,1],[112,9,113,9],[112,11,113,11],[112,12,113,12],[112,13,113,13],[112,14,113,14],[114,0,115,0],[114,1,115,1],[114,9,115,9],[114,11,115,11],[114,12,115,12],[114,13,115,13],[114,14,115,14],[117,0,118,0],[117,1,118,1],[117,9,118,9],[117,11,118,11],[117,12,118,12],[117,13,118,13],[117,14,118,14],[119,0,120,0],[119,1,120,1],[119,9,120,9],[119,11,120,11],[119,12,120,12],[119,13,120,13],[119,14,120,14]]}
[]
[]
[]
[]
[{"$nulls":12},"Back To Main Page"]
["Retail Research Technical Calls & Fundamental Performance Report for the month of November-2019 "]
[{"$nulls":12},{"$f":"Main!B10","v":"2019-11-08"}]
[null,"Positional  Call"]
["Sr.no","Date",null,"Company","Rec","Rec Price","Stop Loss***","Call Closed At","Target","Remark","Profit / Loss per Share","Gain / Loss  %","Status","Closed Date","NSE Closed Price"]
[1,"2019-09-26",null,"HDFC","Buy",2070,1940,2165,"2250-2300","Profit of Rs.95/-",{"$f":"H10-F10","v":95},{"$f":"K10/F10","v":{"v":0.04589371980676329,"d":"4.59%"}},"Successful","2019-11-01",{"$nulls":3},"H"]
[2,"2019-10-01",null,"UPL","Buy",595,564,599.5,"650-660","Profit of Rs.4.50/-",4.5,{"v":0.007563025210084034,"d":"0.76%"},"Neutral","2019-11-07",{"$nulls":3},"R"]
[3,"2019-10-07",null,"PIDILITIND","Buy",1367.5,1297,1413.5,"1500-1520","Part Profit of Rs.46/-",{"$f":"H12-F12","v":46},{"$f":"K12/F12","v":{"v":0.03363802559414991,"d":"3.36%"}},"Successful","2019-10-31",{"$f":"VLOOKUP(D12,Sheet2!A51:M1690,6,0)","v":1382.6},null,null,"R"]
[4,"2019-10-22",null,"HEIDELBERG","Buy",188.5,178,199,"205-210","Profit of Rs.10.50/-",10.5,{"v":0.05570291777188329,"d":"5.57%"},"Successful","2019-11-05",{"$nulls":3},"H"]
[5,"2019-10-27",null,"AMBUJACEM","Buy",197,185.4,203.5,"216-220","Part Profit of Rs.6.5/-",{"$f":"H14-F14","v":6.5},{"$f":"K14/F14","v":{"v":0.03299492385786802,"d":"3.30%"}},"Successful","2019-10-30",{"$f":"VLOOKUP(D14,Sheet2!A60:M1699,6,0)","v":203.2},null,null,"R"]
[6,"2019-11-04",null,"UBL","Buy",1240,1178,1277.5,"1340-1360","Part Profit of Rs.37.50/-",{"$f":"H15-F15","v":37.5},{"$f":"K15/F15","v":{"v":0.03024193548387097,"d":"3.02%"}},"Successful","2019-11-06",{"$f":"VLOOKUP(D15,Sheet2!A61:M1700,6,0)","v":1236.6},null,null,"H"]
[7,"2019-11-05",null,"TATAMOTORS","Sell","172-174",183.3,null,"158-155","Open",{"$nulls":4},{"$f":"VLOOKUP(D16,Sheet2!A62:M1701,6,0)","v":171.5},null,null,"R"]
[8,"2019-11-06",null,"BANDHANBNK","Buy","570-575",538,null,"630-650","Open",{"$nulls":4},{"$f":"VLOOKUP(D17,Sheet2!A63:M1702,6,0)","v":568.6},null,null,"H"]
[9,"2019-11-07",null,"PRESTIGE","Buy","310-314",288,null,"340-360","Open"]
[10,"2019-11-07",null,"JINDALSTEL","Sell",138,148.3,143,"120-117","Loss of Rs.5/-",{"$f":"F19-H19","v":-5},{"$f":"K19/F19","v":{"v":-0.036231884057971016,"d":"-3.62%"}},"Unsuccessful","2019-11-07"]
{"$rows_empty":10}
{"$rows_left_out":250}
{"sheet":"Sheet2","index":6,"n_rows":1899,"n_cols":14,"rows_kept":1899,"hidden":true}
["SYMBOL","SERIES","OPEN","HIGH","LOW","CLOSE","LAST","PREVCLOSE","TOTTRDQTY","TOTTRDVAL","TIMESTAMP","TOTALTRADES","ISIN","ISIN"]
["20MICRONS","EQ",39.1,39.75,38.6,39.05,39.45,38.45,66392,2595232.25,"2019-11-07",561,"INE144J01027"]
["21STCENMGM","EQ",14,14,13.5,14,14,13.75,847,11606.5,"2019-11-07",11,"INE253B01015"]
["3IINFOTECH","EQ",2,2.05,1.95,2,1.95,2,1024879,2055107.4,"2019-11-07",504,"INE748C01020"]
["3MINDIA","EQ",22600,22600,22300,22463.45,22470,22517.5,648,14561047.7,"2019-11-07",386,"INE470A01017"]
["3PLAND","EQ",6.25,6.3,6.25,6.3,6.3,6.55,2,12.55,"2019-11-07",2,"INE105C01023"]
["5PAISA","EQ",165,172.95,163,167.35,167.25,171.35,6854,1156087.05,"2019-11-07",144,"INE618L01018"]
["63MOONS","EQ",119.45,120.45,117.75,118.2,118.2,119.25,66815,7952513.5,"2019-11-07",972,"INE111B01023"]
["A2ZINFRA","EQ",10.1,10.1,9.55,9.7,9.8,9.65,201180,1970200.4,"2019-11-07",463,"INE619I01012"]
["AARTIDRUGS","EQ",507.2,527,502.2,523.1,527,507.4,21649,11156384.25,"2019-11-07",1394,"INE767A01016"]
["AARTIIND","EQ",823,834,805,819.55,825,819.05,150177,123148555.55,"2019-11-07",5357,"INE769A01020"]
["AARVEEDEN","EQ",14.5,14.5,13.7,13.75,13.75,13.8,9057,125748.55,"2019-11-07",82,"INE273D01019"]
["AAVAS","EQ",1498.8,1565,1498,1545.2,1550,1490.4,44710,68769390.65,"2019-11-07",3822,"INE216P01012"]
["ABAN","BE",33.95,33.95,30.75,32.2,33.3,32.35,130814,4202155.2,"2019-11-07",1071,"INE421A01028"]
["ABB","EQ",1465,1493,1457.05,1482.75,1480,1461.75,53442,78795891.95,"2019-11-07",2844,"INE117A01022"]
["ABBOTINDIA","EQ",11515,11760,11510,11695.25,11635.85,11480.45,5421,62958737.55,"2019-11-07",1790,"INE358A01014"]
["ABCAPITAL","EQ",83.6,85.5,83.6,84.7,84.7,83.5,4586782,388561270.75,"2019-11-07",22258,"INE674K01013"]
["ABFRL","EQ",206.6,206.6,196.55,202.5,201.6,204.3,722566,144859339.05,"2019-11-07",9456,"INE647O01011"]
["ABSLBANETF","EQ",307,315,306.6,308,308,305.01,85,26183.95,"2019-11-07",5,"INF209KB1O58"]
["ABSLNN50ET","EQ",297.4,297.4,287.57,287.57,287.57,286.4,20,5849.7,"2019-11-07",2,"INF209KB1B87"]
{"$rows_left_out":1701}
{"sheet":"Sheet1","index":7,"n_rows":0,"n_cols":0,"rows_kept":0,"hidden":true}

{"sheet":"Sheet3","index":8,"n_rows":0,"n_cols":0,"rows_kept":0,"hidden":true}

{"sheet":"Sheet4","index":9,"n_rows":0,"n_cols":0,"rows_kept":0,"hidden":true}

{"sheet":"Sheet5","index":10,"n_rows":0,"n_cols":0,"rows_kept":0,"hidden":true}