{"text_format":"3","workbook":"xlsx","n_sheets":11,"sheets":["Main","Future Intra","Cash Intra","MidCap Intra","Bulk Deals","Call Tracker (Equity & F&O)","Sheet2","Sheet1","Sheet3","Sheet4","Sheet5"],"not_rendered":{"images":4,"defined_names":5},"read":"whole","date_system":"1900"}

{"sheet":"Main","index":0,"n_rows":27,"n_cols":11,"rows_kept":27}
[null,"                                                                                                 "]
{"$rows_empty":8}
[null,"2019-10-10"]
[]
[null,"Sheet No.","Template Name","Summary"]
[null,1,"Future Intra","For Intraday trading in F&O segment"]
[null,2,"Cash Intra","For Intraday trading in cash market segment"]
[null,3,"Mid-cap Intra","For Intraday trading in Mid-cap stocks"]
[null,4,"Bulk Deals","Reveals Bulk Deals carried on NSE & BSE"]
[null,5,"Call Tracker"]
{"$rows_empty":9}
[{"$nulls":10},"`"]

{"sheet":"Future Intra","index":1,"n_rows":193,"n_cols":15,"rows_kept":193,"merged":[[8,0,9,0],[8,1,9,1],[8,2,9,2],[8,5,8,7],[8,8,8,10]]}
[]
[]
[]
[]
[{"$nulls":12},"Back to Main Page"]
["FOR INTRA DAY TRADING",{"$nulls":10},{"$f":"Main!B10","v":"2019-10-10"}]
[]
[]
["Sr.no","Sector","Scrip","CLOSE RATE","Pivot Point","Supports",null,null,"Resistances"]
[null,"Sector",null,"Point","Point","S1","S2","S3","R1","R2","R3","HIGH","LOW","OI","% Change in OI"]
[1,"Index","BANKNIFTY",28874.05,{"v":28546,"d":"28546.00"},28102.05,27330.05,{"v":26886.1,"d":"26886.10"},{"v":29318,"d":"29318.00"},{"v":29761.949999999997,"d":"29761.95"},30533.95,28989.95,27774,1456320,{"v":-0.05154155757883631,"d":"-5.15%"}]
[2,"Index","NIFTY",{"v":11347.7,"d":"11347.70"},{"v":11274.9,"d":"11274.90"},11186.55,{"v":11025.4,"d":"11025.40"},10937.05,11436.05,{"v":11524.400000000001,"d":"11524.40"},11685.55,11363.25,11113.75,15610500,{"v":-0.056653372008701956,"d":"-5.67%"}]
[3,"Index","NIFTYIT",{"v":15183,"d":"15183.00"},{"v":15186.666666666666,"d":"15186.67"},{"v":15071.333333333332,"d":"15071.33"},{"v":14959.666666666666,"d":"14959.67"},{"v":14844.333333333332,"d":"14844.33"},{"v":15298.333333333332,"d":"15298.33"},{"v":15413.666666666664,"d":"15413.67"},{"v":15525.333333333332,"d":"15525.33"},15302,15075,12150,{"v":0.07048458149779736,"d":"7.05%"}]
[4,"Cement","ACC",1473.95,{"v":1459.4166666666667,"d":"1459.42"},{"v":1437.5833333333335,"d":"1437.58"},{"v":1401.2166666666667,"d":"1401.22"},{"v":1379.3833333333334,"d":"1379.38"},{"v":1495.7833333333335,"d":"1495.78"},{"v":1517.616666666667,"d":"1517.62"},{"v":1553.9833333333336,"d":"1553.98"},1481.25,1423.05,2388800,{"v":0.04606761254160098,"d":"4.61%"}]
[5,"Others","ADANIENT",139.45,{"v":137.95000000000002,"d":"137.95"},{"v":135.65000000000003,"d":"135.65"},{"v":131.85000000000002,"d":"131.85"},{"v":129.55000000000004,"d":"129.55"},{"v":141.75000000000003,"d":"141.75"},{"v":144.05000000000004,"d":"144.05"},{"v":147.85000000000002,"d":"147.85"},140.25,134.15,26384000,{"v":0.004722010662604722,"d":"0.47%"}]
[6,"Others","ADANIPORTS",402.65,{"v":400.3,"d":"400.30"},395.85,389.05,{"v":384.6,"d":"384.60"},{"v":407.1,"d":"407.10"},{"v":411.54999999999995,"d":"411.55"},418.35,404.75,393.5,11910000,{"v":0.02012847965738758,"d":"2.01%"}]
[7,"Power","ADANIPOWER",{"v":61,"d":"61.00"},{"v":60.21666666666667,"d":"60.22"},{"v":59.13333333333334,"d":"59.13"},{"v":57.26666666666667,"d":"57.27"},{"v":56.183333333333344,"d":"56.18"},{"v":62.083333333333336,"d":"62.08"},{"v":63.166666666666664,"d":"63.17"},{"v":65.03333333333333,"d":"65.03"},61.3,58.35,92320000,{"v":0.013614404918752744,"d":"1.36%"}]
[8,"Automobile","AMARAJABAT",{"v":695.8,"d":"695.80"},{"v":689.4333333333334,"d":"689.43"},{"v":681.3666666666668,"d":"681.37"},{"v":666.9333333333334,"d":"666.93"},{"v":658.8666666666668,"d":"658.87"},{"v":703.8666666666668,"d":"703.87"},{"v":711.9333333333334,"d":"711.93"},{"v":726.3666666666668,"d":"726.37"},697.5,675,1618400,{"v":-6.0189165950128975E-3,"d":"-0.60%"}]
[9,"Cement","AMBUJACEM",192.75,{"v":190.3166666666667,"d":"190.32"},{"v":186.9333333333334,"d":"186.93"},{"v":181.1166666666667,"d":"181.12"},{"v":177.7333333333334,"d":"177.73"},{"v":196.13333333333338,"d":"196.13"},{"v":199.51666666666665,"d":"199.52"},{"v":205.33333333333337,"d":"205.33"},193.7,184.5,24050000,{"v":-0.026906736799514466,"d":"-2.69%"}]
[10,"Others","APOLLOHOSP",{"v":1427.2,"d":"1427.20"},{"v":1418.9833333333336,"d":"1418.98"},{"v":1406.8666666666672,"d":"1406.87"},{"v":1386.5333333333338,"d":"1386.53"},{"v":1374.4166666666674,"d":"1374.42"},{"v":1439.316666666667,"d":"1439.32"},{"v":1451.4333333333334,"d":"1451.43"},{"v":1471.7666666666669,"d":"1471.77"},1431.1,1398.65,1461500,{"v":-0.024365821094793058,"d":"-2.44%"}]
{"$rows_left_out":160}
{"sheet":"Cash Intra","index":2,"n_rows":247,"n_cols":13,"rows_kept":247,"merged":[[7,0,8,0],[7,1,8,1],[7,2,8,2],[7,3,8,3],[7,4,7,6],[7,7,7,9]]}
[]
[]
[]
[]
[{"$nulls":12},"Back to Main Page"]
["FOR INTRA DAY TRADING",{"$nulls":9},{"$f":"Main!B10","v":"2019-10-10"}]
[]
["Sr.no","Scrip","CLOSE RATE","Pivot Point","Supports",null,null,"Resistances"]
[null,null,"Point",null,"S1","S2","S3","R1","R2","R3","HIGH","LOW","Total Trade Quanity in Lakhs"]
[1,"Nifty 50",11313.3,{"v":11241.683333333334,"d":"11241.68"},{"v":11161.766666666668,"d":"11161.77"},{"v":11010.233333333334,"d":"11010.23"},{"v":10930.316666666668,"d":"10930.32"},{"v":11393.216666666669,"d":"11393.22"},{"v":11473.133333333333,"d":"11473.13"},{"v":11624.66666666667,"d":"11624.67"},11321.6,11090.15]
[2,"Nifty Bank",28785.85,{"v":28448.533333333336,"d":"28448.53"},{"v":28039.366666666672,"d":"28039.37"},{"v":27292.883333333335,"d":"27292.88"},{"v":26883.71666666667,"d":"26883.72"},{"v":29195.016666666674,"d":"29195.02"},{"v":29604.183333333338,"d":"29604.18"},{"v":30350.666666666675,"d":"30350.67"},28857.7,27702.05]
[3,"Nifty CPSE",1908.2,{"v":1906.8166666666668,"d":"1906.82"},{"v":1891.2833333333338,"d":"1891.28"},{"v":1874.366666666667,"d":"1874.37"},{"v":1858.833333333334,"d":"1858.83"},{"v":1923.7333333333336,"d":"1923.73"},{"v":1939.2666666666669,"d":"1939.27"},{"v":1956.1833333333334,"d":"1956.18"},1922.35,1889.9]
[4,"Nifty Infra",3151.45,{"v":3130.6666666666665,"d":"3130.67"},{"v":3105.233333333333,"d":"3105.23"},{"v":3059.0166666666664,"d":"3059.02"},{"v":3033.583333333333,"d":"3033.58"},{"v":3176.883333333333,"d":"3176.88"},{"v":3202.3166666666666,"d":"3202.32"},{"v":3248.5333333333333,"d":"3248.53"},3156.1,3084.45]
[5,"Nifty IT",15128.75,15165.75,15014.35,14899.95,{"v":14748.550000000001,"d":"14748.55"},15280.15,{"v":15431.550000000001,"d":"15431.55"},{"v":15545.949999999999,"d":"15545.95"},15317.15,15051.35]
[6,"Nifty PSE",3207.7,{"v":3197.066666666666,"d":"3197.07"},{"v":3172.7833333333324,"d":"3172.78"},{"v":3137.8666666666663,"d":"3137.87"},{"v":3113.5833333333326,"d":"3113.58"},{"v":3231.983333333332,"d":"3231.98"},{"v":3256.266666666666,"d":"3256.27"},{"v":3291.183333333332,"d":"3291.18"},3221.35,3162.15]
[7,"Nifty Midcap 50",4306.5,{"v":4269.416666666667,"d":"4269.42"},{"v":4226.683333333334,"d":"4226.68"},{"v":4146.866666666668,"d":"4146.87"},{"v":4104.133333333335,"d":"4104.13"},{"v":4349.233333333334,"d":"4349.23"},{"v":4391.966666666665,"d":"4391.97"},{"v":4471.783333333333,"d":"4471.78"},4312.15,4189.6]
[8,"ACC",1467.1,{"v":1452.5,"d":"1452.50"},1431.05,{"v":1395,"d":"1395.00"},1373.55,1488.55,{"v":1509.9999999999998,"d":"1510.00"},1546.05,1473.95,1416.45,12.60259]
[9,"AUBANK",641.25,{"v":645.2333333333332,"d":"645.23"},{"v":635.6666666666665,"d":"635.67"},{"v":630.0833333333333,"d":"630.08"},{"v":620.5166666666665,"d":"620.52"},{"v":650.8166666666665,"d":"650.82"},{"v":660.3833333333333,"d":"660.38"},{"v":665.9666666666665,"d":"665.97"},654.8,639.65,4.66926]
[10,"ADANIPORTS",400.45,{"v":398.2833333333333,"d":"398.28"},{"v":393.7166666666666,"d":"393.72"},{"v":386.9833333333333,"d":"386.98"},{"v":382.4166666666666,"d":"382.42"},{"v":405.0166666666666,"d":"405.02"},{"v":409.5833333333333,"d":"409.58"},{"v":416.3166666666666,"d":"416.32"},402.85,391.55,39.05912]
[11,"ADANIPOWER",60.75,{"v":60.083333333333336,"d":"60.08"},{"v":59.06666666666667,"d":"59.07"},{"v":57.38333333333333,"d":"57.38"},{"v":56.36666666666667,"d":"56.37"},{"v":61.76666666666667,"d":"61.77"},{"v":62.78333333333334,"d":"62.78"},{"v":64.46666666666667,"d":"64.47"},61.1,58.4,95.89622]
{"$rows_left_out":228}
{"sheet":"MidCap Intra","index":3,"n_rows":545,"n_cols":13,"rows_kept":545,"merged":[[0,0,0,1],[8,0,9,0],[8,1,9,1],[8,2,9,2],[8,3,9,3],[8,4,8,6],[8,7,8,9]]}
[]
[]
[]
[]
[{"$nulls":11},"Back To Main Page"]
["FOR INTRA DAY TRADING",{"$nulls":9},{"$f":"Main!B10","v":"2019-10-10"}]
[null,null," "]
[]
["Sr.no","Scrip","CLOSE RATE","Pivot Point","Supports",null,null,"Resistances"]
[null,null,"Point",null,"S1","S2","S3","R1","R2","R3","HIGH","LOW","Total Trade Quanity in Lakhs"]
[1,"3MINDIA",20219.3,{"v":20098.433333333334,"d":"20098.43"},{"v":19906.916666666668,"d":"19906.92"},{"v":19594.533333333333,"d":"19594.53"},{"v":19403.016666666666,"d":"19403.02"},{"v":20410.81666666667,"d":"20410.82"},{"v":20602.333333333332,"d":"20602.33"},{"v":20914.71666666667,"d":"20914.72"},20289.95,19786.05,0.01601]
[2,"ACC",1467.1,{"v":1452.5,"d":"1452.50"},1431.05,{"v":1395,"d":"1395.00"},1373.55,1488.55,{"v":1509.9999999999998,"d":"1510.00"},1546.05,1473.95,1416.45,12.60259]
[3,"AIAENG",1644.35,{"v":1653.3,"d":"1653.30"},{"v":1623.6999999999998,"d":"1623.70"},1603.05,{"v":1573.4499999999998,"d":"1573.45"},{"v":1673.9499999999998,"d":"1673.95"},{"v":1703.5499999999997,"d":"1703.55"},{"v":1724.1999999999998,"d":"1724.20"},1682.9,1632.65,0.05951]
[4,"APLAPOLLO",1369.5,{"v":1356.1000000000001,"d":"1356.10"},{"v":1313.4000000000003,"d":"1313.40"},{"v":1257.3000000000002,"d":"1257.30"},{"v":1214.6000000000004,"d":"1214.60"},{"v":1412.2000000000003,"d":"1412.20"},{"v":1454.9,"d":"1454.90"},{"v":1511.0000000000002,"d":"1511.00"},1398.8,1300,0.22539]
[5,"AUBANK",641.25,{"v":645.2333333333332,"d":"645.23"},{"v":635.6666666666665,"d":"635.67"},{"v":630.0833333333333,"d":"630.08"},{"v":620.5166666666665,"d":"620.52"},{"v":650.8166666666665,"d":"650.82"},{"v":660.3833333333333,"d":"660.38"},{"v":665.9666666666665,"d":"665.97"},654.8,639.65,4.66926]
[6,"AAVAS",1604.05,{"v":1603.2833333333335,"d":"1603.28"},{"v":1591.616666666667,"d":"1591.62"},{"v":1579.1833333333334,"d":"1579.18"},{"v":1567.5166666666669,"d":"1567.52"},{"v":1615.7166666666672,"d":"1615.72"},{"v":1627.3833333333337,"d":"1627.38"},{"v":1639.8166666666673,"d":"1639.82"},1614.95,1590.85,0.12717]
[7,"ABBOTINDIA",10998.6,{"v":10899.533333333333,"d":"10899.53"},{"v":10749.066666666666,"d":"10749.07"},{"v":10499.533333333333,"d":"10499.53"},{"v":10349.066666666666,"d":"10349.07"},{"v":11149.066666666666,"d":"11149.07"},{"v":11299.533333333333,"d":"11299.53"},{"v":11549.066666666666,"d":"11549.07"},11050,10650,0.08536]
[8,"ADANIGAS",136.05,{"v":135.25000000000003,"d":"135.25"},{"v":132.10000000000005,"d":"132.10"},{"v":128.15000000000003,"d":"128.15"},{"v":125.00000000000006,"d":"125.00"},{"v":139.20000000000005,"d":"139.20"},{"v":142.35000000000002,"d":"142.35"},{"v":146.30000000000004,"d":"146.30"},138.4,131.3,17.12612]
[9,"ADANIGREEN",71.45,{"v":71.08333333333333,"d":"71.08"},{"v":67.86666666666666,"d":"67.87"},{"v":64.28333333333333,"d":"64.28"},{"v":61.06666666666666,"d":"61.07"},{"v":74.66666666666666,"d":"74.67"},{"v":77.88333333333333,"d":"77.88"},{"v":81.46666666666665,"d":"81.47"},74.3,67.5,69.42443]
[10,"ADANIPORTS",400.45,{"v":398.2833333333333,"d":"398.28"},{"v":393.7166666666666,"d":"393.72"},{"v":386.9833333333333,"d":"386.98"},{"v":382.4166666666666,"d":"382.42"},{"v":405.0166666666666,"d":"405.02"},{"v":409.5833333333333,"d":"409.58"},{"v":416.3166666666666,"d":"416.32"},402.85,391.55,39.05912]
{"$rows_left_out":513}
{"sheet":"Bulk Deals","index":4,"n_rows":54,"n_cols":8,"rows_kept":54,"merged":[[4,0,4,1],[4,2,4,3],[6,1,6,2]]}
[" "]
[]
[]
[]
[]
[{"$nulls":4},"Back To Main Page"]
["Subject :","BULK DEAL",null,{"$f":"Main!B10","v":"2019-10-10"}]
[]
["Date","Scrip code","Scrip Name","Client Name","Buy / Sell","Quantity Traded","Trade Price / Wt.Avg.trade price","Exchange  "]
["2019-10-09",542580,"AARTECH","SANTOSH KUMAR PANDEY","BUY",{"v":44000,"d":"44,000"},35.88,"BSE"]
["2019-10-09",542580,"AARTECH","NARESHKUMAR JAYANTIBHAI PRAJAPATI","SELL",{"v":44000,"d":"44,000"},35.88,"BSE"]
["2019-10-09",511463,"ALEXANDER","NITINKUMAR GOVINDBHAI SALVE","BUY",{"v":48355,"d":"48,355"},20.87,"BSE"]
["2019-10-09",511463,"ALEXANDER","NITINKUMAR GOVINDBHAI SALVE","SELL",{"v":50000,"d":"50,000"},19.85,"BSE"]
["2019-10-09",542721,"ARL","SAIANAND COMMERCIAL LIMITED","BUY",{"v":80000,"d":"80,000"},33,"BSE"]
["2019-10-09",542721,"ARL","SIMPLEX TRADING & AGENCIES LTD","BUY",{"v":80000,"d":"80,000"},33,"BSE"]
["2019-10-09",542721,"ARL","BHANSALI MAFATLAL KALIDAS(HUF)","SELL",{"v":160000,"d":"160,000"},33,"BSE"]
["2019-10-09",542057,"BCPL","NEWEDGE VINIMAY PRIVATE LIMITED","SELL",{"v":100000,"d":"100,000"},{"v":37.8,"d":"37.80"},"BSE"]
["2019-10-09",542057,"BCPL","SHERWOOD SECURITIES PVT LTD","BUY",{"v":100000,"d":"100,000"},{"v":37.8,"d":"37.80"},"BSE"]
["2019-10-09",532386,"CALSOFT","ARVIND SHANTILAL SHAH","BUY",{"v":70001,"d":"70,001"},9.54,"BSE"]
["2019-10-09",542668,"EVANS","IVOR DESOUZA","BUY",{"v":8000,"d":"8,000"},209.49,"BSE"]
{"$rows_left_out":35}
{"sheet":"Call Tracker (Equity & F&O)","index":5,"n_rows":261,"n_cols":18,"rows_kept":261,"merged":[[70,0,71,0],[70,1,71,1],[70,9,71,9],[70,11,71,11],[70,12,71,12],[70,13,71,13],[70,14,71,14],[72,0,73,0],[72,1,73,1],[72,9,73,9],[72,11,73,11],[72,12,73,12],[72,13,73,13],[72,14,73,14],[74,0,75,0],[74,1,75,1],[74,9,75,9],[74,11,75,11],[74,12,75,12],[74,13,75,13],[74,14,75,14]]}
[]
[]
[]
[]
[{"$nulls":12},"Back To Main Page"]
["Retail Research Technical Calls & Fundamental Performance Report for the month of October-2019 "]
[{"$nulls":12},{"$f":"Main!B10","v":"2019-10-10"}]
[null,"Positional  Call"]
["Sr.no","Date",null,"Company","Rec","Rec Price","Stop Loss***","Call Closed At","Target","Remark","Profit / Loss per Share","Gain / Loss  %","Status","Closed Date","NSE Closed Price"]
[1,"2019-08-30",null,"BIOCON","Buy{}",229.5,214.3,237,"255-260","Part Profit of Rs.7.5/-",{"$f":"H10-F10","v":7.5},{"$f":"K10/F10","v":{"v":0.032679738562091505,"d":"3.27%"}},"Successful","2019-08-30",{"$f":"VLOOKUP(D10,Sheet2!A38:M1677,6,0)","v":233.5},null,null,"R"]
[2,"2019-09-09",null,"TORNTPHARM","Sell",1705,1808,1618,"1560-1540","Profit of Rs.87/-",{"$f":"F11-H11","v":87},{"$f":"K11/F11","v":{"v":0.05102639296187683,"d":"5.10%"}},"Successful","2019-10-01",{"$nulls":3},"R"]
[3,"2019-09-25",null,"AXISBANK","Buy","690-700",628,null,"800-820","Open",{"$nulls":4},{"$f":"VLOOKUP(D12,Sheet2!A41:M1680,6,0)","v":686.3},null,null,"H"]
[4,"2019-09-26",null,"HDFC","Buy","2065-2075",1940,null,"2250-2300","Open",{"$nulls":4},{"$f":"VLOOKUP(D13,Sheet2!A42:M1681,6,0)","v":2002},null,null,"H"]
[5,"2019-09-26",null,"BANKBARODA","Buy",96,89,89.5,"110-114","Loss of Rs.6.5/-",{"$f":"H14-F14","v":-6.5},{"$f":"K14/F14","v":{"v":-0.06770833333333333,"d":"-6.77%"}},"UnSuccessful","2019-10-01",{"$nulls":3},"H"]
[6,"2019-09-30",null,"BPCL","Sell",475,510,503,"420-410","Loss of Rs.28/-",{"$f":"F15-H15","v":-28},{"v":-0.05894736842105263,"d":"-5.89%"},"UnSuccessful","2019-10-03",{"$nulls":3},"H"]
[7,"2019-10-01",null,"CUMMINSIND","Buy","574-579",530,null,"640-660","Open",{"$nulls":4},{"$f":"VLOOKUP(D16,Sheet2!A46:M1685,6,0)","v":568.4},null,null,"H"]
[8,"2019-10-01",null,"UPL","Buy","592-598",564,null,"650-660","Open",{"$nulls":4},{"$f":"VLOOKUP(D17,Sheet2!A47:M1686,6,0)","v":581.7},null,null,"R"]
[9,"2019-10-03",null,"HEIDELBERG","Buy",183,169,189,"205-210","Part Profit of Rs.6/-",{"$f":"H18-F18","v":6},{"$f":"K18/F18","v":{"v":0.03278688524590164,"d":"3.28%"}},"Successful","2019-10-09",{"$f":"VLOOKUP(D18,Sheet2!A48:M1687,6,0)","v":185},null,null,"H"]
[10,"2019-10-03",null,"APOLLOHOSP","Buy",1378.5,1286,1420,"1550-1580","Part Profit of Rs.41.5/-",{"$f":"H19-F19","v":41.5},{"$f":"K19/F19","v":{"v":0.03010518679724338,"d":"3.01%"}},"Successful","2019-10-04",{"$f":"VLOOKUP(D19,Sheet2!A49:M1688,6,0)","v":1425.05},null,null,"R"]
[11,"2019-10-04",null,"HDFCAMC","Buy",2665,2537,2755,"2930-2960","Part Profit of Rs.90/-",{"$f":"H20-F20","v":90},{"$f":"K20/F20","v":{"v":0.03377110694183865,"d":"3.38%"}},"Successful","2019-10-07",{"$f":"VLOOKUP(D20,Sheet2!A50:M1689,6,0)","v":2708.35},null,null,"R"]
{"$rows_left_out":221}
{"sheet":"Sheet2","index":6,"n_rows":1899,"n_cols":14,"rows_kept":1899,"hidden":true}
["SYMBOL","SERIES","OPEN","HIGH","LOW","CLOSE","LAST","PREVCLOSE","TOTTRDQTY","TOTTRDVAL","TIMESTAMP","TOTALTRADES","ISIN","ISIN"]
["20MICRONS","EQ",39,39.75,38,38.9,39,38.2,33681,1308879.75,"2019-10-09",657,"INE144J01027"]
["21STCENMGM","EQ",13.2,13.2,12.95,12.95,12.95,13.2,1248,16336.6,"2019-10-09",5,"INE253B01015"]
["3IINFOTECH","EQ",2,2.25,1.95,2.1,2.1,2,1872066,3868659.55,"2019-10-09",650,"INE748C01020"]
["3MINDIA","EQ",19998,20289.95,19786.05,20219.3,20260,19841.4,1601,32145157.25,"2019-10-09",712,"INE470A01017"]
["5PAISA","EQ",161.2,170.9,155,165.85,170.9,162.8,7114,1148381.35,"2019-10-09",312,"INE618L01018"]
["63MOONS","EQ",118.4,126.4,116.85,120.45,119.8,117.1,232365,28405863.9,"2019-10-09",4826,"INE111B01023"]
["A2ZINFRA","EQ",9.6,9.8,8.95,9.65,9.65,9.55,391050,3613320.95,"2019-10-09",677,"INE619I01012"]
["AARTIDRUGS","EQ",456.8,462.3,452.15,460.15,462.1,456.6,5663,2596493.05,"2019-10-09",832,"INE767A01016"]
["AARTIIND","EQ",758.3,779,746,759.75,757.05,753.6,133905,101461638.45,"2019-10-09",5028,"INE769A01020"]
["AARVEEDEN","EQ",15,15.2,14.3,14.65,14.4,15.1,6510,98254.7,"2019-10-09",79,"INE273D01019"]
["AAVAS","EQ",1609,1614.95,1590.85,1604.05,1610,1599.05,12717,20371293,"2019-10-09",2085,"INE216P01012"]
["ABAN","BE",25.45,27.45,25.1,25.15,25.1,26.4,32905,839132.65,"2019-10-09",358,"INE421A01028"]
["ABB","EQ",1474.9,1509.4,1465.5,1486,1490,1465.75,93666,139637578.5,"2019-10-09",5714,"INE117A01022"]
["ABBOTINDIA","EQ",10742.1,11050,10650,10998.6,10960,10662,8536,92952911.1,"2019-10-09",1840,"INE358A01014"]
["ABCAPITAL","EQ",78.7,81.45,78.1,79.4,79.5,78.5,1268265,100581619.3,"2019-10-09",19488,"INE674K01013"]
["ABFRL","EQ",206.05,209.55,204.6,208.1,207.6,207.45,313571,65229732.75,"2019-10-09",6335,"INE647O01011"]
["ABSLNN50ET","EQ",265.07,267.18,265.07,267.18,267.18,265.7,3,797.32,"2019-10-09",3,"INF209KB1B87"]
["ACC","EQ",1430,1473.95,1416.45,1467.1,1469.3,1435.1,1260259,1821686699.25,"2019-10-09",51936,"INE012A01025"]
["ACCELYA","EQ",852.5,862,852.5,856.35,859.95,854.05,1974,1691395,"2019-10-09",296,"INE793A01012"]
{"$rows_left_out":1701}
{"sheet":"Sheet1","index":7,"n_rows":0,"n_cols":0,"rows_kept":0,"hidden":true}

{"sheet":"Sheet3","index":8,"n_rows":0,"n_cols":0,"rows_kept":0,"hidden":true}

{"sheet":"Sheet4","index":9,"n_rows":0,"n_cols":0,"rows_kept":0,"hidden":true}

{"sheet":"Sheet5","index":10,"n_rows":0,"n_cols":0,"rows_kept":0,"hidden":true}