{"text_format":"3","workbook":"xlsx","n_sheets":10,"sheets":["Main","Future Intra","Cash Intra","MidCap Intra","Bulk Deals","Call Tracker (Equity & F&O)","Sheet2","Sheet1","Sheet3","Sheet4"],"not_rendered":{"images":4,"defined_names":4},"read":"whole","date_system":"1900"}

{"sheet":"Main","index":0,"n_rows":27,"n_cols":11,"rows_kept":27}
[null,"                                                                                                 "]
{"$rows_empty":8}
[null,"2019-07-10"]
[]
[null,"Sheet No.","Template Name","Summary"]
[null,1,"Future Intra","For Intraday trading in F&O segment"]
[null,2,"Cash Intra","For Intraday trading in cash market segment"]
[null,3,"Mid-cap Intra","For Intraday trading in Mid-cap stocks"]
[null,4,"Bulk Deals","Reveals Bulk Deals carried on NSE & BSE"]
[null,5,"Call Tracker"]
{"$rows_empty":9}
[{"$nulls":10},"`"]

{"sheet":"Future Intra","index":1,"n_rows":236,"n_cols":15,"rows_kept":236,"merged":[[8,0,9,0],[8,1,9,1],[8,2,9,2],[8,5,8,7],[8,8,8,10]]}
[]
[]
[]
[]
[{"$nulls":12},"Back to Main Page"]
["FOR INTRA DAY TRADING",{"$nulls":10},{"$f":"Main!B10","v":"2019-07-10"}]
[]
[]
["Sr.no","Sector","Scrip","CLOSE RATE","Pivot Point","Supports",null,null,"Resistances"]
[null,"Sector",null,"Point","Point","S1","S2","S3","R1","R2","R3","HIGH","LOW","OI","% Change in OI"]
[1,"Index","BANKNIFTY",30639.65,30623.55,{"v":30467.1,"d":"30467.10"},30294.55,{"v":30138.1,"d":"30138.10"},{"v":30796.1,"d":"30796.10"},{"v":30952.550000000003,"d":"30952.55"},{"v":31125.1,"d":"31125.10"},30780,30451,1891840,{"v":-0.036329183561197256,"d":"-3.63%"}]
[2,"Index","NIFTY",{"v":11552.6,"d":"11552.60"},{"v":11544.416666666666,"d":"11544.42"},{"v":11494.733333333332,"d":"11494.73"},{"v":11436.866666666665,"d":"11436.87"},{"v":11387.18333333333,"d":"11387.18"},{"v":11602.283333333333,"d":"11602.28"},{"v":11651.966666666667,"d":"11651.97"},{"v":11709.833333333334,"d":"11709.83"},11594.1,11486.55,20935350,{"v":0.03919823982070594,"d":"3.92%"}]
[3,"Index","NIFTYIT",{"v":15297,"d":"15297.00"},{"v":15310,"d":"15310.00"},{"v":15187,"d":"15187.00"},{"v":15077,"d":"15077.00"},{"v":14954,"d":"14954.00"},{"v":15420,"d":"15420.00"},{"v":15543,"d":"15543.00"},{"v":15653,"d":"15653.00"},15433,15200,21700,{"v":0.014018691588785047,"d":"1.40%"}]
[4,"Cement","ACC",1551.75,1531.55,{"v":1506.6499999999999,"d":"1506.65"},1461.55,{"v":1436.6499999999999,"d":"1436.65"},{"v":1576.6499999999999,"d":"1576.65"},1601.55,{"v":1646.6499999999999,"d":"1646.65"},1556.45,1486.45,1918400,{"v":-0.021823373444829697,"d":"-2.18%"}]
[5,"Others","ADANIENT",{"v":141.2,"d":"141.20"},{"v":140.04999999999998,"d":"140.05"},{"v":136.99999999999997,"d":"137.00"},{"v":132.79999999999998,"d":"132.80"},{"v":129.74999999999997,"d":"129.75"},{"v":144.24999999999997,"d":"144.25"},{"v":147.29999999999998,"d":"147.30"},{"v":151.49999999999997,"d":"151.50"},143.1,135.85,29076000,{"v":-2.6070252469813393E-3,"d":"-0.26%"}]
[6,"Others","ADANIPORTS",{"v":405.7,"d":"405.70"},{"v":402.1666666666667,"d":"402.17"},{"v":397.6333333333334,"d":"397.63"},{"v":389.5666666666667,"d":"389.57"},{"v":385.0333333333334,"d":"385.03"},{"v":410.23333333333335,"d":"410.23"},{"v":414.76666666666665,"d":"414.77"},{"v":422.8333333333333,"d":"422.83"},406.7,394.1,15005000,{"v":-0.019601437438745508,"d":"-1.96%"}]
[7,"Power","ADANIPOWER",{"v":67.5,"d":"67.50"},{"v":65.86666666666667,"d":"65.87"},{"v":62.68333333333335,"d":"62.68"},{"v":57.866666666666674,"d":"57.87"},{"v":54.68333333333335,"d":"54.68"},{"v":70.68333333333335,"d":"70.68"},{"v":73.86666666666669,"d":"73.87"},{"v":78.68333333333335,"d":"78.68"},69.05,61.05,138700000,{"v":0.036002390200179264,"d":"3.60%"}]
[8,"Automobile","AMARAJABAT",{"v":638.6,"d":"638.60"},{"v":633.7333333333333,"d":"633.73"},{"v":626.8666666666667,"d":"626.87"},{"v":615.1333333333333,"d":"615.13"},{"v":608.2666666666667,"d":"608.27"},{"v":645.4666666666667,"d":"645.47"},{"v":652.3333333333335,"d":"652.33"},{"v":664.0666666666667,"d":"664.07"},640.6,622,1129100,{"v":6.2034739454094293E-4,"d":"0.06%"}]
[9,"Cement","AMBUJACEM",{"v":211.9,"d":"211.90"},{"v":209.70000000000002,"d":"209.70"},{"v":206.80000000000004,"d":"206.80"},{"v":201.70000000000002,"d":"201.70"},{"v":198.80000000000004,"d":"198.80"},{"v":214.80000000000004,"d":"214.80"},{"v":217.70000000000002,"d":"217.70"},{"v":222.80000000000004,"d":"222.80"},212.6,204.6,16812500,{"v":4.4629574531389468E-4,"d":"0.04%"}]
[10,"Others","APOLLOHOSP",1334.15,{"v":1332.9666666666667,"d":"1332.97"},{"v":1307.7833333333333,"d":"1307.78"},{"v":1281.4166666666665,"d":"1281.42"},{"v":1256.2333333333331,"d":"1256.23"},{"v":1359.3333333333335,"d":"1359.33"},{"v":1384.5166666666669,"d":"1384.52"},{"v":1410.8833333333337,"d":"1410.88"},1358.15,1306.6,1623000,{"v":3.0816640986132513E-4,"d":"0.03%"}]
{"$rows_left_out":172}
{"sheet":"Cash Intra","index":2,"n_rows":247,"n_cols":13,"rows_kept":247,"merged":[[7,0,8,0],[7,1,8,1],[7,2,8,2],[7,3,8,3],[7,4,7,6],[7,7,7,9]]}
[]
[]
[]
[]
[{"$nulls":12},"Back to Main Page"]
["FOR INTRA DAY TRADING",{"$nulls":9},{"$f":"Main!B10","v":"2019-07-10"}]
[]
["Sr.no","Scrip","CLOSE RATE","Pivot Point","Supports",null,null,"Resistances"]
[null,null,"Point",null,"S1","S2","S3","R1","R2","R3","HIGH","LOW","Total Trade Quanity in Lakhs"]
[1,"Nifty 50",11555.9,11533.15,11483.75,{"v":11411.6,"d":"11411.60"},{"v":11362.2,"d":"11362.20"},{"v":11605.3,"d":"11605.30"},{"v":11654.699999999997,"d":"11654.70"},{"v":11726.849999999999,"d":"11726.85"},11582.55,11461]
[2,"Nifty Bank",30569.15,{"v":30539.316666666666,"d":"30539.32"},{"v":30376.533333333333,"d":"30376.53"},{"v":30183.916666666668,"d":"30183.92"},{"v":30021.133333333335,"d":"30021.13"},{"v":30731.93333333333,"d":"30731.93"},{"v":30894.716666666664,"d":"30894.72"},{"v":31087.33333333333,"d":"31087.33"},30702.1,30346.7]
[3,"Nifty CPSE",2188.6,{"v":2184.733333333333,"d":"2184.73"},{"v":2161.416666666666,"d":"2161.42"},{"v":2134.233333333333,"d":"2134.23"},{"v":2110.916666666666,"d":"2110.92"},{"v":2211.916666666666,"d":"2211.92"},{"v":2235.2333333333327,"d":"2235.23"},{"v":2262.416666666666,"d":"2262.42"},2208.05,2157.55]
[4,"Nifty Infra",3314.1,{"v":3294.9833333333336,"d":"3294.98"},{"v":3271.166666666667,"d":"3271.17"},{"v":3228.2333333333336,"d":"3228.23"},{"v":3204.416666666667,"d":"3204.42"},{"v":3337.916666666667,"d":"3337.92"},{"v":3361.7333333333336,"d":"3361.73"},{"v":3404.666666666667,"d":"3404.67"},3318.8,3252.05]
[5,"Nifty IT",15254.5,{"v":15270.699999999999,"d":"15270.70"},{"v":15107.399999999998,"d":"15107.40"},{"v":14960.3,"d":"14960.30"},{"v":14796.999999999998,"d":"14797.00"},{"v":15417.799999999997,"d":"15417.80"},{"v":15581.099999999997,"d":"15581.10"},{"v":15728.199999999997,"d":"15728.20"},15434,15123.6]
[6,"Nifty PSE",3437.9,{"v":3433.0499999999997,"d":"3433.05"},{"v":3408.4999999999995,"d":"3408.50"},{"v":3379.1,"d":"3379.10"},{"v":3354.5499999999997,"d":"3354.55"},{"v":3462.4499999999994,"d":"3462.45"},{"v":3486.9999999999995,"d":"3487.00"},{"v":3516.399999999999,"d":"3516.40"},3457.6,3403.65]
[7,"Nifty Midcap 50",4733.25,{"v":4713.333333333333,"d":"4713.33"},{"v":4685.266666666666,"d":"4685.27"},{"v":4637.283333333334,"d":"4637.28"},{"v":4609.216666666667,"d":"4609.22"},{"v":4761.316666666666,"d":"4761.32"},{"v":4789.383333333333,"d":"4789.38"},{"v":4837.366666666665,"d":"4837.37"},4741.4,4665.35]
[8,"ABB",1531.6,{"v":1521.3666666666668,"d":"1521.37"},{"v":1484.7333333333336,"d":"1484.73"},{"v":1437.8666666666668,"d":"1437.87"},{"v":1401.2333333333336,"d":"1401.23"},{"v":1568.2333333333336,"d":"1568.23"},{"v":1604.8666666666668,"d":"1604.87"},{"v":1651.7333333333336,"d":"1651.73"},1558,1474.5,2.02265]
[9,"ACC",1554.3,{"v":1531.5833333333333,"d":"1531.58"},{"v":1503.3666666666666,"d":"1503.37"},{"v":1452.4333333333334,"d":"1452.43"},{"v":1424.2166666666667,"d":"1424.22"},{"v":1582.5166666666664,"d":"1582.52"},{"v":1610.7333333333331,"d":"1610.73"},{"v":1661.6666666666663,"d":"1661.67"},1559.8,1480.65,9.03575]
[10,"AUBANK",663.8,{"v":670.9333333333333,"d":"670.93"},{"v":652.8666666666666,"d":"652.87"},{"v":641.9333333333333,"d":"641.93"},{"v":623.8666666666666,"d":"623.87"},{"v":681.8666666666666,"d":"681.87"},{"v":699.9333333333334,"d":"699.93"},{"v":710.8666666666666,"d":"710.87"},689,660,1.82166]
[11,"ADANIPORTS",405,{"v":401.2166666666667,"d":"401.22"},{"v":396.4333333333334,"d":"396.43"},{"v":387.8666666666667,"d":"387.87"},{"v":383.08333333333337,"d":"383.08"},{"v":409.7833333333334,"d":"409.78"},{"v":414.5666666666667,"d":"414.57"},{"v":423.13333333333344,"d":"423.13"},406,392.65,19.5228]
{"$rows_left_out":228}
{"sheet":"MidCap Intra","index":3,"n_rows":545,"n_cols":13,"rows_kept":545,"merged":[[0,0,0,1],[8,0,9,0],[8,1,9,1],[8,2,9,2],[8,3,9,3],[8,4,8,6],[8,7,8,9]]}
[]
[]
[]
[]
[{"$nulls":11},"Back To Main Page"]
["FOR INTRA DAY TRADING",{"$nulls":9},{"$f":"Main!B10","v":"2019-07-10"}]
[null,null," "]
[]
["Sr.no","Scrip","CLOSE RATE","Pivot Point","Supports",null,null,"Resistances"]
[null,null,"Point",null,"S1","S2","S3","R1","R2","R3","HIGH","LOW","Total Trade Quanity in Lakhs"]
[1,"3MINDIA",21848.55,{"v":21949.466666666664,"d":"21949.47"},{"v":21699.08333333333,"d":"21699.08"},{"v":21549.616666666665,"d":"21549.62"},{"v":21299.23333333333,"d":"21299.23"},{"v":22098.933333333327,"d":"22098.93"},{"v":22349.316666666666,"d":"22349.32"},{"v":22498.783333333326,"d":"22498.78"},22199.85,21800,0.02673]
[2,"ABB",1531.6,{"v":1521.3666666666668,"d":"1521.37"},{"v":1484.7333333333336,"d":"1484.73"},{"v":1437.8666666666668,"d":"1437.87"},{"v":1401.2333333333336,"d":"1401.23"},{"v":1568.2333333333336,"d":"1568.23"},{"v":1604.8666666666668,"d":"1604.87"},{"v":1651.7333333333336,"d":"1651.73"},1558,1474.5,2.02265]
[3,"ACC",1554.3,{"v":1531.5833333333333,"d":"1531.58"},{"v":1503.3666666666666,"d":"1503.37"},{"v":1452.4333333333334,"d":"1452.43"},{"v":1424.2166666666667,"d":"1424.22"},{"v":1582.5166666666664,"d":"1582.52"},{"v":1610.7333333333331,"d":"1610.73"},{"v":1661.6666666666663,"d":"1661.67"},1559.8,1480.65,9.03575]
[4,"AIAENG",1775.3,{"v":1783.4166666666667,"d":"1783.42"},{"v":1756.8833333333334,"d":"1756.88"},{"v":1738.4666666666667,"d":"1738.47"},{"v":1711.9333333333334,"d":"1711.93"},{"v":1801.8333333333335,"d":"1801.83"},{"v":1828.3666666666668,"d":"1828.37"},{"v":1846.7833333333335,"d":"1846.78"},1809.95,1765,0.11388]
[5,"APLAPOLLO",1597.95,{"v":1599.6333333333332,"d":"1599.63"},{"v":1568.3166666666664,"d":"1568.32"},{"v":1538.6833333333332,"d":"1538.68"},{"v":1507.3666666666663,"d":"1507.37"},{"v":1629.2666666666664,"d":"1629.27"},{"v":1660.583333333333,"d":"1660.58"},{"v":1690.2166666666665,"d":"1690.22"},1630.95,1570,0.52676]
[6,"AUBANK",663.8,{"v":670.9333333333333,"d":"670.93"},{"v":652.8666666666666,"d":"652.87"},{"v":641.9333333333333,"d":"641.93"},{"v":623.8666666666666,"d":"623.87"},{"v":681.8666666666666,"d":"681.87"},{"v":699.9333333333334,"d":"699.93"},{"v":710.8666666666666,"d":"710.87"},689,660,1.82166]
[7,"AAVAS",1496.65,{"v":1507.2166666666665,"d":"1507.22"},{"v":1474.433333333333,"d":"1474.43"},{"v":1452.2166666666665,"d":"1452.22"},{"v":1419.433333333333,"d":"1419.43"},{"v":1529.433333333333,"d":"1529.43"},{"v":1562.2166666666662,"d":"1562.22"},{"v":1584.433333333333,"d":"1584.43"},1540,1485,0.74064]
[8,"ADANIGREEN",49.6,{"v":48.21666666666667,"d":"48.22"},{"v":44.63333333333334,"d":"44.63"},{"v":39.66666666666667,"d":"39.67"},{"v":36.08333333333334,"d":"36.08"},{"v":53.18333333333334,"d":"53.18"},{"v":56.766666666666666,"d":"56.77"},{"v":61.733333333333334,"d":"61.73"},51.8,43.25,58.77043]
[9,"ADANIPORTS",405,{"v":401.2166666666667,"d":"401.22"},{"v":396.4333333333334,"d":"396.43"},{"v":387.8666666666667,"d":"387.87"},{"v":383.08333333333337,"d":"383.08"},{"v":409.7833333333334,"d":"409.78"},{"v":414.5666666666667,"d":"414.57"},{"v":423.13333333333344,"d":"423.13"},406,392.65,19.5228]
[10,"ADANIPOWER",67.15,{"v":65.56666666666666,"d":"65.57"},{"v":62.383333333333326,"d":"62.38"},{"v":57.61666666666666,"d":"57.62"},{"v":54.43333333333332,"d":"54.43"},{"v":70.33333333333333,"d":"70.33"},{"v":73.51666666666667,"d":"73.52"},{"v":78.28333333333333,"d":"78.28"},68.75,60.8,516.54011]
{"$rows_left_out":513}
{"sheet":"Bulk Deals","index":4,"n_rows":57,"n_cols":8,"rows_kept":57,"merged":[[4,0,4,1],[4,2,4,3],[6,1,6,2]]}
[" "]
[]
[]
[]
[]
[{"$nulls":4},"Back To Main Page"]
["Subject :","BULK DEAL",null,{"$f":"Main!B10","v":"2019-07-10"}]
[]
["Date","Scrip code","Scrip Name","Client Name","Buy / Sell","Quantity Traded","Trade Price / Wt.Avg.trade price","Exchange  "]
["2019-07-09",537766,"BCP","DEEPEN BHARAT SHAH","SELL",{"v":350500,"d":"350,500"},44.83,"BSE"]
["2019-07-09",537766,"BCP","SIDDHARTH CHIMANLAL SHAH","BUY",{"v":350500,"d":"350,500"},44.83,"BSE"]
["2019-07-09",537766,"BCP","INDIAN BOBBIN MANUFACTURING COMPANY PRIVATE LIMITED","BUY",{"v":365483,"d":"365,483"},44.89,"BSE"]
["2019-07-09",537766,"BCP","INDIAN BOBBIN MANUFACTURING COMPANY PRIVATE LIMITED","SELL",{"v":365483,"d":"365,483"},44.92,"BSE"]
["2019-07-09",542724,"EARUM","SMIRAL ASHWINKUMAR PATEL","SELL",{"v":45000,"d":"45,000"},34.22,"BSE"]
["2019-07-09",540519,"MEERA","ARYAMAN BROKING LIMITED","BUY",{"v":32000,"d":"32,000"},222.63,"BSE"]
["2019-07-09",540519,"MEERA","ARYAMAN BROKING LIMITED","SELL",{"v":6000,"d":"6,000"},223.9,"BSE"]
["2019-07-09",540519,"MEERA","BABULAL VADILAL SHAH","SELL",{"v":22500,"d":"22,500"},221.58,"BSE"]
["2019-07-09",538446,"MONEYBOXX","MONEYBOXX CAPITAL PRIVATE LIMITED","BUY",{"v":90000,"d":"90,000"},22.96,"BSE"]
["2019-07-09",530733,"NOVAPUB","JAYABEN SHIVABHAI PATEL","BUY",{"v":19500,"d":"19,500"},{"v":15.9,"d":"15.90"},"BSE"]
["2019-07-09",541112,"SHREESHAY","ARYAMAN BROKING LIMITED","SELL",{"v":112000,"d":"112,000"},16.8,"BSE"]
{"$rows_left_out":38}
{"sheet":"Call Tracker (Equity & F&O)","index":5,"n_rows":279,"n_cols":20,"rows_kept":279,"merged":[[75,0,76,0],[75,1,76,1],[75,9,76,9],[75,11,76,11],[75,12,76,12],[75,13,76,13],[75,14,76,14],[75,17,76,17],[78,0,79,0],[78,1,79,1],[78,9,79,9],[78,11,79,11],[78,12,79,12],[78,13,79,13],[78,14,79,14],[78,17,79,17]]}
[]
[]
[]
[]
[{"$nulls":12},"Back To Main Page"]
["Retail Research Technical Calls & Fundamental Performance Report for the month of July-2019 "]
[{"$nulls":12},{"$f":"Main!B10","v":"2019-07-10"}]
[null,"Positional  Call"]
["Sr.no","Date",null,"Company","Rec","Rec Price","Stop Loss***","Call Closed At","Target","Remark","Profit / Loss per Share","Gain / Loss  %","Status","Closed Date","NSE Closed Price"]
[1,"2019-05-27",null,"TATAELXSI","Buy",874,818.7,915,"970-990","Part Profit of Rs.41 /-",{"$f":"H10-F10","v":41},{"$f":"K10/F10","v":{"v":0.04691075514874142,"d":"4.69%"}},"Successful","2019-07-02",{"$nulls":3},"R"]
[2,"2019-05-28",null,"BAJAJFINSV","Sell",8175,8625,7925,7300,"Profit of Rs.250/-",{"$f":"F11-H11","v":250},{"v":0.03058103975535168,"d":"3.06%"},"Successful","2019-07-08",{"$nulls":3},"H"]
[3,"2019-05-31",null,"ITC","Buy","285-287",268.3,null,"315-325","Open",{"$nulls":4},{"$f":"VLOOKUP(D12,Sheet2!A61:M1856,6,0)","v":273.1},null,null,"R"]
[4,"2019-06-13",null,"GODREJCP","Buy","675-680",644,null,"740-750","Open",{"$nulls":4},{"$f":"VLOOKUP(D13,Sheet2!A66:M1861,6,0)","v":646.75},null,null,"H"]
[5,"2019-06-17",null,"SUNTV","Buy",517,476,507,"575-585","Loss of Rs.10/-",{"$f":"H14-F14","v":-10},{"$f":"K14/F14","v":{"v":-0.019342359767891684,"d":"-1.93%"}},"Unsuccessful","2019-07-08",{"$nulls":3},"R"]
[6,"2019-06-21",null,"AJANTPHARM","Buy","950-960",897.7,null,"1060-1080","Open",{"$nulls":4},{"$f":"VLOOKUP(D15,Sheet2!A2:M1641,6,0)","v":916.2},null,null,"R"]
[7,"2019-06-24",null,"ESCORTS","Buy",549.5,518,545.25,600,"Loss of Rs.4.25/-",-4.25,{"v":-7.7343039126478615E-3,"d":"-0.77%"},"Neutral","2019-07-08",{"$nulls":3},"H"]
[8,"2019-06-25",null,"JUBLFOOD","Buy","1260-1265",1158.3,null,"1450 -1470","Open",{"$nulls":4},{"$f":"VLOOKUP(D17,Sheet2!A4:M1643,6,0)","v":1221.75},null,null,"R"]
[9,"2019-07-04",null,"TORNTPHARM","Buy","1540-1550",1454,null,"1730-1750","Open",{"$nulls":4},{"$f":"VLOOKUP(D18,Sheet2!A5:M1644,6,0)","v":1546.25},null,null,"R"]
[]
[]
{"$rows_left_out":260}
{"sheet":"Sheet2","index":6,"n_rows":1631,"n_cols":14,"rows_kept":1631,"hidden":true}
["SYMBOL","SERIES","OPEN","HIGH","LOW","CLOSE","LAST","PREVCLOSE","TOTTRDQTY","TOTTRDVAL","TIMESTAMP","TOTALTRADES","ISIN","ISIN"]
["20MICRONS","EQ",37.85,37.85,36.2,36.55,36.95,36.1,11739,430723.85,"2019-07-09",256,"INE144J01027"]
["21STCENMGM","EQ",17.6,17.6,17.6,17.6,17.6,17.95,56,985.6,"2019-07-09",3,"INE253B01015"]
["3IINFOTECH","EQ",3.1,3.3,3,3.25,3.3,3.1,1359862,4305505.25,"2019-07-09",519,"INE748C01020"]
["3MINDIA","EQ",22021.05,22199.85,21800,21848.55,21851,22108.35,2673,58768399.45,"2019-07-09",997,"INE470A01017"]
["3PLAND","EQ",7.95,8.3,7.9,8.3,8.3,8.3,845,6729.1,"2019-07-09",8,"INE105C01023"]
["5PAISA","EQ",220,223.9,215,222.2,223.65,221.7,1571,346560.35,"2019-07-09",134,"INE618L01018"]
["63MOONS","EQ",100,101.6,96.8,97.1,97,101.6,231028,22948912.1,"2019-07-09",2033,"INE111B01023"]
["8KMILES","EQ",88.9,89.8,84,85.35,85.85,87.75,112976,9728950.15,"2019-07-09",2052,"INE650K01021"]
["A2ZINFRA","EQ",10.6,11.25,10.6,10.95,10.9,10.95,121245,1335196.55,"2019-07-09",323,"INE619I01012"]
["AARTIDRUGS","EQ",506.25,529,506.25,524.75,529,509.3,6511,3368714.25,"2019-07-09",845,"INE767A01016"]
["AARTIIND","BE",1733.05,1733.05,1655.25,1672.8,1687,1733.05,82038,138090382,"2019-07-09",3259,"INE769A01020"]
["AARVEEDEN","EQ",17.9,19.95,17.15,18.85,19.1,18.15,2128,39394.65,"2019-07-09",61,"INE273D01019"]
["AAVAS","EQ",1513.9,1540,1485,1496.65,1489,1498.15,74064,112015111.35,"2019-07-09",3541,"INE216P01012"]
["ABAN","EQ",34.1,37.4,33.9,37.4,37.4,35.65,47379,1715772.1,"2019-07-09",613,"INE421A01028"]
["ABB","EQ",1485.1,1558,1474.5,1531.6,1524,1482.2,202265,310523502.35,"2019-07-09",10534,"INE117A01022"]
["ABBOTINDIA","EQ",8790,8790,8630.05,8735.4,8750,8677,1880,16362499.1,"2019-07-09",518,"INE358A01014"]
["ABCAPITAL","EQ",89.1,91,88.1,89.9,89.9,89.1,986561,88762829.95,"2019-07-09",19058,"INE674K01013"]
["ABFRL","EQ",209.95,210.1,202.2,203.3,203.4,210.25,304285,62345769.75,"2019-07-09",16088,"INE647O01011"]
["ABSLNN50ET","EQ",273.8,273.8,267,268,268,283.63,5,1345.12,"2019-07-09",5,"INF209KB1B87"]
{"$rows_left_out":1612}
{"sheet":"Sheet1","index":7,"n_rows":0,"n_cols":0,"rows_kept":0,"hidden":true}

{"sheet":"Sheet3","index":8,"n_rows":0,"n_cols":0,"rows_kept":0,"hidden":true}

{"sheet":"Sheet4","index":9,"n_rows":0,"n_cols":0,"rows_kept":0,"hidden":true}