{"text_format":"3","workbook":"xlsx","n_sheets":11,"sheets":["Main","Future Intra","Cash Intra","MidCap Intra","Bulk Deals","Call Tracker (Equity & F&O)","Sheet2","Sheet1","Sheet3","Sheet4","Sheet5"],"not_rendered":{"images":4,"defined_names":5},"read":"whole","date_system":"1900"}

{"sheet":"Main","index":0,"n_rows":27,"n_cols":11,"rows_kept":27}
[null,"                                                                                                 "]
{"$rows_empty":8}
[null,"2019-12-09"]
[]
[null,"Sheet No.","Template Name","Summary"]
[null,1,"Future Intra","For Intraday trading in F&O segment"]
[null,2,"Cash Intra","For Intraday trading in cash market segment"]
[null,3,"Mid-cap Intra","For Intraday trading in Mid-cap stocks"]
[null,4,"Bulk Deals","Reveals Bulk Deals carried on NSE & BSE"]
[null,5,"Call Tracker"]
{"$rows_empty":9}
[{"$nulls":10},"`"]

{"sheet":"Future Intra","index":1,"n_rows":193,"n_cols":15,"rows_kept":193,"merged":[[8,0,9,0],[8,1,9,1],[8,2,9,2],[8,5,8,7],[8,8,8,10]]}
[]
[]
[]
[]
[{"$nulls":12},"Back to Main Page"]
["FOR INTRA DAY TRADING",{"$nulls":10},{"$f":"Main!B10","v":"2019-12-09"}]
[]
[]
["Sr.no","Sector","Scrip","CLOSE RATE","Pivot Point","Supports",null,null,"Resistances"]
[null,"Sector",null,"Point","Point","S1","S2","S3","R1","R2","R3","HIGH","LOW","OI","% Change in OI"]
[1,"Index","BANKNIFTY",{"v":31418.3,"d":"31418.30"},{"v":31555.433333333334,"d":"31555.43"},{"v":31185.86666666667,"d":"31185.87"},{"v":30953.433333333334,"d":"30953.43"},{"v":30583.86666666667,"d":"30583.87"},{"v":31787.86666666667,"d":"31787.87"},{"v":32157.433333333334,"d":"32157.43"},{"v":32389.86666666667,"d":"32389.87"},31925,31323,1527040,{"v":-0.08526518827349076,"d":"-8.53%"}]
[2,"Index","NIFTY",{"v":11955.7,"d":"11955.70"},{"v":11989.566666666666,"d":"11989.57"},{"v":11897.133333333331,"d":"11897.13"},{"v":11838.566666666666,"d":"11838.57"},{"v":11746.133333333331,"d":"11746.13"},{"v":12048.133333333331,"d":"12048.13"},{"v":12140.566666666666,"d":"12140.57"},{"v":12199.133333333331,"d":"12199.13"},12082,11931,13993050,{"v":0.023063256711703808,"d":"2.31%"}]
[3,"Index","NIFTYIT",{"v":15378,"d":"15378.00"},{"v":15399.666666666666,"d":"15399.67"},{"v":15324.333333333332,"d":"15324.33"},{"v":15270.666666666666,"d":"15270.67"},{"v":15195.333333333332,"d":"15195.33"},{"v":15453.333333333332,"d":"15453.33"},{"v":15528.666666666664,"d":"15528.67"},{"v":15582.333333333332,"d":"15582.33"},15475,15346,7450,{"v":-0.06875,"d":"-6.88%"}]
[4,"Cement","ACC",{"v":1484.2,"d":"1484.20"},{"v":1484.5166666666667,"d":"1484.52"},{"v":1465.1833333333334,"d":"1465.18"},{"v":1446.1666666666667,"d":"1446.17"},{"v":1426.8333333333335,"d":"1426.83"},{"v":1503.5333333333333,"d":"1503.53"},{"v":1522.8666666666668,"d":"1522.87"},{"v":1541.8833333333332,"d":"1541.88"},1503.85,1465.5,3176000,{"v":-0.011946241911398706,"d":"-1.19%"}]
[5,"Others","ADANIENT",206.95,{"v":207.71666666666667,"d":"207.72"},{"v":204.73333333333335,"d":"204.73"},{"v":202.51666666666668,"d":"202.52"},{"v":199.53333333333336,"d":"199.53"},{"v":209.93333333333334,"d":"209.93"},{"v":212.91666666666663,"d":"212.92"},{"v":215.13333333333333,"d":"215.13"},210.7,205.5,29348000,{"v":-0.004342515945175736,"d":"-0.43%"}]
[6,"Others","ADANIPORTS",{"v":366.9,"d":"366.90"},{"v":367.7,"d":"367.70"},{"v":363.4,"d":"363.40"},{"v":359.9,"d":"359.90"},{"v":355.59999999999997,"d":"355.60"},{"v":371.2,"d":"371.20"},{"v":375.50000000000006,"d":"375.50"},{"v":379,"d":"379.00"},372,364.2,34010000,{"v":-0.025571234152281356,"d":"-2.56%"}]
[7,"Power","ADANIPOWER",59.85,{"v":60.06666666666666,"d":"60.07"},{"v":58.633333333333326,"d":"58.63"},{"v":57.416666666666664,"d":"57.42"},{"v":55.98333333333333,"d":"55.98"},{"v":61.283333333333324,"d":"61.28"},{"v":62.71666666666666,"d":"62.72"},{"v":63.93333333333332,"d":"63.93"},61.5,58.85,78290000,{"v":0.01688530978049097,"d":"1.69%"}]
[8,"Automobile","AMARAJABAT",730.05,{"v":734.2333333333332,"d":"734.23"},{"v":722.8166666666665,"d":"722.82"},{"v":715.5833333333333,"d":"715.58"},{"v":704.1666666666665,"d":"704.17"},{"v":741.4666666666665,"d":"741.47"},{"v":752.8833333333332,"d":"752.88"},{"v":760.1166666666664,"d":"760.12"},745.65,727,1342500,{"v":9.692812406799881E-4,"d":"0.10%"}]
[9,"Cement","AMBUJACEM",201.85,{"v":201.73333333333335,"d":"201.73"},{"v":199.8166666666667,"d":"199.82"},{"v":197.78333333333333,"d":"197.78"},{"v":195.86666666666667,"d":"195.87"},{"v":203.7666666666667,"d":"203.77"},{"v":205.68333333333334,"d":"205.68"},{"v":207.71666666666673,"d":"207.72"},203.65,199.7,17940000,{"v":-4.163197335553705E-3,"d":"-0.42%"}]
[10,"Others","APOLLOHOSP",{"v":1469,"d":"1469.00"},{"v":1482.2833333333335,"d":"1482.28"},{"v":1452.7166666666672,"d":"1452.72"},{"v":1436.4333333333336,"d":"1436.43"},{"v":1406.8666666666672,"d":"1406.87"},{"v":1498.566666666667,"d":"1498.57"},{"v":1528.1333333333332,"d":"1528.13"},{"v":1544.416666666667,"d":"1544.42"},1511.85,1466,1332500,{"v":-0.056303116147308784,"d":"-5.63%"}]
{"$rows_left_out":159}
{"sheet":"Cash Intra","index":2,"n_rows":247,"n_cols":13,"rows_kept":247,"merged":[[7,0,8,0],[7,1,8,1],[7,2,8,2],[7,3,8,3],[7,4,7,6],[7,7,7,9]]}
[]
[]
[]
[]
[{"$nulls":12},"Back to Main Page"]
["FOR INTRA DAY TRADING",{"$nulls":9},{"$f":"Main!B10","v":"2019-12-09"}]
[]
["Sr.no","Scrip","CLOSE RATE","Pivot Point","Supports",null,null,"Resistances"]
[null,null,"Point",null,"S1","S2","S3","R1","R2","R3","HIGH","LOW","Total Trade Quanity in Lakhs"]
[1,"Nifty 50",11921.5,{"v":11955.800000000001,"d":"11955.80"},{"v":11854.550000000003,"d":"11854.55"},{"v":11787.600000000002,"d":"11787.60"},{"v":11686.350000000004,"d":"11686.35"},{"v":12022.750000000002,"d":"12022.75"},{"v":12123.999999999998,"d":"12124.00"},12190.95,12057.05,11888.85]
[2,"Nifty Bank",31341.55,{"v":31491.966666666664,"d":"31491.97"},{"v":31100.233333333326,"d":"31100.23"},{"v":30858.916666666664,"d":"30858.92"},{"v":30467.183333333327,"d":"30467.18"},{"v":31733.283333333326,"d":"31733.28"},{"v":32125.016666666663,"d":"32125.02"},{"v":32366.333333333325,"d":"32366.33"},31883.7,31250.65]
[3,"Nifty CPSE",1860.35,{"v":1871.3166666666666,"d":"1871.32"},{"v":1845.0833333333333,"d":"1845.08"},{"v":1829.8166666666666,"d":"1829.82"},{"v":1803.5833333333333,"d":"1803.58"},{"v":1886.5833333333333,"d":"1886.58"},{"v":1912.8166666666668,"d":"1912.82"},{"v":1928.0833333333333,"d":"1928.08"},1897.55,1856.05]
[4,"Nifty Infra",3238.25,{"v":3245.2166666666667,"d":"3245.22"},{"v":3219.4333333333334,"d":"3219.43"},{"v":3200.616666666667,"d":"3200.62"},{"v":3174.8333333333335,"d":"3174.83"},{"v":3264.0333333333333,"d":"3264.03"},{"v":3289.816666666667,"d":"3289.82"},{"v":3308.633333333333,"d":"3308.63"},3271,3226.4]
[5,"Nifty IT",15289.6,{"v":15316.300000000001,"d":"15316.30"},{"v":15242.550000000003,"d":"15242.55"},{"v":15195.500000000002,"d":"15195.50"},{"v":15121.750000000004,"d":"15121.75"},{"v":15363.350000000002,"d":"15363.35"},{"v":15437.099999999999,"d":"15437.10"},{"v":15484.150000000001,"d":"15484.15"},15390.05,15269.25]
[6,"Nifty PSE",3123.3,{"v":3138.183333333333,"d":"3138.18"},{"v":3099.0666666666657,"d":"3099.07"},{"v":3074.8333333333326,"d":"3074.83"},{"v":3035.7166666666653,"d":"3035.72"},{"v":3162.416666666666,"d":"3162.42"},{"v":3201.5333333333338,"d":"3201.53"},{"v":3225.7666666666664,"d":"3225.77"},3177.3,3113.95]
[7,"Nifty Midcap 50",4556.35,{"v":4583.866666666667,"d":"4583.87"},{"v":4512.633333333333,"d":"4512.63"},{"v":4468.916666666666,"d":"4468.92"},{"v":4397.6833333333325,"d":"4397.68"},{"v":4627.583333333334,"d":"4627.58"},{"v":4698.8166666666675,"d":"4698.82"},{"v":4742.533333333335,"d":"4742.53"},4655.1,4540.15]
[8,"ACC",1482.5,{"v":1482.1833333333334,"d":"1482.18"},{"v":1462.8666666666668,"d":"1462.87"},{"v":1443.2333333333333,"d":"1443.23"},{"v":1423.9166666666667,"d":"1423.92"},{"v":1501.8166666666668,"d":"1501.82"},{"v":1521.1333333333334,"d":"1521.13"},{"v":1540.7666666666669,"d":"1540.77"},1501.5,1462.55,4.08453]
[9,"AUBANK",808,{"v":806.2166666666667,"d":"806.22"},{"v":798.7833333333334,"d":"798.78"},{"v":789.5666666666667,"d":"789.57"},{"v":782.1333333333334,"d":"782.13"},{"v":815.4333333333334,"d":"815.43"},{"v":822.8666666666668,"d":"822.87"},{"v":832.0833333333334,"d":"832.08"},813.65,797,2.44101]
[10,"ADANIPORTS",366.15,366.95,{"v":362.59999999999997,"d":"362.60"},{"v":359.04999999999995,"d":"359.05"},{"v":354.69999999999993,"d":"354.70"},{"v":370.5,"d":"370.50"},374.85,{"v":378.40000000000003,"d":"378.40"},371.3,363.4,23.76977]
[11,"ADANIPOWER",59.8,{"v":60,"d":"60.00"},{"v":58.6,"d":"58.60"},{"v":57.4,"d":"57.40"},{"v":56,"d":"56.00"},{"v":61.2,"d":"61.20"},{"v":62.60000000000001,"d":"62.60"},{"v":63.800000000000004,"d":"63.80"},61.4,58.8,52.26089]
{"$rows_left_out":228}
{"sheet":"MidCap Intra","index":3,"n_rows":545,"n_cols":13,"rows_kept":545,"merged":[[0,0,0,1],[8,0,9,0],[8,1,9,1],[8,2,9,2],[8,3,9,3],[8,4,8,6],[8,7,8,9]]}
[]
[]
[]
[]
[{"$nulls":11},"Back To Main Page"]
["FOR INTRA DAY TRADING",{"$nulls":9},{"$f":"Main!B10","v":"2019-12-09"}]
[null,null," "]
[]
["Sr.no","Scrip","CLOSE RATE","Pivot Point","Supports",null,null,"Resistances"]
[null,null,"Point",null,"S1","S2","S3","R1","R2","R3","HIGH","LOW","Total Trade Quanity in Lakhs"]
[1,"3MINDIA",21672.2,{"v":21740.733333333334,"d":"21740.73"},{"v":21531.466666666667,"d":"21531.47"},{"v":21390.733333333334,"d":"21390.73"},{"v":21181.466666666667,"d":"21181.47"},{"v":21881.466666666667,"d":"21881.47"},{"v":22090.733333333337,"d":"22090.73"},{"v":22231.466666666667,"d":"22231.47"},21950,21600,0.00336]
[2,"ACC",1482.5,{"v":1482.1833333333334,"d":"1482.18"},{"v":1462.8666666666668,"d":"1462.87"},{"v":1443.2333333333333,"d":"1443.23"},{"v":1423.9166666666667,"d":"1423.92"},{"v":1501.8166666666668,"d":"1501.82"},{"v":1521.1333333333334,"d":"1521.13"},{"v":1540.7666666666669,"d":"1540.77"},1501.5,1462.55,4.08453]
[3,"AIAENG",1648.95,{"v":1642.3999999999999,"d":"1642.40"},{"v":1634.7499999999998,"d":"1634.75"},1620.55,{"v":1612.8999999999999,"d":"1612.90"},{"v":1656.5999999999997,"d":"1656.60"},{"v":1664.2499999999998,"d":"1664.25"},{"v":1678.4499999999996,"d":"1678.45"},1650.05,1628.2,0.1904]
[4,"APLAPOLLO",1565.4,{"v":1573.7666666666667,"d":"1573.77"},{"v":1547.6333333333332,"d":"1547.63"},{"v":1529.8666666666666,"d":"1529.87"},{"v":1503.7333333333331,"d":"1503.73"},{"v":1591.5333333333333,"d":"1591.53"},{"v":1617.666666666667,"d":"1617.67"},{"v":1635.4333333333334,"d":"1635.43"},1599.9,1556,0.37501]
[5,"AUBANK",808,{"v":806.2166666666667,"d":"806.22"},{"v":798.7833333333334,"d":"798.78"},{"v":789.5666666666667,"d":"789.57"},{"v":782.1333333333334,"d":"782.13"},{"v":815.4333333333334,"d":"815.43"},{"v":822.8666666666668,"d":"822.87"},{"v":832.0833333333334,"d":"832.08"},813.65,797,2.44101]
[6,"AAVAS",1757.9,{"v":1764.3333333333333,"d":"1764.33"},{"v":1733.5666666666666,"d":"1733.57"},{"v":1709.2333333333333,"d":"1709.23"},{"v":1678.4666666666667,"d":"1678.47"},{"v":1788.6666666666665,"d":"1788.67"},{"v":1819.4333333333334,"d":"1819.43"},{"v":1843.7666666666664,"d":"1843.77"},1795.1,1740,0.4]
[7,"ABBOTINDIA",12801.3,{"v":12787.4,"d":"12787.40"},{"v":12754.849999999999,"d":"12754.85"},{"v":12708.4,"d":"12708.40"},{"v":12675.849999999999,"d":"12675.85"},{"v":12833.849999999999,"d":"12833.85"},{"v":12866.399999999998,"d":"12866.40"},{"v":12912.849999999999,"d":"12912.85"},12819.95,12740.95,0.06407]
[8,"ADANIGAS",150.65,{"v":151.96666666666667,"d":"151.97"},{"v":148.68333333333334,"d":"148.68"},{"v":146.71666666666667,"d":"146.72"},{"v":143.43333333333334,"d":"143.43"},{"v":153.93333333333334,"d":"153.93"},{"v":157.2166666666667,"d":"157.22"},{"v":159.18333333333334,"d":"159.18"},155.25,150,13.04654]
[9,"ADANIGREEN",126.4,127.05,122.85,{"v":119.3,"d":"119.30"},{"v":115.1,"d":"115.10"},{"v":130.6,"d":"130.60"},{"v":134.8,"d":"134.80"},138.35,131.25,123.5,11.33254]
[10,"ADANIPORTS",366.15,366.95,{"v":362.59999999999997,"d":"362.60"},{"v":359.04999999999995,"d":"359.05"},{"v":354.69999999999993,"d":"354.70"},{"v":370.5,"d":"370.50"},374.85,{"v":378.40000000000003,"d":"378.40"},371.3,363.4,23.76977]
{"$rows_left_out":513}
{"sheet":"Bulk Deals","index":4,"n_rows":63,"n_cols":8,"rows_kept":63,"merged":[[4,0,4,1],[4,2,4,3],[6,1,6,2]]}
[" "]
[]
[]
[]
[]
[{"$nulls":4},"Back To Main Page"]
["Subject :","BULK DEAL",null,{"$f":"Main!B10","v":"2019-12-09"}]
[]
["Date","Scrip code","Scrip Name","Client Name","Buy / Sell","Quantity Traded","Trade Price / Wt.Avg.trade price","Exchange  "]
["2019-12-06",511463,"ALEXANDER","VANDNA ANIRUDH SETHI","BUY","315,730",18.73,"BSE"]
["2019-12-06",511463,"ALEXANDER","KAHAR NIKLESH KANAIYABHAI","SELL","203,000",18.79,"BSE"]
["2019-12-06",511463,"ALEXANDER","SONIKA JALAN","SELL","50,000",18.35,"BSE"]
["2019-12-06",541006,"ANGEL","MONOTYPE INDIA LIMITED","SELL","152,000",5.13,"BSE"]
["2019-12-06",539621,"BCLENTERPR","ARYADEEP INFRAHOMES PRIVATE LIMITED","BUY","30,043",12.4,"BSE"]
["2019-12-06",536709,"INDRENEW","ANURUDHKUMAR BARELAL YADAV","BUY","16,670",9.51,"BSE"]
["2019-12-06",536709,"INDRENEW","ANURUDHKUMAR BARELAL YADAV","SELL","16,670",9.51,"BSE"]
["2019-12-06",524322,"KABRADG","ROOPCHAND JAIN HUF","BUY","118,999",0.73,"BSE"]
["2019-12-06",524322,"KABRADG","AATUR BAKLIWAL","BUY","97,774",0.73,"BSE"]
["2019-12-06",524322,"KABRADG","AYUSH KABRA","SELL","222,000",0.73,"BSE"]
["2019-12-06",512217,"PRISMMEDI","GURCHARAN LAL MAKKAD .","BUY","250,000",25.27,"BSE"]
{"$rows_left_out":44}
{"sheet":"Call Tracker (Equity & F&O)","index":5,"n_rows":317,"n_cols":18,"rows_kept":317,"merged":[[97,0,98,0],[97,1,98,1],[97,9,98,9],[97,11,98,11],[97,12,98,12],[97,13,98,13],[97,14,98,14],[99,0,100,0],[99,1,100,1],[99,9,100,9],[99,11,100,11],[99,12,100,12],[99,13,100,13],[99,14,100,14],[101,0,102,0],[101,1,102,1],[101,9,102,9],[101,11,102,11],[101,12,102,12],[101,13,102,13],[101,14,102,14],[103,0,104,0],[103,1,104,1],[103,9,104,9],[103,11,104,11],[103,12,104,12],[103,13,104,13],[103,14,104,14],[105,0,106,0],[105,1,106,1],[105,9,106,9],[105,11,106,11],[105,12,106,12],[105,13,106,13],[105,14,106,14],[107,0,108,0],[107,1,108,1],[107,9,108,9],[107,11,108,11],[107,12,108,12],[107,13,108,13],[107,14,108,14],[109,0,110,0],[109,1,110,1],[109,9,110,9],[109,11,110,11],[109,12,110,12],[109,13,110,13],[109,14,110,14],[111,0,112,0],[111,1,112,1],[111,9,112,9],[111,11,112,11],[111,12,112,12],[111,13,112,13],[111,14,112,14],[131,0,132,0],[131,1,132,1],[131,9,132,9],[131,11,132,11],[131,12,132,12],[131,13,132,13],[131,14,132,14],[133,0,134,0],[133,1,134,1],[133,9,134,9],[133,11,134,11],[133,12,134,12],[133,13,134,13],[133,14,134,14],[135,0,136,0],[135,1,136,1],[135,9,136,9],[135,11,136,11],[135,12,136,12],[135,13,136,13],[135,14,136,14]]}
[]
[]
[]
[]
[{"$nulls":12},"Back To Main Page"]
["Retail Research Technical Calls & Fundamental Performance Report for the month of December-2019 "]
[{"$nulls":12},{"$f":"Main!B10","v":"2019-12-09"}]
[null,"Positional  Call"]
["Sr.no","Date",null,"Company","Rec","Rec Price","Stop Loss***","Call Closed At","Target","Remark","Profit / Loss per Share","Gain / Loss  %","Status","Closed Date","NSE Closed Price"]
[1,"2019-10-07",null,"PIDILITIND","Buy{}",1367.5,1297,1413.5,"1500-1520","Part Profit of Rs.46/-",{"$f":"H10-F10","v":46},{"$f":"K10/F10","v":{"v":0.03363802559414991,"d":"3.36%"}},"Successful","2019-10-31",{"$f":"VLOOKUP(D10,Sheet2!A51:M1690,6,0)","v":1315.7},null,null,"R"]
[2,"2019-11-11",null,"POWERGRID","Buy{}",192,183,200,"208-212","Part Profit of Rs.8/-",{"$f":"H11-F11","v":8},{"$f":"K11/F11","v":{"v":0.041666666666666664,"d":"4.17%"}},"Successful","2019-11-22",{"$f":"VLOOKUP(D11,Sheet2!A68:M1707,6,0)","v":186.6},null,null,"R"]
[3,"2019-11-14",null,"HEIDELBERG","Buy{}",186.5,174,194.5,"205-210","Part Profit of Rs.8/-",{"$f":"H12-F12","v":8},{"$f":"K12/F12","v":{"v":0.04289544235924933,"d":"4.29%"}},"Successful","2019-11-20",{"$f":"VLOOKUP(D12,Sheet2!A71:M1710,6,0)","v":181},null,null,"H"]
[4,"2019-11-18",null,"BAJAJ-AUTO","Sell","3180-3200",3356.7,null,"2900-2850","Open",{"$nulls":4},{"$f":"VLOOKUP(D13,Sheet2!A74:M1713,6,0)","v":3206.1},null,null,"R"]
[5,"2019-11-18",null,"THERMAX","Buy","1025-1035",977,null,"1120-1140","Open",{"$nulls":4},{"$f":"VLOOKUP(D14,Sheet2!A75:M1714,6,0)","v":985.7},null,null,"H"]
[6,"2019-11-20",null,"BRITANNIA","Buy","3075-3100",2930,null,"3380-3420","Open",{"$nulls":4},{"$f":"VLOOKUP(D15,Sheet2!A76:M1715,6,0)","v":3069.6},null,null,"H"]
[7,"2019-11-21",null,"HINDUNILVR","Buy",2020,1917,2082,"2200-2250","Part Profit of Rs.62/-",{"$f":"H16-F16","v":62},{"$f":"K16/F16","v":{"v":0.030693069306930693,"d":"3.07%"}},"Successful","2019-11-27",{"$f":"VLOOKUP(D16,Sheet2!A77:M1716,6,0)","v":2026.05},null,null,"H"]
[8,"2019-11-22",null,"GODREJPROP","Buy",885,837.7,915,"965-985","Part Profit of Rs.30/-",{"$f":"H17-F17","v":30},{"$f":"K17/F17","v":{"v":0.03389830508474576,"d":"3.39%"}},"Successful","2019-11-28",{"$f":"VLOOKUP(D17,Sheet2!A79:M1718,6,0)","v":886.45},null,null,"R"]
[9,"2019-11-27",null,"LT","Buy","1330-1340",1270,null,"1450-1500","Open",{"$nulls":4},{"$f":"VLOOKUP(D18,Sheet2!A80:M1719,6,0)","v":1290.8},null,null,"H"]
[10,"2019-12-02",null,"TCS","Buy",2030,1895,2092,"2200-2250","Part Profit of Rs.62/-",{"$f":"H19-F19","v":62},{"$f":"K19/F19","v":{"v":0.030541871921182268,"d":"3.05%"}},"Successful","2019-12-05",{"$f":"VLOOKUP(D19,Sheet2!A81:M1720,6,0)","v":2123.6},null,null,"H"]
[11,"2019-12-02",null,"HAVELLS","Buy","662-667",632.7,null,"725-735","Open",{"$nulls":4},{"$f":"VLOOKUP(D20,Sheet2!A82:M1721,6,0)","v":661.4},null,null,"R"]
{"$rows_left_out":237}
{"sheet":"Sheet2","index":6,"n_rows":1899,"n_cols":14,"rows_kept":1899,"hidden":true}
["SYMBOL","SERIES","OPEN","HIGH","LOW","CLOSE","LAST","PREVCLOSE","TOTTRDQTY","TOTTRDVAL","TIMESTAMP","TOTALTRADES","ISIN","ISIN"]
["20MICRONS","EQ",33.5,33.5,32.3,32.55,32.35,32.7,14291,469860.45,"2019-12-06",208,"INE144J01027"]
["21STCENMGM","EQ",13.7,13.7,13.7,13.7,13.7,13.7,200,2740,"2019-12-06",2,"INE253B01015"]
["3IINFOTECH","EQ",2,2,1.95,2,1.95,1.95,638163,1261932.8,"2019-12-06",611,"INE748C01020"]
["3MINDIA","EQ",21899.5,21950,21600,21672.2,21605,21862.9,336,7304732.1,"2019-12-06",224,"INE470A01017"]
["3PLAND","EQ",5.65,5.65,5.65,5.65,5.65,5.65,1000,5650,"2019-12-06",2,"INE105C01023"]
["5PAISA","EQ",196.5,202.9,175.1,188.2,188.7,188.4,33758,6553269.25,"2019-12-06",1362,"INE618L01018"]
["63MOONS","EQ",101.5,113.5,101.45,104.95,103.8,100.55,975207,106600952.45,"2019-12-06",16110,"INE111B01023"]
["A2ZINFRA","EQ",8.65,8.75,8.2,8.3,8.3,8.65,255188,2152841.65,"2019-12-06",498,"INE619I01012"]
["AARTIDRUGS","EQ",529.1,534,515.55,524,525.5,525.9,9272,4834089.4,"2019-12-06",643,"INE767A01016"]
["AARTIIND","EQ",802,808.8,763,781.35,788.9,800.05,131338,103344089.15,"2019-12-06",9988,"INE769A01020"]
["AARVEEDEN","EQ",12.15,13.95,11.75,12.95,12.9,11.65,13410,167165.6,"2019-12-06",114,"INE273D01019"]
["AAVAS","EQ",1772,1795.1,1740,1757.9,1760,1758.2,40000,70730013.85,"2019-12-06",7888,"INE216P01012"]
["ABB","EQ",1440,1448.5,1421.05,1442.6,1444.9,1440.15,88519,127254097.8,"2019-12-06",3669,"INE117A01022"]
["ABBOTINDIA","EQ",12819.95,12819.95,12740.95,12801.3,12800,12772.45,6407,81922050.1,"2019-12-06",1458,"INE358A01014"]
["ABCAPITAL","EQ",107.3,108,102.1,103.2,102.9,106.8,3051336,319613588.7,"2019-12-06",26675,"INE674K01013"]
["ABFRL","EQ",221.4,227,218.55,225.65,226.5,222.4,879086,194748005.4,"2019-12-06",16121,"INE647O01011"]
["ABSLNN50ET","EQ",280.7,280.7,279.59,279.59,279.59,285.3,2,560.29,"2019-12-06",2,"INF209KB1B87"]
["ACC","EQ",1496,1501.5,1462.55,1482.5,1479,1493,408453,605730537.55,"2019-12-06",12807,"INE012A01025"]
["ACCELYA","EQ",940,950,940,946.3,945,949.05,5140,4865358.55,"2019-12-06",222,"INE793A01012"]
{"$rows_left_out":1699}
{"sheet":"Sheet1","index":7,"n_rows":0,"n_cols":0,"rows_kept":0,"hidden":true}

{"sheet":"Sheet3","index":8,"n_rows":0,"n_cols":0,"rows_kept":0,"hidden":true}

{"sheet":"Sheet4","index":9,"n_rows":0,"n_cols":0,"rows_kept":0,"hidden":true}

{"sheet":"Sheet5","index":10,"n_rows":0,"n_cols":0,"rows_kept":0,"hidden":true}