{"text_format":"3","workbook":"xlsx","n_sheets":11,"sheets":["Main","Future Intra","Cash Intra","MidCap Intra","Bulk Deals","Call Tracker (Equity & F&O)","Sheet2","Sheet1","Sheet3","Sheet4","Sheet5"],"not_rendered":{"images":4,"defined_names":5},"read":"whole","date_system":"1900"}

{"sheet":"Main","index":0,"n_rows":27,"n_cols":11,"rows_kept":27}
[null,"                                                                                                 "]
{"$rows_empty":8}
[null,"2019-09-09"]
[]
[null,"Sheet No.","Template Name","Summary"]
[null,1,"Future Intra","For Intraday trading in F&O segment"]
[null,2,"Cash Intra","For Intraday trading in cash market segment"]
[null,3,"Mid-cap Intra","For Intraday trading in Mid-cap stocks"]
[null,4,"Bulk Deals","Reveals Bulk Deals carried on NSE & BSE"]
[null,5,"Call Tracker"]
{"$rows_empty":9}
[{"$nulls":10},"`"]

{"sheet":"Future Intra","index":1,"n_rows":205,"n_cols":15,"rows_kept":205,"merged":[[8,0,9,0],[8,1,9,1],[8,2,9,2],[8,5,8,7],[8,8,8,10]]}
[]
[]
[]
[]
[{"$nulls":12},"Back to Main Page"]
["FOR INTRA DAY TRADING",{"$nulls":10},{"$f":"Main!B10","v":"2019-09-09"}]
[]
[]
["Sr.no","Sector","Scrip","CLOSE RATE","Pivot Point","Supports",null,null,"Resistances"]
[null,"Sector",null,"Point","Point","S1","S2","S3","R1","R2","R3","HIGH","LOW","OI","% Change in OI"]
[1,"Index","BANKNIFTY",{"v":27306,"d":"27306.00"},{"v":27243.016666666666,"d":"27243.02"},{"v":27088.033333333333,"d":"27088.03"},{"v":26870.066666666666,"d":"26870.07"},{"v":26715.083333333332,"d":"26715.08"},{"v":27460.983333333334,"d":"27460.98"},{"v":27615.966666666664,"d":"27615.97"},{"v":27833.933333333334,"d":"27833.93"},27398,27025.05,1662540,{"v":-0.03075846790648866,"d":"-3.08%"}]
[2,"Index","NIFTY",10973.65,{"v":10952.550000000001,"d":"10952.55"},{"v":10921.100000000002,"d":"10921.10"},{"v":10868.550000000001,"d":"10868.55"},{"v":10837.100000000002,"d":"10837.10"},{"v":11005.100000000002,"d":"11005.10"},{"v":11036.550000000003,"d":"11036.55"},{"v":11089.100000000002,"d":"11089.10"},10984,10900,18134250,{"v":-0.01878905932959987,"d":"-1.88%"}]
[3,"Index","NIFTYIT",{"v":16092,"d":"16092.00"},{"v":16114,"d":"16114.00"},{"v":16028,"d":"16028.00"},{"v":15964,"d":"15964.00"},{"v":15878,"d":"15878.00"},{"v":16178,"d":"16178.00"},{"v":16264,"d":"16264.00"},{"v":16328,"d":"16328.00"},16200,16050,9550,{"v":0.032432432432432434,"d":"3.24%"}]
[4,"Cement","ACC",1469.85,{"v":1470.3500000000001,"d":"1470.35"},{"v":1458.7000000000003,"d":"1458.70"},{"v":1447.5500000000002,"d":"1447.55"},{"v":1435.9000000000003,"d":"1435.90"},{"v":1481.5000000000002,"d":"1481.50"},{"v":1493.1500000000003,"d":"1493.15"},{"v":1504.3000000000002,"d":"1504.30"},1482,1459.2,2283600,{"v":0.014392324093816631,"d":"1.44%"}]
[5,"Others","ADANIENT",138.15,{"v":137.28333333333333,"d":"137.28"},{"v":135.96666666666667,"d":"135.97"},{"v":133.78333333333333,"d":"133.78"},{"v":132.46666666666667,"d":"132.47"},{"v":139.46666666666667,"d":"139.47"},{"v":140.78333333333333,"d":"140.78"},{"v":142.96666666666667,"d":"142.97"},138.6,135.1,26664000,{"v":-0.019705882352941177,"d":"-1.97%"}]
[6,"Others","ADANIPORTS",{"v":366.4,"d":"366.40"},{"v":366.7,"d":"366.70"},{"v":363.9,"d":"363.90"},{"v":361.4,"d":"361.40"},{"v":358.59999999999997,"d":"358.60"},{"v":369.2,"d":"369.20"},{"v":372.00000000000006,"d":"372.00"},{"v":374.5,"d":"374.50"},369.5,364.2,16270000,{"v":-0.01706690832200574,"d":"-1.71%"}]
[7,"Power","ADANIPOWER",{"v":58.5,"d":"58.50"},{"v":58.36666666666667,"d":"58.37"},{"v":57.53333333333333,"d":"57.53"},{"v":56.56666666666666,"d":"56.57"},{"v":55.73333333333333,"d":"55.73"},{"v":59.333333333333336,"d":"59.33"},{"v":60.166666666666664,"d":"60.17"},{"v":61.13333333333334,"d":"61.13"},59.2,57.4,97180000,{"v":0,"d":"0.00%"}]
[8,"Automobile","AMARAJABAT",625.35,622.65,618.25,611.15,606.75,629.75,{"v":634.1499999999999,"d":"634.15"},641.25,627.05,615.55,1447600,{"v":-0.013829279923700524,"d":"-1.38%"}]
[9,"Cement","AMBUJACEM",{"v":195.2,"d":"195.20"},{"v":195.44999999999996,"d":"195.45"},{"v":193.69999999999993,"d":"193.70"},{"v":192.19999999999996,"d":"192.20"},{"v":190.44999999999993,"d":"190.45"},{"v":196.94999999999993,"d":"196.95"},{"v":198.7,"d":"198.70"},{"v":200.19999999999993,"d":"200.20"},197.2,193.95,22475000,{"v":0.005592841163310962,"d":"0.56%"}]
[10,"Others","APOLLOHOSP",{"v":1487,"d":"1487.00"},{"v":1494.6666666666667,"d":"1494.67"},{"v":1467.3333333333335,"d":"1467.33"},{"v":1447.6666666666667,"d":"1447.67"},{"v":1420.3333333333335,"d":"1420.33"},{"v":1514.3333333333335,"d":"1514.33"},{"v":1541.666666666667,"d":"1541.67"},{"v":1561.3333333333335,"d":"1561.33"},1522,1475,1364500,{"v":0.12027914614121511,"d":"12.03%"}]
{"$rows_left_out":172}
{"sheet":"Cash Intra","index":2,"n_rows":247,"n_cols":13,"rows_kept":247,"merged":[[7,0,8,0],[7,1,8,1],[7,2,8,2],[7,3,8,3],[7,4,7,6],[7,7,7,9]]}
[]
[]
[]
[]
[{"$nulls":12},"Back to Main Page"]
["FOR INTRA DAY TRADING",{"$nulls":9},{"$f":"Main!B10","v":"2019-09-09"}]
[]
["Sr.no","Scrip","CLOSE RATE","Pivot Point","Supports",null,null,"Resistances"]
[null,null,"Point",null,"S1","S2","S3","R1","R2","R3","HIGH","LOW","Total Trade Quanity in Lakhs"]
[1,"Nifty 50",10946.2,{"v":10923.566666666666,"d":"10923.57"},{"v":10890.083333333332,"d":"10890.08"},{"v":10833.966666666667,"d":"10833.97"},{"v":10800.483333333334,"d":"10800.48"},{"v":10979.68333333333,"d":"10979.68"},{"v":11013.166666666664,"d":"11013.17"},{"v":11069.28333333333,"d":"11069.28"},10957.05,10867.45]
[2,"Nifty Bank",27247.9,{"v":27169.833333333332,"d":"27169.83"},{"v":27028.616666666665,"d":"27028.62"},{"v":26809.333333333332,"d":"26809.33"},{"v":26668.116666666665,"d":"26668.12"},{"v":27389.116666666665,"d":"27389.12"},{"v":27530.333333333332,"d":"27530.33"},{"v":27749.616666666665,"d":"27749.62"},27311.05,26950.55]
[3,"Nifty CPSE",1938.15,{"v":1924.8333333333333,"d":"1924.83"},{"v":1906.0166666666664,"d":"1906.02"},{"v":1873.8833333333332,"d":"1873.88"},{"v":1855.0666666666664,"d":"1855.07"},{"v":1956.9666666666665,"d":"1956.97"},{"v":1975.7833333333335,"d":"1975.78"},{"v":2007.9166666666665,"d":"2007.92"},1943.65,1892.7]
[4,"Nifty Infra",3025.1,{"v":3018.883333333333,"d":"3018.88"},{"v":3008.1166666666663,"d":"3008.12"},{"v":2991.133333333333,"d":"2991.13"},{"v":2980.3666666666663,"d":"2980.37"},{"v":3035.8666666666663,"d":"3035.87"},{"v":3046.6333333333328,"d":"3046.63"},{"v":3063.6166666666663,"d":"3063.62"},3029.65,3001.9]
[5,"Nifty IT",16034.55,{"v":16081.466666666665,"d":"16081.47"},{"v":15944.133333333331,"d":"15944.13"},{"v":15853.716666666665,"d":"15853.72"},{"v":15716.383333333331,"d":"15716.38"},{"v":16171.883333333331,"d":"16171.88"},{"v":16309.216666666664,"d":"16309.22"},{"v":16399.63333333333,"d":"16399.63"},16218.8,15991.05]
[6,"Nifty PSE",3141.6,{"v":3126.033333333333,"d":"3126.03"},{"v":3104.5166666666655,"d":"3104.52"},{"v":3067.4333333333325,"d":"3067.43"},{"v":3045.916666666665,"d":"3045.92"},{"v":3163.116666666666,"d":"3163.12"},{"v":3184.633333333333,"d":"3184.63"},{"v":3221.7166666666662,"d":"3221.72"},3147.55,3088.95]
[7,"Nifty Midcap 50",4255,4240.75,4222.15,{"v":4189.299999999999,"d":"4189.30"},{"v":4170.699999999999,"d":"4170.70"},{"v":4273.6,"d":"4273.60"},{"v":4292.200000000001,"d":"4292.20"},{"v":4325.050000000001,"d":"4325.05"},4259.35,4207.9]
[8,"ABB",1319.3,{"v":1322.8833333333334,"d":"1322.88"},{"v":1306.7666666666669,"d":"1306.77"},{"v":1294.2333333333333,"d":"1294.23"},{"v":1278.1166666666668,"d":"1278.12"},{"v":1335.416666666667,"d":"1335.42"},{"v":1351.5333333333333,"d":"1351.53"},{"v":1364.066666666667,"d":"1364.07"},1339,1310.35,0.28271]
[9,"ACC",1463.25,{"v":1464.6499999999999,"d":"1464.65"},{"v":1452.2999999999997,"d":"1452.30"},1441.35,{"v":1428.9999999999998,"d":"1429.00"},{"v":1475.5999999999997,"d":"1475.60"},{"v":1487.9499999999996,"d":"1487.95"},{"v":1498.8999999999996,"d":"1498.90"},1477,1453.7,4.64686]
[10,"AUBANK",667.1,669.85,662.75,{"v":658.4,"d":"658.40"},{"v":651.3,"d":"651.30"},{"v":674.2,"d":"674.20"},{"v":681.3000000000002,"d":"681.30"},{"v":685.6500000000001,"d":"685.65"},676.95,665.5,2.60791]
[11,"ADANIPORTS",365.75,{"v":366.0833333333333,"d":"366.08"},{"v":363.46666666666664,"d":"363.47"},{"v":361.18333333333334,"d":"361.18"},{"v":358.56666666666666,"d":"358.57"},{"v":368.3666666666666,"d":"368.37"},{"v":370.9833333333333,"d":"370.98"},{"v":373.2666666666666,"d":"373.27"},368.7,363.8,23.66109]
{"$rows_left_out":228}
{"sheet":"MidCap Intra","index":3,"n_rows":545,"n_cols":13,"rows_kept":545,"merged":[[0,0,0,1],[8,0,9,0],[8,1,9,1],[8,2,9,2],[8,3,9,3],[8,4,8,6],[8,7,8,9]]}
[]
[]
[]
[]
[{"$nulls":11},"Back To Main Page"]
["FOR INTRA DAY TRADING",{"$nulls":9},{"$f":"Main!B10","v":"2019-09-09"}]
[null,null," "]
[]
["Sr.no","Scrip","CLOSE RATE","Pivot Point","Supports",null,null,"Resistances"]
[null,null,"Point",null,"S1","S2","S3","R1","R2","R3","HIGH","LOW","Total Trade Quanity in Lakhs"]
[1,"3MINDIA",20515.35,{"v":20561.8,"d":"20561.80"},{"v":20403.649999999998,"d":"20403.65"},{"v":20291.949999999997,"d":"20291.95"},{"v":20133.799999999996,"d":"20133.80"},{"v":20673.5,"d":"20673.50"},20831.65,{"v":20943.350000000002,"d":"20943.35"},20719.95,20450.1,0.01794]
[2,"ABB",1319.3,{"v":1322.8833333333334,"d":"1322.88"},{"v":1306.7666666666669,"d":"1306.77"},{"v":1294.2333333333333,"d":"1294.23"},{"v":1278.1166666666668,"d":"1278.12"},{"v":1335.416666666667,"d":"1335.42"},{"v":1351.5333333333333,"d":"1351.53"},{"v":1364.066666666667,"d":"1364.07"},1339,1310.35,0.28271]
[3,"ACC",1463.25,{"v":1464.6499999999999,"d":"1464.65"},{"v":1452.2999999999997,"d":"1452.30"},1441.35,{"v":1428.9999999999998,"d":"1429.00"},{"v":1475.5999999999997,"d":"1475.60"},{"v":1487.9499999999996,"d":"1487.95"},{"v":1498.8999999999996,"d":"1498.90"},1477,1453.7,4.64686]
[4,"AIAENG",1507.2,{"v":1509.0833333333333,"d":"1509.08"},{"v":1495.1166666666666,"d":"1495.12"},{"v":1483.0333333333333,"d":"1483.03"},{"v":1469.0666666666666,"d":"1469.07"},{"v":1521.1666666666665,"d":"1521.17"},{"v":1535.1333333333332,"d":"1535.13"},{"v":1547.2166666666665,"d":"1547.22"},1523.05,1497,0.63048]
[5,"APLAPOLLO",1286.05,{"v":1285.3166666666666,"d":"1285.32"},{"v":1270.7333333333331,"d":"1270.73"},{"v":1255.4166666666665,"d":"1255.42"},{"v":1240.833333333333,"d":"1240.83"},{"v":1300.6333333333332,"d":"1300.63"},{"v":1315.2166666666667,"d":"1315.22"},{"v":1330.5333333333333,"d":"1330.53"},1299.9,1270,0.30504]
[6,"AUBANK",667.1,669.85,662.75,{"v":658.4,"d":"658.40"},{"v":651.3,"d":"651.30"},{"v":674.2,"d":"674.20"},{"v":681.3000000000002,"d":"681.30"},{"v":685.6500000000001,"d":"685.65"},676.95,665.5,2.60791]
[7,"AAVAS",1565.45,{"v":1566.1833333333334,"d":"1566.18"},{"v":1547.2666666666669,"d":"1547.27"},{"v":1529.0833333333335,"d":"1529.08"},{"v":1510.166666666667,"d":"1510.17"},{"v":1584.3666666666668,"d":"1584.37"},{"v":1603.2833333333333,"d":"1603.28"},{"v":1621.4666666666667,"d":"1621.47"},1585.1,1548,0.88435]
[8,"ADANIGREEN",45.1,{"v":45.21666666666667,"d":"45.22"},{"v":44.63333333333334,"d":"44.63"},{"v":44.16666666666667,"d":"44.17"},{"v":43.58333333333334,"d":"43.58"},{"v":45.68333333333334,"d":"45.68"},{"v":46.266666666666666,"d":"46.27"},{"v":46.733333333333334,"d":"46.73"},45.8,44.75,2.78208]
[9,"ADANIPORTS",365.75,{"v":366.0833333333333,"d":"366.08"},{"v":363.46666666666664,"d":"363.47"},{"v":361.18333333333334,"d":"361.18"},{"v":358.56666666666666,"d":"358.57"},{"v":368.3666666666666,"d":"368.37"},{"v":370.9833333333333,"d":"370.98"},{"v":373.2666666666666,"d":"373.27"},368.7,363.8,23.66109]
[10,"ADANIPOWER",58.35,{"v":58.366666666666674,"d":"58.37"},{"v":57.43333333333335,"d":"57.43"},{"v":56.51666666666668,"d":"56.52"},{"v":55.58333333333336,"d":"55.58"},{"v":59.283333333333346,"d":"59.28"},{"v":60.21666666666667,"d":"60.22"},{"v":61.13333333333334,"d":"61.13"},59.3,57.45,84.65988]
{"$rows_left_out":513}
{"sheet":"Bulk Deals","index":4,"n_rows":52,"n_cols":8,"rows_kept":52,"merged":[[4,0,4,1],[4,2,4,3],[6,1,6,2]]}
[" "]
[]
[]
[]
[]
[{"$nulls":4},"Back To Main Page"]
["Subject :","BULK DEAL",null,{"$f":"Main!B10","v":"2019-09-09"}]
[]
["Date","Scrip code","Scrip Name","Client Name","Buy / Sell","Quantity Traded","Trade Price / Wt.Avg.trade price","Exchange  "]
["2019-09-06",541144,"ACTIVE","SMITH AND THOMSON REALTY PRIVATE LIMITED","SELL",{"v":110000,"d":"110,000"},15.78,"BSE"]
["2019-09-06",540697,"AMFL","TEJAS HARSHADBHAI PATEL","BUY",{"v":128000,"d":"128,000"},9.06,"BSE"]
["2019-09-06",540697,"AMFL","NISHA JIGARBHAI SHAH","SELL",{"v":120000,"d":"120,000"},9.06,"BSE"]
["2019-09-06",504340,"CONFINT","DINESH NATHA PAGI","SELL",{"v":139881,"d":"139,881"},0.64,"BSE"]
["2019-09-06",504340,"CONFINT","MANOJNAGINLALJAIN","BUY",{"v":205832,"d":"205,832"},0.65,"BSE"]
["2019-09-06",504340,"CONFINT","SHIV RATAN BHAUKA","SELL",{"v":96000,"d":"96,000"},0.66,"BSE"]
["2019-09-06",540268,"DHANVARSHA","YAN SECURITIES","BUY",{"v":200000,"d":"200,000"},53.5,"BSE"]
["2019-09-06",540268,"DHANVARSHA","DAHIBEN DWARKADAS PATEL","SELL",{"v":136199,"d":"136,199"},{"v":53.5,"d":"53.50"},"BSE"]
["2019-09-06",540268,"DHANVARSHA","MUKUL RATILAL TELI","SELL",{"v":74076,"d":"74,076"},{"v":53.5,"d":"53.50"},"BSE"]
["2019-09-06",541627,"HITECHWIND","RUPAL BHAVIN SHAH","BUY",{"v":26300,"d":"26,300"},{"v":9.4,"d":"9.40"},"BSE"]
["2019-09-06",541627,"HITECHWIND","DAXABEN PRAVINBHAI SHAH","SELL",{"v":26300,"d":"26,300"},9.4,"BSE"]
{"$rows_left_out":33}
{"sheet":"Call Tracker (Equity & F&O)","index":5,"n_rows":265,"n_cols":18,"rows_kept":265,"merged":[[79,0,80,0],[79,1,80,1],[79,9,80,9],[79,11,80,11],[79,12,80,12],[79,13,80,13],[79,14,80,14],[81,0,82,0],[81,1,82,1],[81,9,82,9],[81,11,82,11],[81,12,82,12],[81,13,82,13],[81,14,82,14],[83,0,84,0],[83,1,84,1],[83,9,84,9],[83,11,84,11],[83,12,84,12],[83,13,84,13],[83,14,84,14]]}
[]
[]
[]
[]
[{"$nulls":12},"Back To Main Page"]
["Retail Research Technical Calls & Fundamental Performance Report for the month of September-2019 "]
[{"$nulls":12},{"$f":"Main!B10","v":"2019-09-09"}]
[null,"Positional  Call"]
["Sr.no","Date",null,"Company","Rec","Rec Price","Stop Loss***","Call Closed At","Target","Remark","Profit / Loss per Share","Gain / Loss  %","Status","Closed Date","NSE Closed Price"]
[1,"2019-08-01",null,"HDFCBANK","Buy","2205-2215",2130,null,"2320-2370","Open",{"$nulls":4},{"$f":"VLOOKUP(D10,Sheet2!A25:M1664,6,0)","v":2245.9},null,null,"H"]
[2,"2019-08-02",null,"LT","Buy","1345-1355",1270,null,1500,"Open",{"$nulls":4},{"$f":"VLOOKUP(D11,Sheet2!A26:M1665,6,0)","v":1328.65},null,null,"H"]
[3,"2019-08-09",null,"TATACHEM","Buy",566,534,583.5,"620-640","Profit of Rs.17.50/-",{"$f":"H12-F12","v":17.5},{"$f":"K12/F12","v":{"v":0.030918727915194347,"d":"3.09%"}},"Successful","2019-09-05",{"$nulls":3},"H"]
[4,"2019-08-19",null,"TATAELXSI","Buy",635,597,660.5,"700-720","Part Profit of Rs.25.50/-",{"$f":"H13-F13","v":25.5},{"$f":"K13/F13","v":{"v":0.04015748031496063,"d":"4.02%"}},"Successful","2019-08-27",{"$f":"VLOOKUP(D13,Sheet2!A36:M1675,6,0)","v":629.7},null,null,"R"]
[5,"2019-08-23",null,"IOC","Buy",122.5,114.4,122.75,135,"Neutral",{"$f":"H14-F14","v":0.25},{"$f":"K14/F14","v":{"v":2.0408163265306124E-3,"d":"0.20%"}},"Neutral","2019-09-03",{"$nulls":3},"H"]
[6,"2019-08-30",null,"BIOCON","Buy",229.5,214.3,237,"255-260","Part Profit of Rs.7.5/-",{"$f":"H15-F15","v":7.5},{"$f":"K15/F15","v":{"v":0.032679738562091505,"d":"3.27%"}},"Successful","2019-08-30",{"$f":"VLOOKUP(D15,Sheet2!A38:M1677,6,0)","v":236.45},null,null,"R"]
[7,"2019-09-03",null,"POWERGRID","Buy","197-199",186,null,"220-224","Open",{"$nulls":4},{"$f":"VLOOKUP(D16,Sheet2!A31:M1670,6,0)","v":203.5},null,null,"R"]
[8,"2019-09-04",null,"JUSTDIAL","Buy","707-712",673,null,"775-785","Open",{"$nulls":4},{"$f":"VLOOKUP(D17,Sheet2!A32:M1671,6,0)","v":707.25},null,null,"R"]
{"$rows_empty":12}
["CLBS = Closing Basis ***",{"$nulls":4},"Reinitiated $"]
["Dividend adjusted <>",{"$nulls":4},"Revised stoploss #"]
{"$rows_left_out":218}
{"sheet":"Sheet2","index":6,"n_rows":1899,"n_cols":14,"rows_kept":1899,"hidden":true}
["SYMBOL","SERIES","OPEN","HIGH","LOW","CLOSE","LAST","PREVCLOSE","TOTTRDQTY","TOTTRDVAL","TIMESTAMP","TOTALTRADES","ISIN","ISIN"]
["20MICRONS","EQ",34,34.95,33.2,33.65,33.65,33.4,33307,1133949.75,"2019-09-06",490,"INE144J01027"]
["21STCENMGM","EQ",12.35,12.35,12.3,12.3,12.3,12.3,466,5746.8,"2019-09-06",5,"INE253B01015"]
["3IINFOTECH","EQ",1.75,2,1.7,1.95,2,1.7,2200294,4055616.4,"2019-09-06",789,"INE748C01020"]
["3MINDIA","EQ",20463.45,20719.95,20450.1,20515.35,20598,20407.8,1794,36841746.35,"2019-09-06",883,"INE470A01017"]
["3PLAND","EQ",6.1,6.1,5.9,5.9,5.9,6.1,2679,16116.1,"2019-09-06",16,"INE105C01023"]
["5PAISA","EQ",137.95,138,131.8,136.6,135.45,133.65,16567,2247587.55,"2019-09-06",393,"INE618L01018"]
["63MOONS","EQ",110.85,114.1,105.55,110.65,111,108.7,281033,31412117.25,"2019-09-06",4127,"INE111B01023"]
["8KMILES","EQ",54.5,54.5,52,53.3,53.75,53.9,41283,2195900.65,"2019-09-06",568,"INE650K01021"]
["A2ZINFRA","EQ",9.5,9.5,9.3,9.3,9.3,9.4,193442,1808518.8,"2019-09-06",317,"INE619I01012"]
["AARTIDRUGS","EQ",455.25,462.65,453.1,454.5,454.95,455.25,3585,1632282.75,"2019-09-06",310,"INE767A01016"]
["AARTIIND","EQ",1594,1594.4,1572.25,1581.1,1574,1582.1,11948,18867876.95,"2019-09-06",1377,"INE769A01020"]
["AARVEEDEN","EQ",13.7,14.9,13.7,14.55,14.6,13.45,4354,61562.85,"2019-09-06",92,"INE273D01019"]
["AAVAS","EQ",1565,1585.1,1548,1565.45,1560,1550.25,88435,138334657.35,"2019-09-06",3620,"INE216P01012"]
["ABAN","EQ",25.1,25.5,24.15,25.25,25.3,24.75,82235,2065314.9,"2019-09-06",852,"INE421A01028"]
["ABB","EQ",1319.8,1339,1310.35,1319.3,1322,1316.15,28271,37448735.2,"2019-09-06",2196,"INE117A01022"]
["ABBOTINDIA","EQ",9479.9,9779,9470,9726.25,9770,9489.8,5567,53602792.05,"2019-09-06",1724,"INE358A01014"]
["ABCAPITAL","EQ",92.4,93,92,92.6,92.65,91.5,1325343,122644122.1,"2019-09-06",9458,"INE674K01013"]
["ABFRL","EQ",188.95,195,187.8,194.15,194.6,188.8,265200,51010663.2,"2019-09-06",6546,"INE647O01011"]
["ABSLNN50ET","EQ",256.7,261.59,251.21,259.41,259.41,260.15,115,29969.27,"2019-09-06",10,"INF209KB1B87"]
{"$rows_left_out":1695}
{"sheet":"Sheet1","index":7,"n_rows":0,"n_cols":0,"rows_kept":0,"hidden":true}

{"sheet":"Sheet3","index":8,"n_rows":0,"n_cols":0,"rows_kept":0,"hidden":true}

{"sheet":"Sheet4","index":9,"n_rows":0,"n_cols":0,"rows_kept":0,"hidden":true}

{"sheet":"Sheet5","index":10,"n_rows":0,"n_cols":0,"rows_kept":0,"hidden":true}