{"text_format":"3","workbook":"xlsx","n_sheets":6,"sheets":["Main","Future Intra","Cash Intra","MidCap Intra","Bulk Deals","Call Tracker (Equity & F&O)"],"not_rendered":{"images":2,"defined_names":3},"read":"whole","date_system":"1900"}

{"sheet":"Main","index":0,"n_rows":27,"n_cols":11,"rows_kept":27}
[null,"                                                                                                 "]
{"$rows_empty":8}
[null,"2022-08-08"]
[]
[null,"Sheet No.","Template Name","Summary"]
[null,1,"Future Intra","For Intraday trading in F&O segment"]
[null,2,"Cash Intra","For Intraday trading in cash market segment"]
[null,3,"Mid-cap Intra","For Intraday trading in Mid-cap stocks"]
[null,4,"Bulk Deals","Reveals Bulk Deals carried on NSE & BSE"]
[null,5,"Call Tracker"]
{"$rows_empty":9}
[{"$nulls":10},"`"]

{"sheet":"Future Intra","index":1,"n_rows":238,"n_cols":16,"rows_kept":238,"merged":[[8,0,9,0],[8,1,9,1],[8,2,9,2],[8,3,9,3],[8,6,8,8],[8,9,8,11]]}
[]
[]
[]
[]
[{"$nulls":12},"Back to Main Page"]
["FOR INTRA DAY TRADING",{"$nulls":10},{"$f":"Main!B10","v":"2022-08-08"}]
[]
[]
["Sr.no","Sector","Scrip","Expiry Date","CLOSE RATE","Pivot Point","Supports",null,null,"Resistances"]
[{"$nulls":4},"Point","Point","S1","S2","S3","R1","R2","R3","HIGH","LOW","OI","% Change in OI"]
[1,"Index","NIFTY","2022-08-25",17416.15,17431.45,{"v":17348.550000000003,"d":"17348.55"},17280.95,{"v":17198.050000000003,"d":"17198.05"},{"v":17499.050000000003,"d":"17499.05"},{"v":17581.950000000004,"d":"17581.95"},{"v":17649.550000000003,"d":"17649.55"},17514.35,17363.85,12111250,{"v":0.019980629947785076,"d":"2.00%"}]
[2,"Index","BANKNIFTY","2022-08-25",37959.45,{"v":37983.21666666667,"d":"37983.22"},{"v":37780.73333333334,"d":"37780.73"},{"v":37602.01666666667,"d":"37602.02"},{"v":37399.53333333334,"d":"37399.53"},{"v":38161.933333333334,"d":"38161.93"},{"v":38364.41666666666,"d":"38364.42"},{"v":38543.13333333333,"d":"38543.13"},38185.7,37804.5,2718575,{"v":0.03835723698031052,"d":"3.84%"}]
[3,"Index","FINNIFTY","2022-08-30",17558.05,{"v":17560.916666666668,"d":"17560.92"},{"v":17462.183333333334,"d":"17462.18"},{"v":17366.316666666666,"d":"17366.32"},{"v":17267.583333333332,"d":"17267.58"},{"v":17656.783333333336,"d":"17656.78"},{"v":17755.516666666666,"d":"17755.52"},{"v":17851.38333333334,"d":"17851.38"},17659.65,17465.05,5760,{"v":0.45454545454545453,"d":"45.45%"}]
[4,"Index","MIDCPNIFTY","2022-08-30",7444.25,{"v":7306.216666666667,"d":"7306.22"},{"v":7168.183333333334,"d":"7168.18"},{"v":6892.116666666667,"d":"6892.12"},{"v":6754.083333333334,"d":"6754.08"},{"v":7582.283333333335,"d":"7582.28"},{"v":7720.3166666666675,"d":"7720.32"},{"v":7996.383333333335,"d":"7996.38"},7444.25,7030.15,225,{"v":0,"d":"0.00%"}]
[5,"Chemical","AARTIIND","2022-08-25",818.05,{"v":819.3499999999999,"d":"819.35"},{"v":811.7999999999998,"d":"811.80"},805.55,{"v":797.9999999999999,"d":"798.00"},{"v":825.5999999999998,"d":"825.60"},833.15,{"v":839.3999999999997,"d":"839.40"},826.9,813.1,3293750,{"v":-3.5998971457958345E-3,"d":"-0.36%"}]
[6,"Capital_Goods","ABB","2022-08-25",2698.75,{"v":2712.9166666666665,"d":"2712.92"},{"v":2668.883333333333,"d":"2668.88"},{"v":2639.016666666667,"d":"2639.02"},{"v":2594.9833333333336,"d":"2594.98"},{"v":2742.783333333333,"d":"2742.78"},{"v":2786.8166666666666,"d":"2786.82"},{"v":2816.6833333333325,"d":"2816.68"},2756.95,2683.05,801750,{"v":-0.025820170109356014,"d":"-2.58%"}]
[7,"Pharma","ABBOTINDIA","2022-08-25",20550.45,{"v":20523.883333333335,"d":"20523.88"},{"v":20397.86666666667,"d":"20397.87"},{"v":20245.283333333333,"d":"20245.28"},{"v":20119.266666666666,"d":"20119.27"},{"v":20676.46666666667,"d":"20676.47"},{"v":20802.48333333334,"d":"20802.48"},{"v":20955.066666666673,"d":"20955.07"},20649.9,20371.3,38680,{"v":-0.014271151885830785,"d":"-1.43%"}]
[8,"Others","ABCAPITAL","2022-08-25",{"v":105.7,"d":"105.70"},{"v":105.86666666666667,"d":"105.87"},{"v":104.88333333333335,"d":"104.88"},{"v":104.06666666666668,"d":"104.07"},{"v":103.08333333333336,"d":"103.08"},{"v":106.68333333333335,"d":"106.68"},{"v":107.66666666666667,"d":"107.67"},{"v":108.48333333333335,"d":"108.48"},106.85,105.05,22021200,{"v":-0.028816384853536558,"d":"-2.88%"}]
[9,"Textile","ABFRL","2022-08-25",278.95,{"v":278.26666666666665,"d":"278.27"},{"v":273.8833333333333,"d":"273.88"},{"v":268.81666666666666,"d":"268.82"},{"v":264.43333333333334,"d":"264.43"},{"v":283.3333333333333,"d":"283.33"},{"v":287.71666666666664,"d":"287.72"},{"v":292.7833333333333,"d":"292.78"},282.65,273.2,12771200,{"v":0.025041736227045076,"d":"2.50%"}]
[10,"Cement","ACC","2022-08-25",2266.35,{"v":2253.816666666667,"d":"2253.82"},{"v":2236.383333333334,"d":"2236.38"},{"v":2206.416666666667,"d":"2206.42"},{"v":2188.983333333334,"d":"2188.98"},{"v":2283.783333333334,"d":"2283.78"},{"v":2301.2166666666676,"d":"2301.22"},{"v":2331.1833333333343,"d":"2331.18"},2271.25,2223.85,2352000,{"v":-0.012179756404871903,"d":"-1.22%"}]
{"$rows_left_out":207}
{"sheet":"Cash Intra","index":2,"n_rows":246,"n_cols":13,"rows_kept":246,"merged":[[7,0,8,0],[7,1,8,1],[7,2,8,2],[7,3,8,3],[7,4,7,6],[7,7,7,9]]}
[]
[]
[]
[]
[{"$nulls":12},"Back to Main Page"]
["FOR INTRA DAY TRADING",{"$nulls":9},{"$f":"Main!B10","v":"2022-08-08"}]
[]
["Sr.no",null,"CLOSE RATE","Pivot Point","Supports",null,null,"Resistances"]
[{"$nulls":4},"S1","S2","S3","R1","R2","R3","HIGH","LOW","Total Trade Quanity in Lakhs"]
[1,"Nifty 50",17397.5,{"v":17406.883333333335,"d":"17406.88"},{"v":17339.36666666667,"d":"17339.37"},{"v":17281.233333333334,"d":"17281.23"},{"v":17213.716666666667,"d":"17213.72"},{"v":17465.01666666667,"d":"17465.02"},{"v":17532.53333333334,"d":"17532.53"},{"v":17590.66666666667,"d":"17590.67"},17474.4,17348.75]
[2,"Nifty Bank",37920.6,{"v":37950.31666666666,"d":"37950.32"},{"v":37750.18333333332,"d":"37750.18"},{"v":37579.76666666666,"d":"37579.77"},{"v":37379.633333333324,"d":"37379.63"},{"v":38120.733333333315,"d":"38120.73"},{"v":38320.86666666666,"d":"38320.87"},{"v":38491.28333333331,"d":"38491.28"},38150.45,37779.9]
[3,"Nifty CPSE",2579.65,{"v":2573.6333333333337,"d":"2573.63"},{"v":2553.5666666666675,"d":"2553.57"},{"v":2527.483333333334,"d":"2527.48"},{"v":2507.416666666668,"d":"2507.42"},{"v":2599.716666666667,"d":"2599.72"},{"v":2619.7833333333338,"d":"2619.78"},{"v":2645.866666666667,"d":"2645.87"},2593.7,2547.55]
[4,"Nifty Infra",4950.65,4947.55,{"v":4933.950000000001,"d":"4933.95"},{"v":4917.250000000001,"d":"4917.25"},{"v":4903.6500000000015,"d":"4903.65"},4964.25,4977.85,{"v":4994.549999999999,"d":"4994.55"},4961.15,4930.85]
[5,"Nifty IT",29973.55,{"v":29950.983333333334,"d":"29950.98"},{"v":29821.766666666666,"d":"29821.77"},{"v":29669.983333333334,"d":"29669.98"},{"v":29540.766666666666,"d":"29540.77"},{"v":30102.766666666666,"d":"30102.77"},{"v":30231.983333333334,"d":"30231.98"},{"v":30383.766666666666,"d":"30383.77"},30080.2,29799.2]
[6,"Nifty PSE",4052.15,{"v":4045.6,"d":"4045.60"},4026.25,4000.35,{"v":3981,"d":"3981.00"},{"v":4071.5,"d":"4071.50"},{"v":4090.8499999999995,"d":"4090.85"},4116.75,4064.95,4019.7]
[7,"Nifty Midcap 50",8225.9,{"v":8226.466666666665,"d":"8226.47"},{"v":8199.48333333333,"d":"8199.48"},{"v":8173.066666666664,"d":"8173.07"},{"v":8146.0833333333285,"d":"8146.08"},{"v":8252.883333333331,"d":"8252.88"},{"v":8279.866666666665,"d":"8279.87"},{"v":8306.283333333333,"d":"8306.28"},8253.45,8200.05]
[8,"ABB",2688.2,2701.85,{"v":2661.7,"d":"2661.70"},{"v":2635.2,"d":"2635.20"},{"v":2595.0499999999997,"d":"2595.05"},2728.35,{"v":2768.5000000000005,"d":"2768.50"},{"v":2795,"d":"2795.00"},2742,2675.35,2.72399]
[9,"ACC",2254.8,{"v":2244.133333333333,"d":"2244.13"},{"v":2229.2666666666664,"d":"2229.27"},{"v":2203.733333333333,"d":"2203.73"},{"v":2188.8666666666663,"d":"2188.87"},{"v":2269.6666666666665,"d":"2269.67"},{"v":2284.5333333333333,"d":"2284.53"},{"v":2310.0666666666666,"d":"2310.07"},2259,2218.6,2.91021]
[10,"AUBANK",648,{"v":642.1999999999999,"d":"642.20"},{"v":634.2999999999998,"d":"634.30"},{"v":620.5999999999999,"d":"620.60"},{"v":612.6999999999998,"d":"612.70"},{"v":655.8999999999999,"d":"655.90"},{"v":663.8,"d":"663.80"},{"v":677.4999999999999,"d":"677.50"},650.1,628.5,18.38153]
[11,"ABBOTINDIA",20426.25,{"v":20426.083333333332,"d":"20426.08"},{"v":20252.166666666664,"d":"20252.17"},{"v":20078.083333333332,"d":"20078.08"},{"v":19904.166666666664,"d":"19904.17"},{"v":20600.166666666664,"d":"20600.17"},{"v":20774.08333333333,"d":"20774.08"},{"v":20948.166666666664,"d":"20948.17"},20600,20252,0.11848]
{"$rows_left_out":227}
{"sheet":"MidCap Intra","index":3,"n_rows":533,"n_cols":13,"rows_kept":533,"merged":[[0,0,0,1],[8,0,9,0],[8,1,9,1],[8,2,9,2],[8,3,9,3],[8,4,8,6],[8,7,8,9]]}
[]
[]
[]
[]
[{"$nulls":11},"Back To Main Page"]
["FOR INTRA DAY TRADING",{"$nulls":9},{"$f":"Main!B10","v":"2022-08-08"}]
[null,null," "]
[]
["Sr.no","Scrip","CLOSE RATE","Pivot Point","Supports",null,null,"Resistances"]
[{"$nulls":4},"S1","S2","S3","R1","R2","R3","HIGH","LOW","Total Trade Quanity in Lakhs"]
[1,"3MINDIA",23702.25,{"v":23637.416666666668,"d":"23637.42"},{"v":23174.833333333336,"d":"23174.83"},{"v":22647.416666666668,"d":"22647.42"},{"v":22184.833333333336,"d":"22184.83"},{"v":24164.833333333336,"d":"24164.83"},{"v":24627.41666666667,"d":"24627.42"},{"v":25154.833333333336,"d":"25154.83"},24100,23110,0.03603]
[2,"ABB",2688.2,2701.85,{"v":2661.7,"d":"2661.70"},{"v":2635.2,"d":"2635.20"},{"v":2595.0499999999997,"d":"2595.05"},2728.35,{"v":2768.5000000000005,"d":"2768.50"},{"v":2795,"d":"2795.00"},2742,2675.35,2.72399]
[3,"ACC",2254.8,{"v":2244.133333333333,"d":"2244.13"},{"v":2229.2666666666664,"d":"2229.27"},{"v":2203.733333333333,"d":"2203.73"},{"v":2188.8666666666663,"d":"2188.87"},{"v":2269.6666666666665,"d":"2269.67"},{"v":2284.5333333333333,"d":"2284.53"},{"v":2310.0666666666666,"d":"2310.07"},2259,2218.6,2.91021]
[4,"AIAENG",2378.9,{"v":2395.516666666667,"d":"2395.52"},{"v":2341.3833333333337,"d":"2341.38"},{"v":2303.866666666667,"d":"2303.87"},{"v":2249.7333333333336,"d":"2249.73"},{"v":2433.0333333333338,"d":"2433.03"},{"v":2487.166666666667,"d":"2487.17"},{"v":2524.683333333334,"d":"2524.68"},2449.65,2358,1.37824]
[5,"APLAPOLLO",1029.6,{"v":1043.5,"d":"1043.50"},{"v":1012,"d":"1012.00"},{"v":994.4000000000001,"d":"994.40"},{"v":962.9000000000001,"d":"962.90"},{"v":1061.1,"d":"1061.10"},{"v":1092.6,"d":"1092.60"},{"v":1110.1999999999998,"d":"1110.20"},1075,1025.9,6.89827]
[6,"AUBANK",648,{"v":642.1999999999999,"d":"642.20"},{"v":634.2999999999998,"d":"634.30"},{"v":620.5999999999999,"d":"620.60"},{"v":612.6999999999998,"d":"612.70"},{"v":655.8999999999999,"d":"655.90"},{"v":663.8,"d":"663.80"},{"v":677.4999999999999,"d":"677.50"},650.1,628.5,18.38153]
[7,"AARTIDRUGS",426.65,429.55,{"v":423.1,"d":"423.10"},419.55,{"v":413.1,"d":"413.10"},{"v":433.1,"d":"433.10"},{"v":439.54999999999995,"d":"439.55"},{"v":443.1,"d":"443.10"},436,426,0.57274]
[8,"AAVAS",2222.75,2237.25,{"v":2195.5,"d":"2195.50"},2168.25,{"v":2126.5,"d":"2126.50"},{"v":2264.5,"d":"2264.50"},2306.25,{"v":2333.5,"d":"2333.50"},2279,2210,0.44656]
[9,"ABBOTINDIA",20426.25,{"v":20426.083333333332,"d":"20426.08"},{"v":20252.166666666664,"d":"20252.17"},{"v":20078.083333333332,"d":"20078.08"},{"v":19904.166666666664,"d":"19904.17"},{"v":20600.166666666664,"d":"20600.17"},{"v":20774.08333333333,"d":"20774.08"},{"v":20948.166666666664,"d":"20948.17"},20600,20252,0.11848]
[10,"ADANIENT",2698.4,{"v":2717.016666666667,"d":"2717.02"},{"v":2666.3833333333337,"d":"2666.38"},{"v":2634.366666666667,"d":"2634.37"},{"v":2583.7333333333336,"d":"2583.73"},{"v":2749.0333333333338,"d":"2749.03"},{"v":2799.666666666667,"d":"2799.67"},{"v":2831.683333333334,"d":"2831.68"},2767.65,2685,16.39981]
{"$rows_left_out":508}
{"sheet":"Bulk Deals","index":4,"n_rows":74,"n_cols":8,"rows_kept":74,"merged":[[4,0,4,1],[4,2,4,3],[6,1,6,2]]}
[" "]
[]
[]
[]
[]
[{"$nulls":4},"Back To Main Page"]
["Subject :","BULK DEAL",null,{"$f":"Main!B10","v":"2022-08-08"}]
[]
["Date","Scrip code","Scrip Name","Client Name","Buy / Sell","Quantity Traded","Trade Price / Wt.Avg.trade price","Exchange  "]
["2022-08-05",509053,"BANASFN","MULTIPLIER SHARE & STOCK ADVISORS PRIVATE LIMITED","BUY",{"v":527907,"d":"527,907"},21.25,"BSE"]
["2022-08-05",509053,"BANASFN","MULTIPLIER SHARE & STOCK ADVISORS PRIVATE LIMITED","SELL",{"v":391018,"d":"391,018"},21.31,"BSE"]
["2022-08-05",513353,"COCHINM","SETU SECURITIES PVT LTD","SELL",{"v":47712,"d":"47,712"},161.28,"BSE"]
["2022-08-05",513353,"COCHINM","SETU SECURITIES PVT LTD","BUY",{"v":46716,"d":"46,716"},158.06,"BSE"]
["2022-08-05",533149,"ESSARSEC","ANAND MOHAN","BUY",{"v":90725,"d":"90,725"},5.38,"BSE"]
["2022-08-05",540377,"IFL","HETALBEN SANDIPKUMAR SONI","BUY",{"v":18000,"d":"18,000"},118.3,"BSE"]
["2022-08-05",540377,"IFL","MOHAMMED MOHSIN HAJIMOHAMMED AJMERWALA","SELL",{"v":18000,"d":"18,000"},118.3,"BSE"]
["2022-08-05",543286,"JETMALL","VIJAYAKUMAR","SELL",{"v":102000,"d":"102,000"},16.81,"BSE"]
["2022-08-05",543286,"JETMALL","TARUNA PANKAJ TATED","BUY",{"v":30000,"d":"30,000"},18.32,"BSE"]
["2022-08-05",500236,"KANELIND","DHIREN KANAIYALAL THAKKAR","SELL",{"v":116000,"d":"116,000"},3.1,"BSE"]
["2022-08-05",538928,"KARNAVATI","NITIN RAJESHBHAI BHUVA","SELL",{"v":80000,"d":"80,000"},33,"BSE"]
{"$rows_left_out":55}
{"sheet":"Call Tracker (Equity & F&O)","index":5,"n_rows":290,"n_cols":18,"rows_kept":290,"merged":[[73,0,74,0],[73,1,74,1],[73,6,74,6],[73,8,74,8],[73,9,74,9],[73,12,74,12],[73,13,74,13],[73,14,74,14],[73,15,74,15]]}
[]
[]
[]
[]
[{"$nulls":12},"Back To Main Page"]
["Retail Research Technical Calls & Fundamental Performance Report for the month of Aug-2022"]
[{"$nulls":12},{"$f":"Main!B10","v":"2022-08-08"}]
[null,"Positional  Call"]
["Sr.no","Date",null,"Company","Rec","Rec Price","Stop Loss***","Call Closed At","Target","Remark","Profit / Loss per Share","All charges","Net Gain / Loss  %","Status","Closed Date","Market Closing Price"]
[1,"2022-05-19",null,"BHARTIARTL","Buy",678,635,707,"750-780","Part profit of Rs.29/-",{"$f":"H10-F10","v":29},{"$f":"(F10*-0.7)/100","v":{"v":-4.7459999999999996,"d":"-4.75"}},{"$f":"(K10+L10)/F10","v":{"v":0.035772861356932154,"d":"3.58%"}},"Successful","2022-08-05",{"$f":"VLOOKUP(D10,'MidCap Intra'!B49:C605,2,0)","v":703.65},null,"H"]
[2,"2022-07-06",null,"REDINGTON","Buy<>",121.4,113.4,128.5,"135-140","Profit of Rs.7.1/-",{"$f":"H11-F11","v":7.099999999999994},{"$f":"(F11*-0.7)/100","v":{"v":-0.8498,"d":"-0.85"}},{"$f":"(K11+L11)/F11","v":{"v":0.051484349258649045,"d":"5.15%"}},"Successful","2022-08-01",null,null,"H"]
[3,"2022-07-13",null,"IOC","Buy","70-71",67,null,"75-77","Open",{"$nulls":5},{"$f":"VLOOKUP(D12,'MidCap Intra'!B51:C607,2,0)","v":73.1},null,"H"]
[4,"2022-07-26",null,"TATACOMM","Buy",1030,970,1094,"1100-1150","Part profit of Rs.64/-",{"$f":"H13-F13","v":64},{"$f":"(F13*-0.7)/100","v":-7.21},{"$f":"(K13+L13)/F13","v":{"v":0.055135922330097085,"d":"5.51%"}},"Successful","2022-08-05",null,null,"H"]
[5,"2022-07-28",null,"ZYDUSLIFE","Buy",350,329,364,"380-390","Part profit of Rs.14/-",{"$f":"H14-F14","v":14},{"$f":"(F14*-0.7)/100","v":{"v":-2.4499999999999997,"d":"-2.45"}},{"$f":"(K14+L14)/F14","v":{"v":0.033,"d":"3.30%"}},"Successful","2022-08-04",{"$f":"VLOOKUP(D14,'MidCap Intra'!B53:C609,2,0)","v":357.6},null,"N"]
[]
[]
[]
["CLBS = Closing Basis ***"]
["Dividend adjusted <>",{"$nulls":4},"Reinitiated $"]
["Part book {}",null,null,"s",null,"Revised stoploss #"]
{"$rows_left_out":264}