{"text_format":"3","workbook":"xlsx","n_sheets":6,"sheets":["Main","Future Intra","Cash Intra","MidCap Intra","Bulk Deals","Call Tracker (Equity & F&O)"],"not_rendered":{"images":4,"defined_names":1},"read":"whole","date_system":"1900"}

{"sheet":"Main","index":0,"n_rows":27,"n_cols":11,"rows_kept":27}
[null,"                                                                                                 "]
[]
[]
[]
[]
[{"$nulls":6}," "]
[]
[]
[]
[null,"2023-11-29"]
[]
[null,"Sheet No.","Template Name","Summary"]
[null,1,"Future Intra","For Intraday trading in F&O segment"]
[null,2,"Cash Intra","For Intraday trading in cash market segment"]
[null,3,"Mid-cap Intra","For Intraday trading in Mid-cap stocks"]
[null,4,"Bulk Deals","Reveals Bulk Deals carried on NSE & BSE"]
[null,5,"Call Tracker"]
{"$rows_empty":9}
[{"$nulls":10},"`"]

{"sheet":"Future Intra","index":1,"n_rows":236,"n_cols":16,"rows_kept":236,"merged":[[8,0,9,0],[8,1,9,1],[8,2,9,2],[8,3,9,3],[8,6,8,8],[8,9,8,11]]}
[]
[]
[]
[]
[{"$nulls":12},"Back to Main Page"]
["FOR INTRA DAY TRADING",{"$nulls":10},{"$f":"Main!B10","v":"2023-11-29"}]
[]
[]
["Sr.no","Sector","Scrip","Expiry Date","CLOSE RATE","Pivot Point","Supports",null,null,"Resistances"]
[{"$nulls":4},"Point","Point","S1","S2","S3","R1","R2","R3","HIGH","LOW","OI","% Change in OI"]
[1,"Index","NIFTY","2023-11-30",{"v":19936.7,"d":"19936.70"},{"v":19906.533333333333,"d":"19906.53"},{"v":19858.066666666666,"d":"19858.07"},{"v":19779.433333333334,"d":"19779.43"},{"v":19730.966666666667,"d":"19730.97"},{"v":19985.166666666664,"d":"19985.17"},{"v":20033.63333333333,"d":"20033.63"},{"v":20112.266666666663,"d":"20112.27"},19955,19827.9,13231600,{"v":0.030699123661148978,"d":"3.07%"}]
[2,"Index","BANKNIFTY","2023-11-30",{"v":43984.3,"d":"43984.30"},{"v":43941.26666666667,"d":"43941.27"},{"v":43834.13333333334,"d":"43834.13"},{"v":43683.96666666667,"d":"43683.97"},{"v":43576.833333333336,"d":"43576.83"},{"v":44091.43333333334,"d":"44091.43"},{"v":44198.56666666667,"d":"44198.57"},{"v":44348.733333333344,"d":"44348.73"},44048.4,43791.1,2997225,{"v":0.059425153891425025,"d":"5.94%"}]
[3,"Index","FINNIFTY","2023-11-28",{"v":19698,"d":"19698.00"},{"v":19688.266666666666,"d":"19688.27"},{"v":19657.433333333334,"d":"19657.43"},{"v":19616.86666666667,"d":"19616.87"},{"v":19586.033333333336,"d":"19586.03"},{"v":19728.833333333332,"d":"19728.83"},{"v":19759.666666666668,"d":"19759.67"},{"v":19800.23333333333,"d":"19800.23"},19719.1,19647.7,156960,{"v":0.7347480106100795,"d":"73.47%"}]
[4,"Index","MIDCPNIFTY","2023-12-22",9550.65,{"v":9533.383333333333,"d":"9533.38"},{"v":9500.466666666667,"d":"9500.47"},{"v":9450.283333333335,"d":"9450.28"},{"v":9417.366666666669,"d":"9417.37"},{"v":9583.566666666666,"d":"9583.57"},{"v":9616.483333333334,"d":"9616.48"},{"v":9666.666666666664,"d":"9666.67"},9566.3,9483.2,588525,{"v":-0.43587347232207047,"d":"-43.59%"}]
[5,"Chemical","AARTIIND","2023-11-30",{"v":530.4,"d":"530.40"},{"v":530.9,"d":"530.90"},{"v":527.3,"d":"527.30"},{"v":524.1999999999999,"d":"524.20"},{"v":520.5999999999999,"d":"520.60"},{"v":534,"d":"534.00"},{"v":537.6000000000001,"d":"537.60"},{"v":540.7,"d":"540.70"},534.5,527.8,15027000,{"v":-0.025612760990792374,"d":"-2.56%"}]
[6,"Capital_Goods","ABB","2023-11-30",{"v":4254.3,"d":"4254.30"},{"v":4240.349999999999,"d":"4240.35"},{"v":4205.949999999999,"d":"4205.95"},{"v":4157.599999999999,"d":"4157.60"},{"v":4123.199999999999,"d":"4123.20"},{"v":4288.699999999999,"d":"4288.70"},{"v":4323.0999999999985,"d":"4323.10"},{"v":4371.449999999999,"d":"4371.45"},4274.75,4192,1303125,{"v":-0.006669842782277275,"d":"-0.67%"}]
[7,"Pharma","ABBOTINDIA","2023-11-30",{"v":23721.1,"d":"23721.10"},{"v":23824.13333333333,"d":"23824.13"},{"v":23585.666666666664,"d":"23585.67"},{"v":23450.233333333334,"d":"23450.23"},{"v":23211.766666666666,"d":"23211.77"},{"v":23959.566666666662,"d":"23959.57"},{"v":24198.03333333333,"d":"24198.03"},{"v":24333.46666666666,"d":"24333.47"},24062.6,23688.7,74200,{"v":-0.019037546271813855,"d":"-1.90%"}]
[8,"Others","ABCAPITAL","2023-11-30",{"v":170.5,"d":"170.50"},{"v":169.66666666666666,"d":"169.67"},{"v":168.4333333333333,"d":"168.43"},{"v":166.36666666666665,"d":"166.37"},{"v":165.1333333333333,"d":"165.13"},{"v":171.73333333333332,"d":"171.73"},{"v":172.96666666666667,"d":"172.97"},{"v":175.03333333333333,"d":"175.03"},170.9,167.6,57137400,{"v":-0.028998807011103973,"d":"-2.90%"}]
[9,"Textile","ABFRL","2023-11-30",{"v":229.2,"d":"229.20"},{"v":229.88333333333335,"d":"229.88"},{"v":227.1166666666667,"d":"227.12"},{"v":225.03333333333336,"d":"225.03"},{"v":222.2666666666667,"d":"222.27"},{"v":231.9666666666667,"d":"231.97"},{"v":234.73333333333335,"d":"234.73"},{"v":236.8166666666667,"d":"236.82"},232.65,227.8,31551000,{"v":-0.05239731375917538,"d":"-5.24%"}]
[10,"Cement","ACC","2023-11-30",1872.65,1862.75,{"v":1831,"d":"1831.00"},1789.35,{"v":1757.6,"d":"1757.60"},{"v":1904.4,"d":"1904.40"},1936.15,{"v":1977.8000000000002,"d":"1977.80"},1894.5,1821.1,5233500,{"v":0.03341034298915941,"d":"3.34%"}]
{"$rows_left_out":196}
{"sheet":"Cash Intra","index":2,"n_rows":245,"n_cols":13,"rows_kept":245,"merged":[[7,0,8,0],[7,1,8,1],[7,2,8,2],[7,3,8,3],[7,4,7,6],[7,7,7,9]]}
[]
[]
[]
[]
[{"$nulls":12},"Back to Main Page"]
["FOR INTRA DAY TRADING",{"$nulls":9},{"$f":"Main!B10","v":"2023-11-29"}]
[]
["Sr.no",null,"CLOSE RATE","Pivot Point","Supports",null,null,"Resistances"]
[{"$nulls":4},"S1","S2","S3","R1","R2","R3","HIGH","LOW","Total Trade Quanity in Lakhs"]
[1,"Nifty 50",{"v":19889.7,"d":"19889.70"},{"v":19868.850000000002,"d":"19868.85"},{"v":19820.850000000006,"d":"19820.85"},{"v":19752.000000000004,"d":"19752.00"},{"v":19704.000000000007,"d":"19704.00"},{"v":19937.700000000004,"d":"19937.70"},{"v":19985.699999999997,"d":"19985.70"},{"v":20054.550000000003,"d":"20054.55"},19916.85,{"v":19800,"d":"19800.00"}]
[2,"Nifty Bank",43880.95,43860.35,{"v":43760.399999999994,"d":"43760.40"},43639.85,{"v":43539.899999999994,"d":"43539.90"},{"v":43980.899999999994,"d":"43980.90"},{"v":44080.84999999999,"d":"44080.85"},{"v":44201.399999999994,"d":"44201.40"},{"v":43960.3,"d":"43960.30"},{"v":43739.8,"d":"43739.80"}]
[3,"Nifty CPSE",{"v":4199.5,"d":"4199.50"},4182.05,4159.25,{"v":4119,"d":"4119.00"},{"v":4096.2,"d":"4096.20"},{"v":4222.3,"d":"4222.30"},{"v":4245.100000000001,"d":"4245.10"},4285.35,4204.85,{"v":4141.8,"d":"4141.80"}]
[4,"Nifty Infra",{"v":6507.3,"d":"6507.30"},{"v":6488.216666666667,"d":"6488.22"},{"v":6462.133333333334,"d":"6462.13"},{"v":6416.966666666667,"d":"6416.97"},{"v":6390.883333333334,"d":"6390.88"},{"v":6533.383333333334,"d":"6533.38"},{"v":6559.466666666666,"d":"6559.47"},{"v":6604.633333333334,"d":"6604.63"},{"v":6514.3,"d":"6514.30"},6443.05]
[5,"Nifty IT",32118.45,{"v":32038.083333333332,"d":"32038.08"},{"v":31888.216666666664,"d":"31888.22"},{"v":31657.98333333333,"d":"31657.98"},{"v":31508.11666666666,"d":"31508.12"},{"v":32268.316666666666,"d":"32268.32"},{"v":32418.183333333334,"d":"32418.18"},{"v":32648.416666666668,"d":"32648.42"},32187.95,31807.85]
[6,"Nifty PSE",{"v":6652,"d":"6652.00"},{"v":6625.366666666666,"d":"6625.37"},{"v":6591.183333333332,"d":"6591.18"},{"v":6530.366666666666,"d":"6530.37"},{"v":6496.183333333332,"d":"6496.18"},{"v":6686.183333333332,"d":"6686.18"},{"v":6720.366666666666,"d":"6720.37"},{"v":6781.183333333332,"d":"6781.18"},6659.55,6564.55]
[7,"Nifty Midcap 50",{"v":12031.6,"d":"12031.60"},{"v":12010.1,"d":"12010.10"},{"v":11979.2,"d":"11979.20"},{"v":11926.800000000001,"d":"11926.80"},{"v":11895.900000000001,"d":"11895.90"},{"v":12062.5,"d":"12062.50"},{"v":12093.399999999998,"d":"12093.40"},{"v":12145.8,"d":"12145.80"},{"v":12041,"d":"12041.00"},{"v":11957.7,"d":"11957.70"}]
[8,"ABB",4255.25,{"v":4246.599999999999,"d":"4246.60"},{"v":4204.199999999999,"d":"4204.20"},4153.15,{"v":4110.749999999999,"d":"4110.75"},{"v":4297.649999999999,"d":"4297.65"},{"v":4340.049999999998,"d":"4340.05"},{"v":4391.0999999999985,"d":"4391.10"},4289,4195.55,1.84551]
[9,"ABBOTINDIA",23697.75,{"v":23811.483333333334,"d":"23811.48"},{"v":23556.266666666666,"d":"23556.27"},{"v":23414.783333333333,"d":"23414.78"},{"v":23159.566666666666,"d":"23159.57"},{"v":23952.966666666667,"d":"23952.97"},{"v":24208.183333333334,"d":"24208.18"},{"v":24349.666666666668,"d":"24349.67"},24066.7,23670,0.04778]
[10,"ABCAPITAL",170.1,{"v":169.6,"d":"169.60"},168.35,{"v":166.6,"d":"166.60"},165.35,171.35,{"v":172.6,"d":"172.60"},174.35,170.85,167.85,24.00141]
[11,"ABFRL",228.35,{"v":229.13333333333335,"d":"229.13"},{"v":226.2666666666667,"d":"226.27"},{"v":224.18333333333337,"d":"224.18"},{"v":221.31666666666672,"d":"221.32"},{"v":231.2166666666667,"d":"231.22"},{"v":234.08333333333331,"d":"234.08"},{"v":236.16666666666669,"d":"236.17"},232,227.05,22.13682]
{"$rows_left_out":226}
{"sheet":"MidCap Intra","index":3,"n_rows":530,"n_cols":13,"rows_kept":530,"merged":[[0,0,0,1],[8,0,9,0],[8,1,9,1],[8,2,9,2],[8,3,9,3],[8,4,8,6],[8,7,8,9]]}
[]
[]
[]
[]
[{"$nulls":11},"Back To Main Page"]
["FOR INTRA DAY TRADING",{"$nulls":9},{"$f":"Main!B10","v":"2023-11-29"}]
[null,null," "]
[]
["Sr.no","Scrip","CLOSE RATE","Pivot Point","Supports",null,null,"Resistances"]
[{"$nulls":4},"S1","S2","S3","R1","R2","R3","HIGH","LOW","Total Trade Quanity in Lakhs"]
[1,"360ONE",543.9,{"v":543.6,"d":"543.60"},{"v":539.8000000000001,"d":"539.80"},{"v":535.7,"d":"535.70"},{"v":531.9000000000001,"d":"531.90"},{"v":547.7,"d":"547.70"},{"v":551.5,"d":"551.50"},{"v":555.6,"d":"555.60"},547.4,539.5,2.42257]
[2,"3MINDIA",30424,{"v":30542.666666666668,"d":"30542.67"},{"v":30187.333333333336,"d":"30187.33"},{"v":29950.666666666668,"d":"29950.67"},{"v":29595.333333333336,"d":"29595.33"},{"v":30779.333333333336,"d":"30779.33"},{"v":31134.66666666667,"d":"31134.67"},{"v":31371.333333333336,"d":"31371.33"},30898,30306,0.047]
[3,"AARTIDRUGS",494.95,492.95,{"v":485,"d":"485.00"},475.05,{"v":467.1,"d":"467.10"},{"v":502.9,"d":"502.90"},{"v":510.8499999999999,"d":"510.85"},{"v":520.8,"d":"520.80"},500.9,483,4.37377]
[4,"AARTIIND",530.05,{"v":531.1,"d":"531.10"},526.95,523.85,{"v":519.7,"d":"519.70"},{"v":534.2,"d":"534.20"},{"v":538.3499999999999,"d":"538.35"},541.45,535.25,528,7.21136]
[5,"AAVAS",1446.3,{"v":1460.1666666666667,"d":"1460.17"},{"v":1427.3833333333334,"d":"1427.38"},{"v":1408.4666666666667,"d":"1408.47"},{"v":1375.6833333333334,"d":"1375.68"},{"v":1479.0833333333335,"d":"1479.08"},{"v":1511.8666666666668,"d":"1511.87"},{"v":1530.7833333333335,"d":"1530.78"},1492.95,1441.25,1.664]
[6,"ABB",4255.25,{"v":4246.599999999999,"d":"4246.60"},{"v":4204.199999999999,"d":"4204.20"},4153.15,{"v":4110.749999999999,"d":"4110.75"},{"v":4297.649999999999,"d":"4297.65"},{"v":4340.049999999998,"d":"4340.05"},{"v":4391.0999999999985,"d":"4391.10"},4289,4195.55,1.84551]
[7,"ABBOTINDIA",23697.75,{"v":23811.483333333334,"d":"23811.48"},{"v":23556.266666666666,"d":"23556.27"},{"v":23414.783333333333,"d":"23414.78"},{"v":23159.566666666666,"d":"23159.57"},{"v":23952.966666666667,"d":"23952.97"},{"v":24208.183333333334,"d":"24208.18"},{"v":24349.666666666668,"d":"24349.67"},24066.7,23670,0.04778]
[8,"ACC",1869,{"v":1861.8333333333333,"d":"1861.83"},{"v":1832.1666666666665,"d":"1832.17"},{"v":1795.3333333333333,"d":"1795.33"},{"v":1765.6666666666665,"d":"1765.67"},{"v":1898.6666666666665,"d":"1898.67"},{"v":1928.333333333333,"d":"1928.33"},{"v":1965.1666666666665,"d":"1965.17"},1891.5,1825,9.34618]
[9,"ADANIENT",2423.5,{"v":2403.633333333333,"d":"2403.63"},{"v":2294.8666666666663,"d":"2294.87"},{"v":2166.233333333333,"d":"2166.23"},{"v":2057.4666666666662,"d":"2057.47"},{"v":2532.2666666666664,"d":"2532.27"},{"v":2641.033333333333,"d":"2641.03"},{"v":2769.6666666666665,"d":"2769.67"},2512.4,2275,119.72275]
[10,"ADANIGREEN",1052.8,{"v":1035.6000000000001,"d":"1035.60"},{"v":972.2000000000003,"d":"972.20"},{"v":891.6000000000001,"d":"891.60"},{"v":828.2000000000003,"d":"828.20"},{"v":1116.2000000000003,"d":"1116.20"},{"v":1179.6000000000004,"d":"1179.60"},{"v":1260.2000000000003,"d":"1260.20"},1099,955,115.65049]
{"$rows_left_out":511}
{"sheet":"Bulk Deals","index":4,"n_rows":158,"n_cols":8,"rows_kept":158,"merged":[[4,0,4,1],[4,2,4,3],[6,1,6,2]]}
[" "]
[]
[]
[]
[]
[{"$nulls":4},"Back To Main Page"]
["Subject :","BULK DEAL",null,{"$f":"Main!B10","v":"2023-11-29"}]
[]
["Date","Scrip code","Scrip Name","Client Name","Buy / Sell","Quantity Traded","Trade Price / Wt.Avg.trade price","Exchange  "]
["2023-11-28",534733,"AERPACE","RAMASWAMY PEDINEKALUVA","BUY",{"v":320000,"d":"320,000"},3.89,"BSE"]
["2023-11-28",534733,"AERPACE","MULTIPLIER SHARE & STOCK ADVISORS PRIVATE LIMITED","SELL",{"v":167506,"d":"167,506"},3.89,"BSE"]
["2023-11-28",534733,"AERPACE","VIVEK KANDA","SELL",{"v":226185,"d":"226,185"},3.89,"BSE"]
["2023-11-28",534733,"AERPACE","ANILKUMAR","SELL",{"v":730000,"d":"730,000"},3.89,"BSE"]
["2023-11-28",543453,"ALKOSIGN","MOHIT KUMAR MATHUR","BUY",{"v":61500,"d":"61,500"},223.97,"BSE"]
["2023-11-28",539277,"ALSTONE","BAGH KOTHI INVESTMENT AND FINANCE PRIVATE LIMITED","SELL",{"v":7000000,"d":"7,000,000"},0.59,"BSE"]
["2023-11-28",539277,"ALSTONE","AQUARIUS FINCAP & CREDITS PRIVATE LIMITED","SELL",{"v":8989859,"d":"8,989,859"},0.59,"BSE"]
["2023-11-28",539277,"ALSTONE","HUM TUM MARKETING PRIVATE LIMITED","SELL",{"v":12500000,"d":"12,500,000"},0.59,"BSE"]
["2023-11-28",544025,"ARROWHEAD","MULTIPLIER SHARE & STOCK ADVISORS PRIVATE LIMITED","BUY",{"v":16200,"d":"16,200"},250,"BSE"]
["2023-11-28",544025,"ARROWHEAD","SAHASTRAA ADVISORS PRIVATE LIMITED","BUY",{"v":9600,"d":"9,600"},250,"BSE"]
["2023-11-28",532406,"AVANTEL","KANTHETI","SELL",{"v":532511,"d":"532,511"},130.88,"BSE"]
{"$rows_left_out":139}
{"sheet":"Call Tracker (Equity & F&O)","index":5,"n_rows":347,"n_cols":19,"rows_kept":347,"merged":[[43,0,44,0],[43,1,44,1],[43,9,44,9],[43,12,44,12],[43,13,44,13],[43,14,44,14],[43,15,44,15],[64,0,65,0],[64,1,65,1],[64,6,65,6],[64,8,65,8],[64,9,65,9],[64,12,65,12],[64,13,65,13],[64,14,65,14],[64,15,65,15],[82,0,83,0],[82,1,83,1],[82,9,83,9],[82,12,83,12],[82,14,83,14],[84,0,85,0],[84,1,85,1],[84,9,85,9],[84,12,85,12],[84,14,85,14],[84,15,85,15],[87,0,88,0],[87,1,88,1],[87,9,88,9],[87,12,88,12],[87,14,88,14],[87,15,88,15],[90,0,91,0],[90,1,91,1],[90,9,91,9],[90,12,91,12],[90,14,91,14],[90,15,91,15],[92,0,93,0],[92,1,93,1],[92,9,93,9],[92,12,93,12],[92,14,93,14],[92,15,93,15],[94,0,95,0],[94,1,95,1],[94,9,95,9],[94,12,95,12],[94,14,95,14],[94,15,95,15],[97,0,98,0],[97,1,98,1],[97,9,98,9],[97,12,98,12],[97,14,98,14],[97,15,98,15],[100,0,101,0],[100,1,101,1],[100,9,101,9],[100,12,101,12],[100,14,101,14],[100,15,101,15],[103,0,104,0],[103,1,104,1],[103,9,104,9],[103,12,104,12],[103,14,104,14],[103,15,104,15],[108,0,109,0],[108,1,109,1],[108,9,109,9],[108,12,109,12],[108,14,109,14],[108,15,109,15],[110,0,111,0],[110,1,111,1],[110,9,111,9],[110,12,111,12],[110,14,111,14],[110,15,111,15],[112,0,113,0],[112,1,113,1],[112,9,113,9],[112,14,113,14],[112,15,113,15],[114,0,115,0],[114,1,115,1],[114,9,115,9],[114,12,115,12],[114,14,115,14],[114,15,115,15],[118,0,119,0],[118,1,119,1],[118,9,119,9]]}
[]
[]
[]
[]
[{"$nulls":12},"Back To Main Page"]
["Retail Research Technical Calls & Fundamental Performance Report for the month of November-2023"]
[{"$nulls":12},{"$f":"Main!B10","v":"2023-11-29"}]
[null,"Positional  Call"]
["Sr.no","Date",null,"Company","Rec","Rec Price","Stop Loss***","Call Closed At","Target","Remark","Profit / Loss per Share","All charges","Net Gain / Loss  %","Status","Closed Date","Market Closing Price","Second Buying Date"]
[1,"2023-09-12",null,"ARE&M","Accu <>",634.2,603.2,669,"690-720","Profit of Rs.34.8/-",{"$f":"H10-F10","v":34.799999999999955},{"$f":"(F10*-0.3)/100","v":{"v":-1.9026000000000003,"d":"-1.90"}},{"$f":"(K10+L10)/F10","v":{"v":0.051872280037842874,"d":"5.19%"}},"Successful","2023-11-23",null,"2023-10-20",null,"H"]
[2,"2023-09-20",null,"RELIANCE","Accu","2285-2385",2235,null,"2550-2700","Open",{"$nulls":5},{"$f":"VLOOKUP(D11,'MidCap Intra'!$B$11:$C$568,2,0)","v":{"v":2394.4,"d":"2394.40"}},"2023-10-04",null,"H"]
[3,"2023-09-21",null,"VGUARD","Accu","285-305",276,null,"330-350","Open",{"$nulls":5},{"$f":"VLOOKUP(D12,'MidCap Intra'!$B$11:$C$568,2,0)","v":300.55},"2023-10-09",null,"K"]
[4,"2023-10-09",null,"TATASTEEL","Accu",122,117,117,"132-140","Loss of Rs.5/-",{"$f":"H13-F13","v":-5},{"$f":"(F13*-0.3)/100","v":{"v":-0.366,"d":"-0.37"}},{"$f":"(K13+L13)/F13","v":{"v":-0.04398360655737705,"d":"-4.40%"}},"Unsuccessful","2023-11-01",null,"2023-10-23",null,"H"]
[5,"2023-10-13",null,"TCS","Accu <>","3441-3541",3321,null,"3800-4000","Open",{"$nulls":5},{"$f":"VLOOKUP(D14,'MidCap Intra'!$B$11:$C$568,2,0)","v":3470.15},"2023-10-19",null,"H"]
[6,"2023-10-19",null,"TATAMTRDVR","Accu",427,408,453,"465-495","Profit of Rs.26/-",{"$f":"H15-F15","v":26},{"$f":"(F15*-0.3)/100","v":{"v":-1.281,"d":"-1.28"}},{"$f":"(K15+L15)/F15","v":{"v":0.05788992974238876,"d":"5.79%"}},"Successful","2023-11-15",null,"2023-10-25",null,"H"]
[7,"2023-10-20",null,"TATAPOWER","Accu",240.5,227,256,"265-285","Profit of Rs.15.5/-",{"$f":"H16-F16","v":15.5},{"$f":"(F16*-0.3)/100","v":{"v":-0.7214999999999999,"d":"-0.72"}},{"$f":"(K16+L16)/F16","v":{"v":0.06144906444906444,"d":"6.14%"}},"Successful","2023-11-08",null,"2023-10-25",null,"H"]
[8,"2023-10-25",null,"ICICIBANK","Accu","903-929",870,null,"990-1050","Open",{"$nulls":5},{"$f":"VLOOKUP(D17,'MidCap Intra'!$B$11:$C$568,2,0)","v":{"v":925.5,"d":"925.50"}},"2023-10-26",null,"H"]
[9,"2023-11-01",null,"CARBORUNIV","Accu",1060,990,1117.5,"1120-1180","Profit of Rs.57.5/-",{"$f":"H18-F18","v":57.5},{"$f":"(F18*-0.3)/100","v":-3.18},{"$f":"(K18+L18)/F18","v":{"v":0.051245283018867924,"d":"5.12%"}},"Successful","2023-11-17",{"$nulls":3},"H"]
[10,"2023-11-01",null,"EIHOTEL","Accu",222,204,237.5,"245-265","Profit of Rs.15.5/-",{"$f":"H19-F19","v":15.5},{"$f":"(F19*-0.3)/100","v":{"v":-0.6659999999999999,"d":"-0.67"}},{"$f":"(K19+L19)/F19","v":{"v":0.06681981981981981,"d":"6.68%"}},"Successful","2023-11-07",{"$nulls":3},"H"]
[11,"2023-11-06",null,"IDFCFIRSTB","Accu",82.5,77,87.5,"88-94","Profit of Rs.5/-",{"$f":"H20-F20","v":5},{"$f":"(F20*-0.3)/100","v":{"v":-0.2475,"d":"-0.25"}},{"$f":"(K20+L20)/F20","v":{"v":0.05760606060606061,"d":"5.76%"}},"Successful","2023-11-15",{"$nulls":3},"H"]
{"$rows_left_out":320}