{"text_format":"3","workbook":"xlsx","n_sheets":6,"sheets":["Main","Future Intra","Cash Intra","MidCap Intra","Bulk Deals","Call Tracker (Equity & F&O)"],"not_rendered":{"images":2,"defined_names":1},"read":"whole","date_system":"1900"}

{"sheet":"Main","index":0,"n_rows":27,"n_cols":11,"rows_kept":27}
[null,"                                                                                                 "]
{"$rows_empty":8}
[null,"2023-08-07"]
[]
[null,"Sheet No.","Template Name","Summary"]
[null,1,"Future Intra","For Intraday trading in F&O segment"]
[null,2,"Cash Intra","For Intraday trading in cash market segment"]
[null,3,"Mid-cap Intra","For Intraday trading in Mid-cap stocks"]
[null,4,"Bulk Deals","Reveals Bulk Deals carried on NSE & BSE"]
[null,5,"Call Tracker"]
{"$rows_empty":9}
[{"$nulls":10},"`"]

{"sheet":"Future Intra","index":1,"n_rows":236,"n_cols":16,"rows_kept":236,"merged":[[8,0,9,0],[8,1,9,1],[8,2,9,2],[8,3,9,3],[8,6,8,8],[8,9,8,11]]}
[]
[]
[]
[]
[{"$nulls":12},"Back to Main Page"]
["FOR INTRA DAY TRADING",{"$nulls":10},"2023-07-27"]
[]
[]
["Sr.no","Sector","Scrip","Expiry Date","CLOSE RATE","Pivot Point","Supports",null,null,"Resistances"]
[{"$nulls":4},"Point","Point","S1","S2","S3","R1","R2","R3","HIGH","LOW","OI","% Change in OI"]
[1,"Index","NIFTY","2023-08-31",19576.25,{"v":19553,"d":"19553.00"},19509.35,{"v":19442.449999999997,"d":"19442.45"},{"v":19398.799999999996,"d":"19398.80"},{"v":19619.9,"d":"19619.90"},{"v":19663.550000000003,"d":"19663.55"},{"v":19730.450000000004,"d":"19730.45"},19596.65,19486.1,13055850,{"v":0.03564020291039182,"d":"4%"}]
[2,"Index","BANKNIFTY","2023-08-31",{"v":45001.6,"d":"45001.60"},{"v":44950.18333333333,"d":"44950.18"},{"v":44672.41666666666,"d":"44672.42"},{"v":44343.23333333333,"d":"44343.23"},{"v":44065.46666666666,"d":"44065.47"},{"v":45279.366666666654,"d":"45279.37"},{"v":45557.13333333333,"d":"45557.13"},{"v":45886.31666666665,"d":"45886.32"},45227.95,44621,2007660,{"v":-0.021128769207140925,"d":"-2%"}]
[3,"Index","FINNIFTY","2023-08-29",20082.05,{"v":20049.716666666667,"d":"20049.72"},{"v":19974.483333333334,"d":"19974.48"},{"v":19866.916666666668,"d":"19866.92"},{"v":19791.683333333334,"d":"19791.68"},{"v":20157.283333333333,"d":"20157.28"},{"v":20232.51666666667,"d":"20232.52"},{"v":20340.083333333332,"d":"20340.08"},20124.95,19942.15,62520,{"v":-0.1393171806167401,"d":"-14%"}]
[4,"Index","MIDCPNIFTY","2023-08-30",8585.35,{"v":8565.833333333334,"d":"8565.83"},{"v":8521.366666666669,"d":"8521.37"},{"v":8457.383333333335,"d":"8457.38"},{"v":8412.91666666667,"d":"8412.92"},{"v":8629.816666666668,"d":"8629.82"},{"v":8674.283333333331,"d":"8674.28"},{"v":8738.266666666666,"d":"8738.27"},8610.3,8501.85,78750,{"v":0.1487964989059081,"d":"15%"}]
[5,"Chemical","AARTIIND","2023-08-31",{"v":476.4,"d":"476.40"},{"v":477.48333333333335,"d":"477.48"},{"v":474.4666666666667,"d":"474.47"},{"v":472.53333333333336,"d":"472.53"},{"v":469.5166666666667,"d":"469.52"},{"v":479.4166666666667,"d":"479.42"},{"v":482.43333333333334,"d":"482.43"},{"v":484.3666666666667,"d":"484.37"},480.5,475.55,11132000,{"v":0.010897203051216855,"d":"1%"}]
[6,"Capital_Goods","ABB","2023-08-31",{"v":4461.3,"d":"4461.30"},{"v":4428.433333333333,"d":"4428.43"},{"v":4382.866666666667,"d":"4382.87"},{"v":4304.433333333333,"d":"4304.43"},{"v":4258.866666666667,"d":"4258.87"},{"v":4506.866666666667,"d":"4506.87"},{"v":4552.433333333334,"d":"4552.43"},{"v":4630.866666666667,"d":"4630.87"},4474,4350,1436500,{"v":0.03326739795000899,"d":"3%"}]
[7,"Pharma","ABBOTINDIA","2023-08-31",{"v":24047,"d":"24047.00"},{"v":24237.566666666666,"d":"24237.57"},{"v":23784.533333333333,"d":"23784.53"},{"v":23522.066666666666,"d":"23522.07"},{"v":23069.033333333333,"d":"23069.03"},{"v":24500.033333333333,"d":"24500.03"},{"v":24953.066666666666,"d":"24953.07"},{"v":25215.533333333333,"d":"25215.53"},24690.6,23975.1,74240,{"v":0.06483075157773953,"d":"6%"}]
[8,"Others","ABCAPITAL","2023-08-31",{"v":187.7,"d":"187.70"},{"v":189.8166666666667,"d":"189.82"},{"v":184.38333333333338,"d":"184.38"},{"v":181.0666666666667,"d":"181.07"},{"v":175.63333333333338,"d":"175.63"},{"v":193.13333333333338,"d":"193.13"},{"v":198.56666666666672,"d":"198.57"},{"v":201.88333333333338,"d":"201.88"},195.25,186.5,25363800,{"v":0.13508941517641374,"d":"14%"}]
[9,"Textile","ABFRL","2023-08-31",{"v":210.9,"d":"210.90"},{"v":214.1833333333333,"d":"214.18"},{"v":201.91666666666663,"d":"201.92"},{"v":192.9333333333333,"d":"192.93"},{"v":180.66666666666663,"d":"180.67"},{"v":223.16666666666663,"d":"223.17"},{"v":235.43333333333334,"d":"235.43"},{"v":244.41666666666663,"d":"244.42"},226.45,205.2,29382600,{"v":0.05705733794780657,"d":"6%"}]
[10,"Cement","ACC","2023-08-31",{"v":2052.2,"d":"2052.20"},{"v":2048.7166666666667,"d":"2048.72"},{"v":2031.3333333333335,"d":"2031.33"},{"v":2010.4666666666667,"d":"2010.47"},{"v":1993.0833333333335,"d":"1993.08"},{"v":2069.5833333333335,"d":"2069.58"},{"v":2086.9666666666667,"d":"2086.97"},{"v":2107.8333333333335,"d":"2107.83"},2066.1,2027.85,6453600,{"v":-0.005914972273567467,"d":"-1%"}]
{"$rows_left_out":202}
{"sheet":"Cash Intra","index":2,"n_rows":246,"n_cols":13,"rows_kept":246,"merged":[[7,0,8,0],[7,1,8,1],[7,2,8,2],[7,3,8,3],[7,4,7,6],[7,7,7,9]]}
[]
[]
[]
[]
[{"$nulls":12},"Back to Main Page"]
["FOR INTRA DAY TRADING",{"$nulls":9},{"$f":"Main!B10","v":"2023-08-07"}]
[]
["Sr.no",null,"CLOSE RATE","Pivot Point","Supports",null,null,"Resistances"]
[{"$nulls":4},"S1","S2","S3","R1","R2","R3","HIGH","LOW","Total Trade Quanity in Lakhs"]
[1,"Nifty 50",{"v":19517,"d":"19517.00"},{"v":19497.433333333334,"d":"19497.43"},{"v":19456.01666666667,"d":"19456.02"},{"v":19395.033333333336,"d":"19395.03"},{"v":19353.616666666672,"d":"19353.62"},{"v":19558.416666666668,"d":"19558.42"},{"v":19599.833333333332,"d":"19599.83"},{"v":19660.816666666666,"d":"19660.82"},19538.85,19436.45]
[2,"Nifty Bank",{"v":44879.5,"d":"44879.50"},{"v":44839.36666666667,"d":"44839.37"},{"v":44560.683333333334,"d":"44560.68"},{"v":44241.86666666667,"d":"44241.87"},{"v":43963.183333333334,"d":"43963.18"},{"v":45158.183333333334,"d":"45158.18"},{"v":45436.86666666667,"d":"45436.87"},{"v":45755.683333333334,"d":"45755.68"},45118.05,44520.55]
[3,"Nifty CPSE",3442.15,{"v":3442.1666666666665,"d":"3442.17"},{"v":3427.433333333333,"d":"3427.43"},{"v":3412.7166666666662,"d":"3412.72"},{"v":3397.9833333333327,"d":"3397.98"},{"v":3456.883333333333,"d":"3456.88"},{"v":3471.616666666667,"d":"3471.62"},{"v":3486.3333333333335,"d":"3486.33"},{"v":3456.9,"d":"3456.90"},3427.45]
[4,"Nifty Infra",{"v":6010.5,"d":"6010.50"},{"v":6001.349999999999,"d":"6001.35"},{"v":5983.0999999999985,"d":"5983.10"},{"v":5955.699999999999,"d":"5955.70"},{"v":5937.449999999998,"d":"5937.45"},{"v":6028.749999999999,"d":"6028.75"},{"v":6047.000000000001,"d":"6047.00"},{"v":6074.4,"d":"6074.40"},{"v":6019.6,"d":"6019.60"},5973.95]
[5,"Nifty IT",{"v":30436.1,"d":"30436.10"},{"v":30339.733333333334,"d":"30339.73"},{"v":30123.666666666668,"d":"30123.67"},{"v":29811.233333333334,"d":"29811.23"},{"v":29595.166666666668,"d":"29595.17"},{"v":30652.166666666668,"d":"30652.17"},{"v":30868.233333333334,"d":"30868.23"},{"v":31180.666666666668,"d":"31180.67"},{"v":30555.8,"d":"30555.80"},{"v":30027.3,"d":"30027.30"}]
[6,"Nifty PSE",{"v":5382.5,"d":"5382.50"},5395.55,{"v":5364.8,"d":"5364.80"},{"v":5347.1,"d":"5347.10"},5316.35,5413.25,{"v":5444,"d":"5444.00"},{"v":5461.7,"d":"5461.70"},{"v":5426.3,"d":"5426.30"},5377.85]
[7,"Nifty Midcap 50",{"v":10741.9,"d":"10741.90"},{"v":10729.416666666666,"d":"10729.42"},{"v":10678.483333333332,"d":"10678.48"},{"v":10615.066666666666,"d":"10615.07"},{"v":10564.133333333331,"d":"10564.13"},{"v":10792.833333333332,"d":"10792.83"},{"v":10843.766666666666,"d":"10843.77"},{"v":10907.183333333332,"d":"10907.18"},10780.35,{"v":10666,"d":"10666.00"}]
[8,"ABB",4438.05,{"v":4399.349999999999,"d":"4399.35"},{"v":4349.699999999999,"d":"4349.70"},{"v":4261.349999999999,"d":"4261.35"},{"v":4211.699999999999,"d":"4211.70"},{"v":4487.699999999999,"d":"4487.70"},{"v":4537.3499999999985,"d":"4537.35"},{"v":4625.699999999999,"d":"4625.70"},4449,4311,1.9949]
[9,"ABBOTINDIA",23864,{"v":24107.149999999998,"d":"24107.15"},{"v":23556.849999999995,"d":"23556.85"},{"v":23249.699999999997,"d":"23249.70"},{"v":22699.399999999994,"d":"22699.40"},{"v":24414.299999999996,"d":"24414.30"},{"v":24964.6,"d":"24964.60"},{"v":25271.749999999996,"d":"25271.75"},24657.45,23800,0.12946]
[10,"ABCAPITAL",188.5,{"v":189.96666666666667,"d":"189.97"},{"v":185.03333333333333,"d":"185.03"},{"v":181.56666666666666,"d":"181.57"},{"v":176.63333333333333,"d":"176.63"},{"v":193.43333333333334,"d":"193.43"},{"v":198.36666666666667,"d":"198.37"},{"v":201.83333333333334,"d":"201.83"},194.9,186.5,43.1251]
[11,"ABFRL",209.8,{"v":212.9,"d":"212.90"},{"v":200.9,"d":"200.90"},{"v":192,"d":"192.00"},{"v":180,"d":"180.00"},{"v":221.8,"d":"221.80"},{"v":233.8,"d":"233.80"},{"v":242.70000000000002,"d":"242.70"},224.9,204,84.5763]
{"$rows_left_out":227}
{"sheet":"MidCap Intra","index":3,"n_rows":531,"n_cols":13,"rows_kept":531,"merged":[[0,0,0,1],[8,0,9,0],[8,1,9,1],[8,2,9,2],[8,3,9,3],[8,4,8,6],[8,7,8,9]]}
[]
[]
[]
[]
[{"$nulls":11},"Back To Main Page"]
["FOR INTRA DAY TRADING",{"$nulls":9},{"$f":"Main!B10","v":"2023-08-07"}]
[null,null," "]
[]
["Sr.no","Scrip","CLOSE RATE","Pivot Point","Supports",null,null,"Resistances"]
[{"$nulls":4},"S1","S2","S3","R1","R2","R3","HIGH","LOW","Total Trade Quanity in Lakhs"]
[1,"360ONE",507.8,{"v":504.3833333333334,"d":"504.38"},{"v":499.3666666666668,"d":"499.37"},{"v":490.9333333333334,"d":"490.93"},{"v":485.9166666666668,"d":"485.92"},{"v":512.8166666666668,"d":"512.82"},{"v":517.8333333333333,"d":"517.83"},{"v":526.2666666666668,"d":"526.27"},509.4,495.95,0.57906]
[2,"3MINDIA",28165.5,{"v":28165.783333333336,"d":"28165.78"},{"v":27554.716666666674,"d":"27554.72"},{"v":26943.933333333338,"d":"26943.93"},{"v":26332.866666666676,"d":"26332.87"},{"v":28776.566666666673,"d":"28776.57"},{"v":29387.63333333333,"d":"29387.63"},{"v":29998.41666666667,"d":"29998.42"},28776.85,27555,0.01338]
[3,"AARTIDRUGS",573.55,{"v":578.1833333333333,"d":"578.18"},{"v":566.3666666666666,"d":"566.37"},{"v":559.1833333333333,"d":"559.18"},{"v":547.3666666666666,"d":"547.37"},{"v":585.3666666666666,"d":"585.37"},{"v":597.1833333333334,"d":"597.18"},{"v":604.3666666666666,"d":"604.37"},590,571,6.19971]
[4,"AARTIIND",472.7,{"v":473.8,"d":"473.80"},{"v":470.65000000000003,"d":"470.65"},{"v":468.6,"d":"468.60"},{"v":465.45000000000005,"d":"465.45"},475.85,{"v":479,"d":"479.00"},481.05,476.95,471.75,9.78868]
[5,"AAVAS",1559.75,{"v":1557.2333333333333,"d":"1557.23"},{"v":1534.7166666666667,"d":"1534.72"},{"v":1509.6833333333334,"d":"1509.68"},{"v":1487.1666666666667,"d":"1487.17"},{"v":1582.2666666666667,"d":"1582.27"},{"v":1604.7833333333335,"d":"1604.78"},{"v":1629.8166666666666,"d":"1629.82"},1579.75,1532.2,2.74076]
[6,"ABB",4438.05,{"v":4399.349999999999,"d":"4399.35"},{"v":4349.699999999999,"d":"4349.70"},{"v":4261.349999999999,"d":"4261.35"},{"v":4211.699999999999,"d":"4211.70"},{"v":4487.699999999999,"d":"4487.70"},{"v":4537.3499999999985,"d":"4537.35"},{"v":4625.699999999999,"d":"4625.70"},4449,4311,1.9949]
[7,"ABBOTINDIA",23864,{"v":24107.149999999998,"d":"24107.15"},{"v":23556.849999999995,"d":"23556.85"},{"v":23249.699999999997,"d":"23249.70"},{"v":22699.399999999994,"d":"22699.40"},{"v":24414.299999999996,"d":"24414.30"},{"v":24964.6,"d":"24964.60"},{"v":25271.749999999996,"d":"25271.75"},24657.45,23800,0.12946]
[8,"ACC",2042.75,{"v":2037.0166666666667,"d":"2037.02"},{"v":2021.5333333333333,"d":"2021.53"},{"v":2000.3166666666666,"d":"2000.32"},{"v":1984.8333333333333,"d":"1984.83"},{"v":2058.2333333333336,"d":"2058.23"},{"v":2073.7166666666662,"d":"2073.72"},{"v":2094.9333333333334,"d":"2094.93"},2052.5,2015.8,5.25513]
[9,"ADANIENT",2541.8,{"v":2533.9,"d":"2533.90"},{"v":2509.9,"d":"2509.90"},{"v":2478,"d":"2478.00"},{"v":2454,"d":"2454.00"},{"v":2565.8,"d":"2565.80"},{"v":2589.8,"d":"2589.80"},{"v":2621.7000000000003,"d":"2621.70"},2557.9,2502,32.94056]
[10,"ADANIGREEN",1012.55,1027.65,{"v":993.0500000000002,"d":"993.05"},{"v":973.5500000000001,"d":"973.55"},{"v":938.9500000000002,"d":"938.95"},1047.15,1081.75,{"v":1101.2500000000002,"d":"1101.25"},1062.25,1008.15,9.24378]
{"$rows_left_out":512}
{"sheet":"Bulk Deals","index":4,"n_rows":148,"n_cols":8,"rows_kept":148,"merged":[[4,0,4,1],[4,2,4,3],[6,1,6,2]]}
[" "]
[]
[]
[]
[]
[{"$nulls":4},"Back To Main Page"]
["Subject :","BULK DEAL",null,{"$f":"Main!B10","v":"2023-08-07"}]
[]
["Date","Scrip code","Scrip Name","Client Name","Buy / Sell","Quantity Traded","Trade Price / Wt.Avg.trade price","Exchange  "]
["2023-08-04",543319,"AAPLUSTRAD","AJAY SALVI","SELL",{"v":64000,"d":"64,000"},10.95,"BSE"]
["2023-08-04",543941,"AHASOLAR","WORLD FOODS LLP","SELL",{"v":16800,"d":"16,800"},363.3,"BSE"]
["2023-08-04",543941,"AHASOLAR","YUGA STOCKS AND COMMODITIES PRIVATE LIMITED .","BUY",{"v":16000,"d":"16,000"},363.3,"BSE"]
["2023-08-04",543453,"ALKOSIGN","GOVINDARAJAN","BUY",{"v":39000,"d":"39,000"},120,"BSE"]
["2023-08-04",512149,"AVANCE","MULTIPLIER SHARE & STOCK ADVISORS PRIVATE LIMITED","BUY",{"v":3073143,"d":"3,073,143"},1.49,"BSE"]
["2023-08-04",543926,"BIZOTIC","AJAY SALVI","SELL",{"v":80000,"d":"80,000"},52.67,"BSE"]
["2023-08-04",543926,"BIZOTIC","AJAY SALVI","BUY",{"v":80000,"d":"80,000"},54.09,"BSE"]
["2023-08-04",522001,"CRANEX","AJAY SALVI","BUY",{"v":40000,"d":"40,000"},51.22,"BSE"]
["2023-08-04",538715,"DHABRIYA","MERU INVESTMENT FUND PCC- CELL 1","SELL",{"v":120000,"d":"120,000"},269.7,"BSE"]
["2023-08-04",538715,"DHABRIYA","MAHALAXMI BROKERAGE (INDIA) PRIVATE LIMITED","SELL",{"v":67653,"d":"67,653"},269.7,"BSE"]
["2023-08-04",538715,"DHABRIYA","MAVEN INDIA FUND","SELL",{"v":165557,"d":"165,557"},269.7,"BSE"]
{"$rows_left_out":129}
{"sheet":"Call Tracker (Equity & F&O)","index":5,"n_rows":286,"n_cols":18,"rows_kept":286}
[]
[]
[]
[]
[{"$nulls":12},"Back To Main Page"]
["Retail Research Technical Calls & Fundamental Performance Report for the month of August-2023"]
[{"$nulls":12},{"$f":"Main!B10","v":"2023-08-07"}]
[null,"Positional  Call"]
["Sr.no","Date",null,"Company","Rec","Rec Price","Stop Loss***","Call Closed At","Target","Remark","Profit / Loss per Share","All charges","Net Gain / Loss  %","Status","Closed Date","Market Closing Price"]
[1,"2023-06-15",null,"ATUL","Accu",6800,6400,7150,"7400-7600","Profit of Rs.350/-",{"$f":"H10-F10","v":350},{"$f":"(F10*-0.3)/100","v":{"v":-20.4,"d":"-20.40"}},{"$f":"(K10+L10)/F10","v":{"v":0.04847058823529412,"d":"4.85%"}},"Successful","2023-08-01"," ",null,"H"]
[2,"2023-07-04",null,"BIOCON","Accu","250-260",234,null,"300-320","Open",{"$nulls":5},{"$f":"VLOOKUP(D11,'MidCap Intra'!B58:C557,2,0)","v":253.55},null,"H"]
[3,"2023-07-05",null,"GMMPFAUDLR","Accu","1445-1485",1395,null,"1580-1640","Open",{"$nulls":5},{"$f":"VLOOKUP(D12,'MidCap Intra'!B59:C558,2,0)","v":{"v":1452.7,"d":"1452.70"}},null,"N"]
[4,"2023-07-12",null,"HDFCBANK","Accu","1595-1655",1540,null,"1800-1900","Open",{"$nulls":5},{"$f":"VLOOKUP(D13,'MidCap Intra'!B63:C562,2,0)","v":{"v":1652.2,"d":"1652.20"}},null,"H"]
[5,"2023-07-13",null,"JAMNAAUTO","Accu","105.5-109.5",102,null,"118-122","Open",{"$nulls":5},{"$f":"VLOOKUP(D14,'MidCap Intra'!B64:C563,2,0)","v":{"v":111.1,"d":"111.10"}},null,"H"]
[6,"2023-07-18",null,"SBIN","Accu","564-594",548,null,"640-660","Open",{"$nulls":5},{"$f":"VLOOKUP(D15,'MidCap Intra'!B67:C566,2,0)","v":{"v":573.3,"d":"573.30"}},null,"H"]
[7,"2023-07-18",null,"REDINGTON","Accu",178,168,170,"195-205","Loss of Rs.8/-",{"$f":"H16-F16","v":-8},{"$f":"(F16*-0.3)/100","v":{"v":-0.534,"d":"-0.53"}},{"$f":"(K16+L16)/F16","v":{"v":-0.0479438202247191,"d":"-4.79%"}},"Unsuccessful","2023-08-02",null,null,"H"]
[8,"2023-07-26",null,"JKPAPER","Accu",326,299,345.5,"350-370","Profit of Rs.19.5/-",{"$f":"H17-F17","v":19.5},{"$f":"(F17*-0.3)/100","v":{"v":-0.978,"d":"-0.98"}},{"$f":"(K17+L17)/F17","v":{"v":0.05681595092024539,"d":"5.68%"}},"Successful","2023-08-02",null,null,"H"]
[9,"2023-07-26",null,"BANKBARODA","Accu","191-197",185,null,"215-225","Open",{"$nulls":5},{"$f":"VLOOKUP(D18,'MidCap Intra'!B70:C569,2,0)","v":{"$error":"#N/A"}},null,"H"]
[10,"2023-07-26",null,"RVNL","Accu","121-134",118,null,"145-150","Open",{"$nulls":5},{"$f":"VLOOKUP(D19,'MidCap Intra'!B71:C570,2,0)","v":122.65},null,"H"]
[11,"2023-07-27",null,"INDUSTOWER","Accu","170-177",164,null,"190-200","Open",{"$nulls":5},{"$f":"VLOOKUP(D20,'MidCap Intra'!B72:C571,2,0)","v":{"v":173,"d":"173.00"}},null,"H"]
{"$rows_left_out":253}